{"text_format":"1","workbook":"xlsx","n_sheets":3,"sheets":["Setup","DrawPrep","Draw"],"not_rendered":{"charts":0,"images":0,"macros":1,"external_links":0,"defined_names":1,"comments":1,"pivot_tables":0},"unopened":[],"bounds":{"document_bytes":16777216,"sheet_cells":100000,"rows_first":2000,"rows_last":500,"rows_between":2000,"halvings":0,"cell_chars":16384,"cell_head_chars":4096},"cells_cut":0,"cells_raw":0,"read":"whole","date_system":"1900"}

{"sheet":"Setup","index":0,"n_rows":34,"n_cols":12,"rows_kept":34,"cut":false,"hidden":false,"merged":[[1,3,2,3],[4,3,7,3]]}
["ΤΟΥΡΝΟΥΑ 32άρι ταμπλό",null,null,"Θέσεις","seed",null,null,0,"seed","space pos","Index","Value"]
[null,null,null,"3-4",{"$f":"VALUE(LEFT(F2,1))","v":4},"4 3",null,{"$f":"IF(I2=\"-\",\"-\",IF(I2>0,H1+1,0))","v":0},{"$f":"IF(J2>0,VALUE(MID($A$32,1,J2-1)),\"-\")","v":0},{"$f":"IF(LEN($A$32)>1,FIND(\" \",$A$32,1),0)","v":2},0,0]
["Διοργανωτής: ","Α΄ ΕΝΩΣΗ",null,null,{"$f":"VALUE(RIGHT(F2,1))","v":3},null,null,0,{"$f":"IF(J3>0,VALUE(MID($A$32,J2+1,J3-J2-1)),\"-\")","v":0},{"$f":"IF(AND(J2>0,LEN($A$32)>J2+1),FIND(\" \",$A$32,J2+1),0)","v":4},0,0]
["Τίτλος Τουρνουά: ","1ο Ε3",null,"Θέσεις","seed",null,null,0,0,6,0,0]
[null,null,null,"5-8",{"$f":"TRIM(LEFT(F5,(FIND(\" \",F5,1)-1)))","v":"6"},"6 7 5 8",null,0,0,8,0,0]
["Έδρα αγώνων: ",null,null,null,{"$f":"TRIM(MID(F5,(FIND(\" \",F5,1)),FIND(\" \",F5,(FIND(\" \",F5,1)+1))-(FIND(\" \",F5,1))))","v":"7"},null,null,0,0,10,0,0]
["Κατηγορίες: ","Α12",null,null,{"$f":"TRIM(MID(F5, (FIND(\" \",F5,(FIND(\" \",F5,1)+1))+1), (FIND(\" \",F5,(FIND(\" \",F5,(FIND(\" \",F5,1)+1))+1)))-(FIND(\" \",F5,(FIND(\" \",F5,1)+1))+1)))","v":"5"},null,null,0,0,12,0,0]
["Έναρξη: ","15",null,null,{"$f":"TRIM(RIGHT(F5,LEN(F5)-(FIND(\" \",F5,(FIND(\" \",F5,(FIND(\" \",F5,1)+1))+1)))))","v":"8"},null,null,0,0,14,0,0]
["Λήξη: ","16 ΜΑΡ  2014",null,null,null,null,null,0,0,16,0,0]
["Επιδιατητής: ","ΠΕΤΡΙΔΗΣ  ΜΑΝΟΣ",null,null,null,null,null,0,0,18,0,0]
["Τηλέφωνο επιδ: ",null,null,null,null,null,null,0,{"$f":"IF(J11>0,VALUE(MID($A$32,J10+1,J11-J10-1)),\"-\")","v":0},20,0,0]
[null,null,null,null,null,null,null,{"$f":"IF(I12=\"-\",\"-\",IF(I12>0,H11+1,0))","v":0},0,22,0,0]
[null,null,null,null,null,null,null,1,1,24,1,1]
[null,null,null,null,null,null,null,2,2,26,2,2]
[null,null,null,null,null,null,null,3,3,28,3,3]
[null,null,null,null,null,null,null,4,4,30,4,4]
[null,{"$f":"\"(\"&COUNTBLANK(DrawPrep!D3:D34)&\")\"","v":"(11)"},null,null,null,null,null,5,5,32,5,5]
["Πλήθος bye (0-15): ",{"$f":"COUNTBLANK(DrawPrep!D3:D34)","v":11},null,null,null,null,null,6,6,34,6,6]
["Αριθμός θέσεων seeded: ",8,null,null,null,null,null,7,7,36,7,7]
[null,null,null,null,null,null,null,8,8,38,8,8]
{"$rows_left_out":15}
{"sheet":"DrawPrep","index":1,"n_rows":43,"n_cols":10,"rows_kept":43,"cut":false,"hidden":false,"merged":[[36,1,36,3],[0,0,0,6]]}
[{"$f":"Setup!$B$3 & \", \" & Setup!$B$4 & \", \" & Setup!$B$6 & \", \" & Setup!$B$8 & \"-\" & Setup!$B$9","v":"Α΄ ΕΝΩΣΗ, 1ο Ε3, , 15-16 ΜΑΡ  2014"},null,null,null,null,null,null,{"$f":"Setup!B7","v":"Α12"}]
["α/α","από","Α.Μ.","Ονοματεπώνυμο","Σύλλογος","βαθμοί","Τηλέφωνο","Υπογραφή","SortPts","Rnd"]
[1,null,30766,"ΤΕΡΛΕΜΕΣ ΚΩΝΣΤΑΝΤΙΝΟΣ","Πανθρακικός ΟΑ Κομοτην",57.5,null,null,{"$f":"IF(D3>\" \",F3+J3,0)","v":57.500965186432822},9.651864328251294E-4]
[2,null,30999,"ΠΑΦΗΣ ΚΩΝΣΤΑΝΤΙΝΟΣ","Πανθρακικός ΟΑ Κομοτην",51,null,null,51.002546695297269,2.5466952972695847E-3]
[3,null,31428,"ΚΩΣΤΙΔΗΣ  ΗΛΙΑΣ","ΣΕΡΑΪΚΟΣ Ο.Α",15.5,null,null,15.502707824371338,2.7078243713387529E-3]
[4,null,33325,"ΤΣΑΤΣΟΥΛΗΣ  ΑΘΑΝΑΣΙΟΣ","Ο.Α.ΞΑΝΘΗΣ",15.5,null,null,15.502450308540059,2.4503085400590678E-3]
[5,null,31426,"ΠΑΠΑΝΙΚΟΣ  ΑΛΚΙΒΙΑΔΗΣ","Σ.Α.ΣΕΡΡΩΝ",15.5,null,null,15.500686290939512,6.8629093951298021E-4]
[6,null,33289,"ΒΛΑΧΟΣ  ΚΩΝ/ΝΟΣ","Σ.Α.ΣΕΡΡΩΝ",12.5,null,null,12.504466367578473,4.4663675784725717E-3]
[7,null,29066,"ΚΟΥΣΟΥΝΑΔΗΣ ΘΕΟΔΩΡΟΣ","ΜΑΚΕΔΟΝΙΚΟΣ",8,null,null,8.0008501944160457,8.5019441604494207E-4]
[8,null,30767,"ΤΡΙΑΝΤΑΦΥΛΛΙΔΗΣ ΑΒΡΑΑΜ","Πανθρακικός ΟΑ Κομοτην",5.5,null,null,5.5023404362679704,2.3404362679704709E-3]
[9,null,33107,"ΚΑΛΠΑΤΖΙΔΗΣ  ΗΡΑΚΛΗΣ","ΣΕΡΑΪΚΟΣ Ο.Α",5.5,null,null,5.5018850788576374,1.8850788576375295E-3]
[10,null,33558,"ΒΑΣΙΛΕΙΑΔΗΣ ΙΩΑΝΝΗΣ","Πανθρακικός ΟΑ Κομοτην",4.5,null,null,4.5031799661007055,3.1799661007058939E-3]
[11,null,34543,"ΧΑΡΑΛΑΜΠΙΔΗΣ ΘΕΟΦΙΛΟΣ","ΤΙΤΑΝΕΣ-ΝΕΑΣ ΠΕΡΑΜΟΥ",4,null,null,4.0032548309457452,3.2548309457454587E-3]
[12,null,33503,"ΚΟΒΑΝΙΔΗΣ  ΠΕΡΙΚΛΗΣ","Α.Ο.Α.ΑΛΕΞΑΝ/ΛΗΣ",3.5,null,null,3.5030740824778097,3.0740824778097142E-3]
[13,null,31344,"ΠΑΠΑΧΑΡΑΛΑΜΠΙΔΗΣ  ΠΑΡΑΣΚΕΥΑΣ","ΤΙΤΑΝΕΣ-ΝΕΑΣ ΠΕΡΑΜΟΥ",3.5,null,null,3.5027512854779346,2.751285477934429E-3]
[14,null,35176,"ΖΕΡΒΙΔΗΣ  ΑΝΤΩΝΙΟΣ","Σ.Α.ΣΕΡΡΩΝ",1.5,null,null,1.503040309432973,3.0403094329729541E-3]
[15,null,33472,"ΠΑΠΑΝΔΡΟΥΔΗΣ  ΜΙΛΤΙΑΔΗΣ","Α.Ο.Α.ΑΛΕΞΑΝ/ΛΗΣ",1.5,null,null,1.5023509251954208,2.3509251954208815E-3]
[16,null,34118,"ΚΗΤΖΙΔΗΣ  ΣΠΥΡΙΔΩΝΑΣ","Πανθρακικός ΟΑ Κομοτην",0,null,null,3.0776965537119552E-3,3.0776965537119552E-3]
[17,null,34765,"ΙΑΚΩΒΑΚΗΣ  ΤΗΛΕΜΑΧΟΣ","Α.Ο.Α.ΑΛΕΞΑΝ/ΛΗΣ",0,null,null,2.1577405999652468E-3,2.1577405999652468E-3]
[18,null,33104,"ΠΥΡΙΝΗΣ  ΒΑΣΙΛΕΙΟΣ","ΣΕΡΑΪΚΟΣ Ο.Α",0,null,null,2.1082523049240462E-3,2.1082523049240462E-3]
{"$rows_left_out":24}
{"sheet":"Draw","index":2,"n_rows":67,"n_cols":20,"rows_kept":67,"cut":false,"hidden":false,"merged":[[0,0,0,17],[2,9,2,11],[41,17,41,19]]}
[{"$f":"Setup!B3 & \", \" & Setup!B4 & \", \" & Setup!B6 & \", \" & Setup!B8 & \"-\" & Setup!B9","v":"Α΄ ΕΝΩΣΗ, 1ο Ε3, , 15-16 ΜΑΡ  2014"},null,null,null,null,null,null,null,null,null,null,null,null,null,null,null,null,null,null,{"$f":"Setup!B7","v":"Α12"}]
[null,{"$f":"Setup!B18","v":11}]
[null,null,null,null,null,null,null,null,null,32,null,null,null,16,null,8,null,4,null,"2 & w"]
["α/α",null,"ByeOrder","ByeSum","ByeCnt","από","seed","Pts","Α.Μ.","Ονοματεπώνυμο","επώνυμο","Σύλλογος"]
[1,1,null,null,0,{"$f":"IF(NOT($G5=\"-\"),VLOOKUP($G5,DrawPrep!$A$3:$F$34,2,FALSE),\"\")","v":0},1,{"$f":"IF($G5>0,VLOOKUP($G5,DrawPrep!$A$3:$F$34,6,FALSE),0)","v":57.5},{"$f":"IF(Setup!$B$24=\"#\",0,IF($G5>0,VLOOKUP($G5,DrawPrep!$A$3:$F$34,3,FALSE),0))","v":30766},{"$f":"IF($I5>0,VLOOKUP($I5,DrawPrep!$C$3:$F$34,2,FALSE),\"bye\")","v":"ΤΕΡΛΕΜΕΣ ΚΩΝΣΤΑΝΤΙΝΟΣ"},{"$f":"IF($I5>0,LEFT(J5,FIND(\" \",J5)-1),\"\")","v":"ΤΕΡΛΕΜΕΣ"},{"$f":"IF($I5>0,VLOOKUP($I5,DrawPrep!$C$3:$F$34,3,FALSE),\"\")","v":"Πανθρακικός ΟΑ Κομοτην"},1,{"$f":"UPPER(IF($A$2=\"R\",IF(OR(M5=1,M5=\"a\"),I5,IF(OR(M5=2,M5=\"b\"),I6,\"\")),IF(OR(M5=1,M5=\"1\"),K5,IF(OR(M5=2,M5=\"b\"),K6,\"\"))))","v":"ΤΕΡΛΕΜΕΣ"}]
[2,{"$f":"1-D6+8","v":8},{"$f":"B5","v":1},{"$f":"E6","v":1},{"$f":"IF($B$2>=C6,1,0)","v":1},{"$f":"IF(NOT($G6=\"-\"),VLOOKUP($G6,DrawPrep!$A$3:$F$34,2,FALSE),\"\")","v":""},{"$f":"IF($B$2>=C6,\"-\",VLOOKUP($B6,Setup!$K$2:$L$33,2,FALSE))","v":"-"},{"$f":"IF(NOT($G6=\"-\"),VLOOKUP($G6,DrawPrep!$A$3:$F$34,6,FALSE),0)","v":0},{"$f":"IF(Setup!$B$24=\"#\",0,IF(NOT($G6=\"-\"),VLOOKUP($G6,DrawPrep!$A$3:$F$34,3,FALSE),0))","v":0},{"$f":"IF($I6>0,VLOOKUP($I6,DrawPrep!$C$3:$F$34,2,FALSE),\"bye\")","v":"bye"},{"$f":"IF($I6>0,LEFT(J6,FIND(\" \",J6)-1),\"\")","v":""},{"$f":"IF($I6>0,VLOOKUP($I6,DrawPrep!$C$3:$F$34,3,FALSE),\"\")","v":""},null,null,1,{"$f":"UPPER(IF($A$2=\"R\",IF(OR(O6=1,O6=\"a\"),N5,IF(OR(O6=2,O6=\"b\"),N7,\"\")),IF(OR(O6=1,O6=\"a\"),N5,IF(OR(O6=2,O6=\"b\"),N7,\"\"))))","v":"ΤΕΡΛΕΜΕΣ"}]
[3,{"$f":"2-D7+8","v":9},null,{"$f":"D6+E7","v":1},0,{"$f":"IF(NOT($G7=\"-\"),VLOOKUP($G7,DrawPrep!$A$3:$F$34,2,FALSE),\"\")","v":0},18,{"$f":"IF($G7>0,VLOOKUP($G7,DrawPrep!$A$3:$F$34,6,FALSE),0)","v":0},{"$f":"IF(Setup!$B$24=\"#\",0,IF($G7>0,VLOOKUP($G7,DrawPrep!$A$3:$F$34,3,FALSE),0))","v":33104},{"$f":"IF($I7>0,VLOOKUP($I7,DrawPrep!$C$3:$F$34,2,FALSE),\"bye\")","v":"ΠΥΡΙΝΗΣ  ΒΑΣΙΛΕΙΟΣ"},{"$f":"IF($I7>0,LEFT(J7,FIND(\" \",J7)-1),\"\")","v":"ΠΥΡΙΝΗΣ"},{"$f":"IF($I7>0,VLOOKUP($I7,DrawPrep!$C$3:$F$34,3,FALSE),\"\")","v":"ΣΕΡΑΪΚΟΣ Ο.Α"},2,{"$f":"UPPER(IF($A$2=\"R\",IF(OR(M7=1,M7=\"a\"),I7,IF(OR(M7=2,M7=\"b\"),I8,\"\")),IF(OR(M7=1,M7=\"a\"),K7,IF(OR(M7=2,M7=\"b\"),K8,\"\"))))","v":"ΔΡΟΣΟΣ"},null,"40 40"]
[4,{"$f":"3-D8+8","v":10},15,{"$f":"D7+E8","v":1},{"$f":"IF($B$2>=C8,1,0)","v":0},{"$f":"IF(NOT($G8=\"-\"),VLOOKUP($G8,DrawPrep!$A$3:$F$34,2,FALSE),\"\")","v":0},19,{"$f":"IF(NOT($G8=\"-\"),VLOOKUP($G8,DrawPrep!$A$3:$F$34,6,FALSE),0)","v":0},{"$f":"IF(Setup!$B$24=\"#\",0,IF(NOT($G8=\"-\"),VLOOKUP($G8,DrawPrep!$A$3:$F$34,3,FALSE),0))","v":27139},{"$f":"IF($I8>0,VLOOKUP($I8,DrawPrep!$C$3:$F$34,2,FALSE),\"bye\")","v":"ΔΡΟΣΟΣ  ΒΑΣΙΛΕΙΟΣ"},"ΔΡΟΣΟΣ",{"$f":"IF($I8>0,VLOOKUP($I8,DrawPrep!$C$3:$F$34,3,FALSE),\"\")","v":"Α.Ο.ΧΡΥΣΟΥΠΟΛΗΣ"},null,"53 41",null,null,1,{"$f":"UPPER(IF($A$2=\"R\",IF(OR(Q8=1,Q8=\"a\"),P6,IF(OR(Q8=2,Q8=\"b\"),P10,\"\")),IF(OR(Q8=1,Q8=\"a\"),P6,IF(OR(Q8=2,Q8=\"b\"),P10,\"\"))))","v":"ΤΕΡΛΕΜΕΣ"}]
[5,{"$f":"4-D9+8","v":11},null,1,0,{"$f":"IF(NOT($G9=\"-\"),VLOOKUP($G9,DrawPrep!$A$3:$F$34,2,FALSE),\"\")","v":0},21,{"$f":"IF($G9>0,VLOOKUP($G9,DrawPrep!$A$3:$F$34,6,FALSE),0)","v":0},{"$f":"IF(Setup!$B$24=\"#\",0,IF($G9>0,VLOOKUP($G9,DrawPrep!$A$3:$F$34,3,FALSE),0))","v":34931},{"$f":"IF($I9>0,VLOOKUP($I9,DrawPrep!$C$3:$F$34,2,FALSE),\"bye\")","v":"ΨΑΡΟΥΔΑΚΗΣ  ΒΑΣΙΛΗΣ"},"ΨΑΡΟΥΔΑΚΗΣ",{"$f":"IF($I9>0,VLOOKUP($I9,DrawPrep!$C$3:$F$34,3,FALSE),\"\")","v":"ΜΑΚΕΔΟΝΙΚΟΣ"},1,{"$f":"UPPER(IF($A$2=\"R\",IF(OR(M9=1,M9=\"a\"),I9,IF(OR(M9=2,M9=\"b\"),I10,\"\")),IF(OR(M9=1,M9=\"a\"),K9,IF(OR(M9=2,M9=\"b\"),K10,\"\"))))","v":"ΨΑΡΟΥΔΑΚΗΣ"},null,null,null,"42 40"]
[6,{"$f":"5-D10+8","v":11},9,2,{"$f":"IF($B$2>=C10,1,0)","v":1},{"$f":"IF(NOT($G10=\"-\"),VLOOKUP($G10,DrawPrep!$A$3:$F$34,2,FALSE),\"\")","v":""},{"$f":"IF($B$2>=C10,\"-\",VLOOKUP($B10,Setup!$K$2:$L$33,2,FALSE))","v":"-"},{"$f":"IF(NOT($G10=\"-\"),VLOOKUP($G10,DrawPrep!$A$3:$F$34,6,FALSE),0)","v":0},{"$f":"IF(Setup!$B$24=\"#\",0,IF(NOT($G10=\"-\"),VLOOKUP($G10,DrawPrep!$A$3:$F$34,3,FALSE),0))","v":0},{"$f":"IF($I10>0,VLOOKUP($I10,DrawPrep!$C$3:$F$34,2,FALSE),\"bye\")","v":"bye"},"",{"$f":"IF($I10>0,VLOOKUP($I10,DrawPrep!$C$3:$F$34,3,FALSE),\"\")","v":""},null,null,2,{"$f":"UPPER(IF($A$2=\"R\",IF(OR(O10=1,O10=\"a\"),N9,IF(OR(O10=2,O10=\"b\"),N11,\"\")),IF(OR(O10=1,O10=\"a\"),N9,IF(OR(O10=2,O10=\"b\"),N11,\"\"))))","v":"ΚΟΥΣΟΥΝΑΔΗΣ"}]
[7,{"$f":"6-D11+8","v":11},{"$f":"B12","v":6},3,{"$f":"IF($B$2>=C11,1,0)","v":1},{"$f":"IF(NOT($G11=\"-\"),VLOOKUP($G11,DrawPrep!$A$3:$F$34,2,FALSE),\"\")","v":""},{"$f":"IF($B$2>=C11,\"-\",VLOOKUP($B11,Setup!$K$2:$L$33,2,FALSE))","v":"-"},{"$f":"IF(NOT($G11=\"-\"),VLOOKUP($G11,DrawPrep!$A$3:$F$34,6,FALSE),0)","v":0},{"$f":"IF(Setup!$B$24=\"#\",0,IF(NOT($G11=\"-\"),VLOOKUP($G11,DrawPrep!$A$3:$F$34,3,FALSE),0))","v":0},{"$f":"IF($I11>0,VLOOKUP($I11,DrawPrep!$C$3:$F$34,2,FALSE),\"bye\")","v":"bye"},"",{"$f":"IF($I11>0,VLOOKUP($I11,DrawPrep!$C$3:$F$34,3,FALSE),\"\")","v":""},2,{"$f":"UPPER(IF($A$2=\"R\",IF(OR(M11=1,M11=\"a\"),I11,IF(OR(M11=2,M11=\"b\"),I12,\"\")),IF(OR(M11=1,M11=\"a\"),K11,IF(OR(M11=2,M11=\"b\"),K12,\"\"))))","v":"ΚΟΥΣΟΥΝΑΔΗΣ"},null,"40 40"]
[8,{"$f":"VALUE(Setup!E5)","v":6},null,3,0,{"$f":"IF(NOT($G12=\"-\"),VLOOKUP($G12,DrawPrep!$A$3:$F$34,2,FALSE),\"\")","v":0},7,{"$f":"IF($G12>0,VLOOKUP($G12,DrawPrep!$A$3:$F$34,6,FALSE),0)","v":8},{"$f":"IF(Setup!$B$24=\"#\",0,IF($G12>0,VLOOKUP($G12,DrawPrep!$A$3:$F$34,3,FALSE),0))","v":29066},{"$f":"IF($I12>0,VLOOKUP($I12,DrawPrep!$C$3:$F$34,2,FALSE),\"bye\")","v":"ΚΟΥΣΟΥΝΑΔΗΣ ΘΕΟΔΩΡΟΣ"},"ΚΟΥΣΟΥΝΑΔΗΣ",{"$f":"IF($I12>0,VLOOKUP($I12,DrawPrep!$C$3:$F$34,3,FALSE),\"\")","v":"ΜΑΚΕΔΟΝΙΚΟΣ"},null,null,null,null,null,null,1,{"$f":"UPPER(IF($A$2=\"R\",IF(OR(S12=1,S12=\"a\"),R8,IF(OR(S12=2,S12=\"b\"),R16,\"\")),IF(OR(S12=1,S12=\"a\"),R8,IF(OR(S12=2,S12=\"b\"),R16,\"\"))))","v":"ΤΕΡΛΕΜΕΣ"}]
[9,{"$f":"VALUE(Setup!E2)","v":4},null,3,0,{"$f":"IF(NOT($G13=\"-\"),VLOOKUP($G13,DrawPrep!$A$3:$F$34,2,FALSE),\"\")","v":0},3,{"$f":"IF($G13>0,VLOOKUP($G13,DrawPrep!$A$3:$F$34,6,FALSE),0)","v":15.5},{"$f":"IF(Setup!$B$24=\"#\",0,IF($G13>0,VLOOKUP($G13,DrawPrep!$A$3:$F$34,3,FALSE),0))","v":31428},{"$f":"IF($I13>0,VLOOKUP($I13,DrawPrep!$C$3:$F$34,2,FALSE),\"bye\")","v":"ΚΩΣΤΙΔΗΣ  ΗΛΙΑΣ"},"ΚΩΣΤΙΔΗΣ",{"$f":"IF($I13>0,VLOOKUP($I13,DrawPrep!$C$3:$F$34,3,FALSE),\"\")","v":"ΣΕΡΑΪΚΟΣ Ο.Α"},1,{"$f":"UPPER(IF($A$2=\"R\",IF(OR(M13=1,M13=\"a\"),I13,IF(OR(M13=2,M13=\"b\"),I14,\"\")),IF(OR(M13=1,M13=\"a\"),K13,IF(OR(M13=2,M13=\"b\"),K14,\"\"))))","v":"ΚΩΣΤΙΔΗΣ"},null,null,null,null,null,"64 61"]
[10,{"$f":"7-D14+8","v":11},{"$f":"B13","v":4},4,{"$f":"IF($B$2>=C14,1,0)","v":1},{"$f":"IF(NOT($G14=\"-\"),VLOOKUP($G14,DrawPrep!$A$3:$F$34,2,FALSE),\"\")","v":""},{"$f":"IF($B$2>=C14,\"-\",VLOOKUP($B14,Setup!$K$2:$L$33,2,FALSE))","v":"-"},{"$f":"IF(NOT($G14=\"-\"),VLOOKUP($G14,DrawPrep!$A$3:$F$34,6,FALSE),0)","v":0},{"$f":"IF(Setup!$B$24=\"#\",0,IF(NOT($G14=\"-\"),VLOOKUP($G14,DrawPrep!$A$3:$F$34,3,FALSE),0))","v":0},{"$f":"IF($I14>0,VLOOKUP($I14,DrawPrep!$C$3:$F$34,2,FALSE),\"bye\")","v":"bye"},"",{"$f":"IF($I14>0,VLOOKUP($I14,DrawPrep!$C$3:$F$34,3,FALSE),\"\")","v":""},null,null,1,{"$f":"UPPER(IF($A$2=\"R\",IF(OR(O14=1,O14=\"a\"),N13,IF(OR(O14=2,O14=\"b\"),N15,\"\")),IF(OR(O14=1,O14=\"a\"),N13,IF(OR(O14=2,O14=\"b\"),N15,\"\"))))","v":"ΚΩΣΤΙΔΗΣ"}]
[11,{"$f":"8-D15+8","v":12},null,4,0,{"$f":"IF(NOT($G15=\"-\"),VLOOKUP($G15,DrawPrep!$A$3:$F$34,2,FALSE),\"\")","v":0},16,{"$f":"IF($G15>0,VLOOKUP($G15,DrawPrep!$A$3:$F$34,6,FALSE),0)","v":0},{"$f":"IF(Setup!$B$24=\"#\",0,IF($G15>0,VLOOKUP($G15,DrawPrep!$A$3:$F$34,3,FALSE),0))","v":34118},{"$f":"IF($I15>0,VLOOKUP($I15,DrawPrep!$C$3:$F$34,2,FALSE),\"bye\")","v":"ΚΗΤΖΙΔΗΣ  ΣΠΥΡΙΔΩΝΑΣ"},"ΚΗΤΖΙΔΗΣ",{"$f":"IF($I15>0,VLOOKUP($I15,DrawPrep!$C$3:$F$34,3,FALSE),\"\")","v":"Πανθρακικός ΟΑ Κομοτην"},2,{"$f":"UPPER(IF($A$2=\"R\",IF(OR(M15=1,M15=\"a\"),I15,IF(OR(M15=2,M15=\"b\"),I16,\"\")),IF(OR(M15=1,M15=\"a\"),K15,IF(OR(M15=2,M15=\"b\"),K16,\"\"))))","v":"ΠΑΠΑΧΑΡΑΛΑΜΠΙΔΗΣ"},null,"40 41"]
[12,{"$f":"9-D16+8","v":13},13,4,{"$f":"IF($B$2>=C16,1,0)","v":0},{"$f":"IF(NOT($G16=\"-\"),VLOOKUP($G16,DrawPrep!$A$3:$F$34,2,FALSE),\"\")","v":0},13,{"$f":"IF(NOT($G16=\"-\"),VLOOKUP($G16,DrawPrep!$A$3:$F$34,6,FALSE),0)","v":3.5},{"$f":"IF(Setup!$B$24=\"#\",0,IF(NOT($G16=\"-\"),VLOOKUP($G16,DrawPrep!$A$3:$F$34,3,FALSE),0))","v":31344},{"$f":"IF($I16>0,VLOOKUP($I16,DrawPrep!$C$3:$F$34,2,FALSE),\"bye\")","v":"ΠΑΠΑΧΑΡΑΛΑΜΠΙΔΗΣ  ΠΑΡΑΣΚΕΥΑΣ"},"ΠΑΠΑΧΑΡΑΛΑΜΠΙΔΗΣ",{"$f":"IF($I16>0,VLOOKUP($I16,DrawPrep!$C$3:$F$34,3,FALSE),\"\")","v":"ΤΙΤΑΝΕΣ-ΝΕΑΣ ΠΕΡΑΜΟΥ"},null,"42 40",null,null,2,{"$f":"UPPER(IF($A$2=\"R\",IF(OR(Q16=1,Q16=\"a\"),P14,IF(OR(Q16=2,Q16=\"b\"),P18,\"\")),IF(OR(Q16=1,Q16=\"a\"),P14,IF(OR(Q16=2,Q16=\"b\"),P18,\"\"))))","v":"ΠΑΠΑΝΙΚΟΣ"}]
[13,{"$f":"10-D17+8","v":14},null,4,0,{"$f":"IF(NOT($G17=\"-\"),VLOOKUP($G17,DrawPrep!$A$3:$F$34,2,FALSE),\"\")","v":0},17,{"$f":"IF($G17>0,VLOOKUP($G17,DrawPrep!$A$3:$F$34,6,FALSE),0)","v":0},{"$f":"IF(Setup!$B$24=\"#\",0,IF($G17>0,VLOOKUP($G17,DrawPrep!$A$3:$F$34,3,FALSE),0))","v":34765},{"$f":"IF($I17>0,VLOOKUP($I17,DrawPrep!$C$3:$F$34,2,FALSE),\"bye\")","v":"ΙΑΚΩΒΑΚΗΣ  ΤΗΛΕΜΑΧΟΣ"},"ΙΑΚΩΒΑΚΗΣ",{"$f":"IF($I17>0,VLOOKUP($I17,DrawPrep!$C$3:$F$34,3,FALSE),\"\")","v":"Α.Ο.Α.ΑΛΕΞΑΝ/ΛΗΣ"},1,{"$f":"UPPER(IF($A$2=\"R\",IF(OR(M17=1,M17=\"a\"),I17,IF(OR(M17=2,M17=\"b\"),I18,\"\")),IF(OR(M17=1,M17=\"a\"),K17,IF(OR(M17=2,M17=\"b\"),K18,\"\"))))","v":"ΙΑΚΩΒΑΚΗΣ"},null,null,null,"40 42"]
[14,{"$f":"11-D18+8","v":14},11,5,{"$f":"IF($B$2>=C18,1,0)","v":1},{"$f":"IF(NOT($G18=\"-\"),VLOOKUP($G18,DrawPrep!$A$3:$F$34,2,FALSE),\"\")","v":""},{"$f":"IF($B$2>=C18,\"-\",VLOOKUP($B18,Setup!$K$2:$L$33,2,FALSE))","v":"-"},{"$f":"IF(NOT($G18=\"-\"),VLOOKUP($G18,DrawPrep!$A$3:$F$34,6,FALSE),0)","v":0},{"$f":"IF(Setup!$B$24=\"#\",0,IF(NOT($G18=\"-\"),VLOOKUP($G18,DrawPrep!$A$3:$F$34,3,FALSE),0))","v":0},{"$f":"IF($I18>0,VLOOKUP($I18,DrawPrep!$C$3:$F$34,2,FALSE),\"bye\")","v":"bye"},"",{"$f":"IF($I18>0,VLOOKUP($I18,DrawPrep!$C$3:$F$34,3,FALSE),\"\")","v":""},null,null,2,{"$f":"UPPER(IF($A$2=\"R\",IF(OR(O18=1,O18=\"a\"),N17,IF(OR(O18=2,O18=\"b\"),N19,\"\")),IF(OR(O18=1,O18=\"a\"),N17,IF(OR(O18=2,O18=\"b\"),N19,\"\"))))","v":"ΠΑΠΑΝΙΚΟΣ"}]
[15,{"$f":"12-D19+8","v":14},{"$f":"B20","v":7},6,{"$f":"IF($B$2>=C19,1,0)","v":1},{"$f":"IF(NOT($G19=\"-\"),VLOOKUP($G19,DrawPrep!$A$3:$F$34,2,FALSE),\"\")","v":""},{"$f":"IF($B$2>=C19,\"-\",VLOOKUP($B19,Setup!$K$2:$L$33,2,FALSE))","v":"-"},{"$f":"IF(NOT($G19=\"-\"),VLOOKUP($G19,DrawPrep!$A$3:$F$34,6,FALSE),0)","v":0},{"$f":"IF(Setup!$B$24=\"#\",0,IF(NOT($G19=\"-\"),VLOOKUP($G19,DrawPrep!$A$3:$F$34,3,FALSE),0))","v":0},{"$f":"IF($I19>0,VLOOKUP($I19,DrawPrep!$C$3:$F$34,2,FALSE),\"bye\")","v":"bye"},"",{"$f":"IF($I19>0,VLOOKUP($I19,DrawPrep!$C$3:$F$34,3,FALSE),\"\")","v":""},2,{"$f":"UPPER(IF($A$2=\"R\",IF(OR(M19=1,M19=\"a\"),I19,IF(OR(M19=2,M19=\"b\"),I20,\"\")),IF(OR(M19=1,M19=\"a\"),K19,IF(OR(M19=2,M19=\"b\"),K20,\"\"))))","v":"ΠΑΠΑΝΙΚΟΣ"},null,"40 40 "]
[16,{"$f":"VALUE(Setup!E6)","v":7},null,6,0,{"$f":"IF(NOT($G20=\"-\"),VLOOKUP($G20,DrawPrep!$A$3:$F$34,2,FALSE),\"\")","v":0},5,{"$f":"IF($G20>0,VLOOKUP($G20,DrawPrep!$A$3:$F$34,6,FALSE),0)","v":15.5},{"$f":"IF(Setup!$B$24=\"#\",0,IF($G20>0,VLOOKUP($G20,DrawPrep!$A$3:$F$34,3,FALSE),0))","v":31426},{"$f":"IF($I20>0,VLOOKUP($I20,DrawPrep!$C$3:$F$34,2,FALSE),\"bye\")","v":"ΠΑΠΑΝΙΚΟΣ  ΑΛΚΙΒΙΑΔΗΣ"},"ΠΑΠΑΝΙΚΟΣ",{"$f":"IF($I20>0,VLOOKUP($I20,DrawPrep!$C$3:$F$34,3,FALSE),\"\")","v":"Σ.Α.ΣΕΡΡΩΝ"},null,null,null,null,null,null,2,{"$f":"UPPER(IF($A$2=\"R\",IF(OR(S20=1,S20=\"a\"),T12,IF(OR(S20=2,S20=\"b\"),T28,\"\")),IF(OR(S20=1,S20=\"a\"),T12,IF(OR(S20=2,S20=\"b\"),T28,\"\"))))","v":"ΠΑΦΗΣ"}]
{"$rows_left_out":47}