{"text_format":"1","workbook":"xlsx","n_sheets":3,"sheets":["Setup","DrawPrep","Draw"],"not_rendered":{"charts":0,"images":0,"macros":1,"external_links":0,"defined_names":2,"comments":1,"pivot_tables":0},"unopened":[],"bounds":{"document_bytes":16777216,"sheet_cells":100000,"rows_first":2000,"rows_last":500,"rows_between":2000,"halvings":0,"cell_chars":16384,"cell_head_chars":4096},"cells_cut":0,"cells_raw":0,"read":"whole","date_system":"1900"}

{"sheet":"Setup","index":0,"n_rows":31,"n_cols":8,"rows_kept":31,"cut":false,"hidden":false,"merged":[[1,3,2,3]]}
["ΤΟΥΡΝΟΥΑ 16άρι ταμπλό",null,null,"Θέσεις","seed"]
[null,null,null,"3-4",{"$f":"VALUE(LEFT(F2,1))","v":3},"3 4"]
["Διοργανωτής: ","Α΄ΕΝΩΣΗ",null,null,{"$f":"VALUE(RIGHT(F2,1))","v":4}]
["Τίτλος Τουρνουά: ","1ο Ε3"]
[]
["Έδρα αγώνων: "]
["Κατηγορίες: ","Α14",null,"0 0 0 0 0 0 1 2 3 4 6 5 8 7 10 9 "]
["Έναρξη: ","15",null,"1 2 3 4 "]
["Λήξη: ","16 ΜΑΡ 2014",null,"0 0 0 0 0 0 0 0 0 0 0 0 0 0 0 0 0 0 0 0 0 0 0 0 0 0 0 0 0 0 0 0 0 0 0 0 0 0 0 0  "]
["Επιδιατητής: ","ΠΕΤΡΙΔΗΣ  ΜΑΝΟΣ"]
["Τηλέφωνο επιδ: ",null,null,0,"seed","space pos","Index","Value"]
[null,null,null,{"$f":"IF(E12=\"-\",\"-\",IF(E12>0,D11+1,0))","v":0},{"$f":"IF(F12>0,VALUE(MID($D$7,1,F12-1)),\"-\")","v":0},{"$f":"IF(LEN($D$7)>1,FIND(\" \",$D$7,1),0)","v":2},0,0]
[null,null,null,{"$f":"IF(E13=\"-\",\"-\",IF(E13>0,D12+1,0))","v":0},{"$f":"IF(F13>0,VALUE(MID($D$7,F12+1,F13-F12-1)),\"-\")","v":0},{"$f":"IF(AND(F12>0,LEN($D$7)>F12+1),FIND(\" \",$D$7,F12+1),0)","v":4},0,0]
[null,null,null,{"$f":"IF(E14=\"-\",\"-\",IF(E14>0,D13+1,0))","v":0},0,6,0,0]
[null,null,null,{"$f":"IF(E15=\"-\",\"-\",IF(E15>0,D14+1,0))","v":0},{"$f":"IF(F15>0,VALUE(MID($D$7,F14+1,F15-F14-1)),\"-\")","v":0},8,0,0]
[null,null,null,0,{"$f":"IF(F16>0,VALUE(MID($D$7,F15+1,F16-F15-1)),\"-\")","v":0},10,0,0]
[null,{"$f":"\"(\"&COUNTBLANK(DrawPrep!D3:D18)&\")\"","v":"(6)"},null,0,{"$f":"IF(F17>0,VALUE(MID($D$7,F16+1,F17-F16-1)),\"-\")","v":0},12,0,0]
["Πλήθος bye (0-7): ",{"$f":"COUNTBLANK(DrawPrep!D3:D18)","v":6},null,1,1,14,1,1]
["Αριθμός θέσεων seeded: ",4,null,2,2,16,2,2]
[null,null,null,3,3,18,3,3]
["All - Seeded - NoSeeded: ",{"$f":"CONCATENATE(16-$B$18,\" - \",$B$19,\" - \",16-$B$19-$B$18)","v":"10 - 4 - 6"},null,4,4,20,4,4]
[null,null,null,5,6,22,5,6]
[null,null,null,6,5,24,6,5]
["md  (# για off) ","ok",null,7,8,26,7,8]
[null,null,null,8,7,28,8,7]
[null,null,null,9,10,31,9,10]
[{"$f":"RandUniq(3,4,2)","v":{"$error":"#NAME?"}},null,null,10,9,33,10,9]
[]
[{"$f":"CONCATENATE(LEFT(D9,$B$18*2),LEFT(D8,$B$19*2),RandUniq($B$19+1,16-$B$18,16-$B$19-$B$18),\" \")","v":{"$error":"#NAME?"}}]
[]
[null,null," "]

{"sheet":"DrawPrep","index":1,"n_rows":26,"n_cols":10,"rows_kept":26,"cut":false,"hidden":false,"merged":[[19,1,19,3]]}
[{"$f":"Setup!$B$3 & \", \" & Setup!$B$4 & \", \" & Setup!$B$6 & \", \" & Setup!$B$8 & \"-\" & Setup!$B$9","v":"Α΄ΕΝΩΣΗ, 1ο Ε3, , 15-16 ΜΑΡ 2014"},null,null,null,null,null,null,{"$f":"Setup!$B$7","v":"Α14"}]
["α/α","από","Α.Μ.","Ονοματεπώνυμο","Σύλλογος","βαθμοί","Τηλέφωνο","Υπογραφή","SortPts","Rnd"]
[1,null,27871,"ΠΟΥΛΑΚΗΣ  ΜΙΛΤΙΑΔΗΣ","ΑΛΕΞΑΝΔΡΟΣ ΚΑΒΑΛΑΣ",81,null,null,{"$f":"IF(D3>\" \",F3+J3,0)","v":81.003459368941932},3.4593689419282424E-3]
[2,null,29276,"ΠΑΠΟΥΛΙΑΣ  ΣΩΚΡΑΤΗΣ","Σ.Α.ΣΕΡΡΩΝ",41,null,null,41.003227296924948,3.2272969249446805E-3]
[3,null,30946,"ΚΟΥΡΤΙΔΗΣ  ΙΣΑΑΚ","Α.Ο.Α.ΠΡΩΤΑΘΛΗΤΩΝ",38,null,null,38.002017782855717,2.0177828557178044E-3]
[4,null,33339,"ΠΑΣΧΑΛΙΔΗΣ ΜΑΡΙΟΣ","ΤΙΤΑΝΕΣ-ΝΕΑΣ ΠΕΡΑΜΟΥ",14,null,null,14.004376364769582,4.3763647695831088E-3]
[5,null,29217,"ΠΛΑΤΗΣ  ΚΩΝΣΤΑΝΤΙΝΟΣ","Ο.Α.ΞΑΝΘΗΣ",9,null,null,9.0044010404724695,4.4010404724692869E-3]
[6,null,30434,"ΚΑΣΑΠΗΣ  ΣΤΥΛΙΑΝΟΣ","Ο.Α.ΞΑΝΘΗΣ",9,null,null,9.0043993376812494,4.3993376812489285E-3]
[7,null,29218,"ΠΛΑΤΗΣ  ΕΛΕΥΘΕΡΙΟΣ","Ο.Α.ΞΑΝΘΗΣ",9,null,null,9.0028347714597814,2.8347714597808504E-3]
[8,null,33290,"ΘΟΥΛΙΩΤΗΣ  ΜΙΧΑΛΗΣ","Σ.Α.ΣΕΡΡΩΝ",8,null,null,8.0002552797345974,2.5527973459689196E-4]
[9,null,"32948","ΠΡΑΤΙΚΑΚΗΣ  ΜΑΝΟΣ","Ο.Α.ΞΑΝΘΗΣ","3",null,null,3.0020386459166546,2.038645916654759E-3]
[10,null,35881,"ΛΥΔΑΚΑΚΗΣ  ΔΗΜΗΤΡΙΟΣ","Α.Ο.ΧΡΥΣΟΥΠΟΛΗΣ",0,null,null,7.0167285236181175E-4,7.0167285236181175E-4]
[11,null,null,null,null,null,null,null,0,2.7131334015324526E-3]
[12,null,null,null,null,null,null,null,0,9.6435298076806206E-4]
[13,null,null,null,null,null,null,null,0,3.3198554544700918E-3]
[14,null,null,null,null,null,null,null,0,2.0497313717067682E-3]
[15,null,null,null,null,null,null,null,0,5.7765776189956967E-4]
[16,null,null,null,null,null,null," ",0,1.6348031648273135E-3]
[]
[null,"Walk-over",null,null,"med"]
[null,"α/α","Α.Μ.","Ονοματεπώνυμο","Ν ή Ο",null,null,{"$f":"Setup!$B$10","v":"ΠΕΤΡΙΔΗΣ  ΜΑΝΟΣ"}]
[null,1,29824,"ΧΑΤΖΗΛΙΑΔΗΣ  ΓΕΩΡΓΙΟΣ","Ο"]
[null,2]
[null,3]
[null,4]
[null,5]

{"sheet":"Draw","index":2,"n_rows":44,"n_cols":18,"rows_kept":44,"cut":false,"hidden":false,"merged":[[26,17,26,18],[2,9,2,11],[0,0,0,15]]}
[{"$f":"Setup!B3 & \", \" & Setup!B4 & \", \" & Setup!B6 & \", \" & Setup!B8 & \"-\" & Setup!B9","v":"Α΄ΕΝΩΣΗ, 1ο Ε3, , 15-16 ΜΑΡ 2014"},null,null,null,null,null,null,null,null,null,null,null,null,null,null,null,null,{"$f":"Setup!B7","v":"Α14"}]
[null,{"$f":"Setup!$B$18","v":6}]
[null,null,null,null,null,null,null,null,null,16,null,null,null,8,null,4,null,2]
["α/α",null,"ByeOrder","ByeSum","ByeCnt","από","seed","Pts","Α.Μ.","Ονοματεπώνυμο","επώνυμο","Σύλλογος"]
[1,1,null,null,0,{"$f":"IF(NOT($G5=\"-\"),VLOOKUP($G5,DrawPrep!$A$3:$G$18,2,FALSE),\"\")","v":0},{"$f":"VLOOKUP($B5,Setup!$G$12:$H$27,2,FALSE)","v":1},{"$f":"IF($G5>0,VLOOKUP($G5,DrawPrep!$A$3:$G$18,6,FALSE),0)","v":81},{"$f":"IF(Setup!$B$24=\"#\",0,IF($G5>0,VLOOKUP($G5,DrawPrep!$A$3:$G$18,3,FALSE),0))","v":27871},{"$f":"IF($I5>0,VLOOKUP($I5,DrawPrep!$C$3:$G$18,2,FALSE),\"bye\")","v":"ΠΟΥΛΑΚΗΣ  ΜΙΛΤΙΑΔΗΣ"},{"$f":"IF($I5>0,LEFT(J5,FIND(\" \",J5)-1),\"\")","v":"ΠΟΥΛΑΚΗΣ"},{"$f":"IF($I5>0,VLOOKUP($I5,DrawPrep!$C$3:$G$18,3,FALSE),\"\")","v":"ΑΛΕΞΑΝΔΡΟΣ ΚΑΒΑΛΑΣ"},1,{"$f":"UPPER(IF($A$2=\"R\",IF(OR(M5=1,M5=\"a\"),I5,IF(OR(M5=2,M5=\"b\"),I6,\"\")),IF(OR(M5=1,M5=\"1\"),K5,IF(OR(M5=2,M5=\"b\"),K6,\"\"))))","v":"ΠΟΥΛΑΚΗΣ"}]
[2,{"$f":"1-D6+4","v":4},1,{"$f":"E6","v":1},{"$f":"IF($B$2>=C6,1,0)","v":1},{"$f":"IF(NOT($G6=\"-\"),VLOOKUP($G6,DrawPrep!$A$3:$G$18,2,FALSE),\"\")","v":""},{"$f":"IF($B$2>=C6,\"-\",VLOOKUP($B6,Setup!$G$12:$H$27,2,FALSE))","v":"-"},{"$f":"IF(NOT($G6=\"-\"),VLOOKUP($G6,DrawPrep!$A$3:$G$18,6,FALSE),0)","v":0},{"$f":"IF(Setup!$B$24=\"#\",0,IF(NOT($G6=\"-\"),VLOOKUP($G6,DrawPrep!$A$3:$G$18,3,FALSE),0))","v":0},{"$f":"IF($I6>0,VLOOKUP($I6,DrawPrep!$C$3:$G$18,2,FALSE),\"bye\")","v":"bye"},{"$f":"IF($I6>0,LEFT(J6,FIND(\" \",J6)-1),\"\")","v":""},{"$f":"IF($I6>0,VLOOKUP($I6,DrawPrep!$C$3:$G$18,3,FALSE),\"\")","v":""},null,null,1,{"$f":"UPPER(IF($A$2=\"R\",IF(OR(O6=1,O6=\"a\"),N5,IF(OR(O6=2,O6=\"b\"),N7,\"\")),IF(OR(O6=1,O6=\"a\"),N5,IF(OR(O6=2,O6=\"b\"),N7,\"\"))))","v":"ΠΟΥΛΑΚΗΣ"}]
[3,{"$f":"2-D7+4","v":5},null,{"$f":"D6+E7","v":1},0,{"$f":"IF(NOT($G7=\"-\"),VLOOKUP($G7,DrawPrep!$A$3:$G$18,2,FALSE),\"\")","v":0},{"$f":"VLOOKUP($B7,Setup!$G$12:$H$27,2,FALSE)","v":6},{"$f":"IF($G7>0,VLOOKUP($G7,DrawPrep!$A$3:$G$18,6,FALSE),0)","v":9},{"$f":"IF(Setup!$B$24=\"#\",0,IF($G7>0,VLOOKUP($G7,DrawPrep!$A$3:$G$18,3,FALSE),0))","v":30434},{"$f":"IF($I7>0,VLOOKUP($I7,DrawPrep!$C$3:$G$18,2,FALSE),\"bye\")","v":"ΚΑΣΑΠΗΣ  ΣΤΥΛΙΑΝΟΣ"},"ΚΑΣΑΠΗΣ",{"$f":"IF($I7>0,VLOOKUP($I7,DrawPrep!$C$3:$G$18,3,FALSE),\"\")","v":"Ο.Α.ΞΑΝΘΗΣ"},1,{"$f":"UPPER(IF($A$2=\"R\",IF(OR(M7=1,M7=\"a\"),I7,IF(OR(M7=2,M7=\"b\"),I8,\"\")),IF(OR(M7=1,M7=\"a\"),K7,IF(OR(M7=2,M7=\"b\"),K8,\"\"))))","v":"ΚΑΣΑΠΗΣ"},null,"40 40"]
[4,{"$f":"3-D8+4","v":6},7,1,{"$f":"IF($B$2>=C8,1,0)","v":0},{"$f":"IF(NOT($G8=\"-\"),VLOOKUP($G8,DrawPrep!$A$3:$G$18,2,FALSE),\"\")","v":0},{"$f":"IF($B$2>=C8,\"-\",VLOOKUP($B8,Setup!$G$12:$H$27,2,FALSE))","v":5},{"$f":"IF(NOT($G8=\"-\"),VLOOKUP($G8,DrawPrep!$A$3:$G$18,6,FALSE),0)","v":9},{"$f":"IF(Setup!$B$24=\"#\",0,IF(NOT($G8=\"-\"),VLOOKUP($G8,DrawPrep!$A$3:$G$18,3,FALSE),0))","v":29217},{"$f":"IF($I8>0,VLOOKUP($I8,DrawPrep!$C$3:$G$18,2,FALSE),\"bye\")","v":"ΠΛΑΤΗΣ  ΚΩΝΣΤΑΝΤΙΝΟΣ"},"ΠΛΑΤΗΣ",{"$f":"IF($I8>0,VLOOKUP($I8,DrawPrep!$C$3:$G$18,3,FALSE),\"\")","v":"Ο.Α.ΞΑΝΘΗΣ"},null,"42 41",null,null,1,{"$f":"UPPER(IF($A$2=\"R\",IF(OR(Q8=1,Q8=\"a\"),P6,IF(OR(Q8=2,Q8=\"b\"),P10,\"\")),IF(OR(Q8=1,Q8=\"a\"),P6,IF(OR(Q8=2,Q8=\"b\"),P10,\"\"))))","v":"ΠΟΥΛΑΚΗΣ"}]
[5,{"$f":"VALUE(Setup!E2)","v":3},null,1,0,{"$f":"IF(NOT($G9=\"-\"),VLOOKUP($G9,DrawPrep!$A$3:$G$18,2,FALSE),\"\")","v":0},{"$f":"VLOOKUP($B9,Setup!$G$12:$H$27,2,FALSE)","v":3},{"$f":"IF($G9>0,VLOOKUP($G9,DrawPrep!$A$3:$G$18,6,FALSE),0)","v":38},{"$f":"IF(Setup!$B$24=\"#\",0,IF($G9>0,VLOOKUP($G9,DrawPrep!$A$3:$G$18,3,FALSE),0))","v":30946},{"$f":"IF($I9>0,VLOOKUP($I9,DrawPrep!$C$3:$G$18,2,FALSE),\"bye\")","v":"ΚΟΥΡΤΙΔΗΣ  ΙΣΑΑΚ"},"ΚΟΥΡΤΙΔΗΣ",{"$f":"IF($I9>0,VLOOKUP($I9,DrawPrep!$C$3:$G$18,3,FALSE),\"\")","v":"Α.Ο.Α.ΠΡΩΤΑΘΛΗΤΩΝ"},1,{"$f":"UPPER(IF($A$2=\"R\",IF(OR(M9=1,M9=\"a\"),I9,IF(OR(M9=2,M9=\"b\"),I10,\"\")),IF(OR(M9=1,M9=\"a\"),K9,IF(OR(M9=2,M9=\"b\"),K10,\"\"))))","v":"ΚΟΥΡΤΙΔΗΣ"},null,null,null,"62 62"]
[6,{"$f":"4-D10+4","v":6},{"$f":"IF(Setup!E2=3,3,4)","v":3},2,{"$f":"IF($B$2>=C10,1,0)","v":1},{"$f":"IF(NOT($G10=\"-\"),VLOOKUP($G10,DrawPrep!$A$3:$G$18,2,FALSE),\"\")","v":""},{"$f":"IF($B$2>=C10,\"-\",VLOOKUP($B10,Setup!$G$12:$H$27,2,FALSE))","v":"-"},{"$f":"IF(NOT($G10=\"-\"),VLOOKUP($G10,DrawPrep!$A$3:$G$18,6,FALSE),0)","v":0},{"$f":"IF(Setup!$B$24=\"#\",0,IF(NOT($G10=\"-\"),VLOOKUP($G10,DrawPrep!$A$3:$G$18,3,FALSE),0))","v":0},{"$f":"IF($I10>0,VLOOKUP($I10,DrawPrep!$C$3:$G$18,2,FALSE),\"bye\")","v":"bye"},"",{"$f":"IF($I10>0,VLOOKUP($I10,DrawPrep!$C$3:$G$18,3,FALSE),\"\")","v":""},null,null,1,{"$f":"UPPER(IF($A$2=\"R\",IF(OR(O10=1,O10=\"a\"),N9,IF(OR(O10=2,O10=\"b\"),N11,\"\")),IF(OR(O10=1,O10=\"a\"),N9,IF(OR(O10=2,O10=\"b\"),N11,\"\"))))","v":"ΚΟΥΡΤΙΔΗΣ"}]
[7,{"$f":"5-D11+4","v":6},5,3,{"$f":"IF($B$2>=C11,1,0)","v":1},{"$f":"IF(NOT($G11=\"-\"),VLOOKUP($G11,DrawPrep!$A$3:$G$18,2,FALSE),\"\")","v":""},{"$f":"IF($B$2>=C11,\"-\",VLOOKUP($B11,Setup!$G$12:$H$27,2,FALSE))","v":"-"},{"$f":"IF(NOT($G11=\"-\"),VLOOKUP($G11,DrawPrep!$A$3:$G$18,6,FALSE),0)","v":0},{"$f":"IF(Setup!$B$24=\"#\",0,IF(NOT($G11=\"-\"),VLOOKUP($G11,DrawPrep!$A$3:$G$18,3,FALSE),0))","v":0},{"$f":"IF($I11>0,VLOOKUP($I11,DrawPrep!$C$3:$G$18,2,FALSE),\"bye\")","v":"bye"},"",{"$f":"IF($I11>0,VLOOKUP($I11,DrawPrep!$C$3:$G$18,3,FALSE),\"\")","v":""},2,{"$f":"UPPER(IF($A$2=\"R\",IF(OR(M11=1,M11=\"a\"),I11,IF(OR(M11=2,M11=\"b\"),I12,\"\")),IF(OR(M11=1,M11=\"a\"),K11,IF(OR(M11=2,M11=\"b\"),K12,\"\"))))","v":"ΘΟΥΛΙΩΤΗΣ"},null,"41 42"]
[8,{"$f":"6-D12+4","v":7},null,3,0,{"$f":"IF(NOT($G12=\"-\"),VLOOKUP($G12,DrawPrep!$A$3:$G$18,2,FALSE),\"\")","v":0},{"$f":"VLOOKUP($B12,Setup!$G$12:$H$27,2,FALSE)","v":8},{"$f":"IF($G12>0,VLOOKUP($G12,DrawPrep!$A$3:$G$18,6,FALSE),0)","v":8},{"$f":"IF(Setup!$B$24=\"#\",0,IF($G12>0,VLOOKUP($G12,DrawPrep!$A$3:$G$18,3,FALSE),0))","v":33290},{"$f":"IF($I12>0,VLOOKUP($I12,DrawPrep!$C$3:$G$18,2,FALSE),\"bye\")","v":"ΘΟΥΛΙΩΤΗΣ  ΜΙΧΑΛΗΣ"},"ΘΟΥΛΙΩΤΗΣ",{"$f":"IF($I12>0,VLOOKUP($I12,DrawPrep!$C$3:$G$18,3,FALSE),\"\")","v":"Σ.Α.ΣΕΡΡΩΝ"},null,null,null,null,1,{"$f":"UPPER(IF($A$2=\"R\",IF(OR(Q12=1,Q12=\"a\"),R8,IF(OR(Q12=2,Q12=\"b\"),R16,\"\")),IF(OR(Q12=1,Q12=\"a\"),R8,IF(OR(Q12=2,Q12=\"b\"),R16,\"\"))))","v":"ΠΟΥΛΑΚΗΣ"}]
[9,{"$f":"VALUE(Setup!E3)","v":4},null,3,0,{"$f":"IF(NOT($G13=\"-\"),VLOOKUP($G13,DrawPrep!$A$3:$G$18,2,FALSE),\"\")","v":0},{"$f":"VLOOKUP($B13,Setup!$G$12:$H$27,2,FALSE)","v":4},{"$f":"IF($G13>0,VLOOKUP($G13,DrawPrep!$A$3:$G$18,6,FALSE),0)","v":14},{"$f":"IF(Setup!$B$24=\"#\",0,IF($G13>0,VLOOKUP($G13,DrawPrep!$A$3:$G$18,3,FALSE),0))","v":33339},{"$f":"IF($I13>0,VLOOKUP($I13,DrawPrep!$C$3:$G$18,2,FALSE),\"bye\")","v":"ΠΑΣΧΑΛΙΔΗΣ ΜΑΡΙΟΣ"},"ΠΑΣΧΑΛΙΔΗΣ",{"$f":"IF($I13>0,VLOOKUP($I13,DrawPrep!$C$3:$G$18,3,FALSE),\"\")","v":"ΤΙΤΑΝΕΣ-ΝΕΑΣ ΠΕΡΑΜΟΥ"},1,{"$f":"UPPER(IF($A$2=\"R\",IF(OR(M13=1,M13=\"a\"),I13,IF(OR(M13=2,M13=\"b\"),I14,\"\")),IF(OR(M13=1,M13=\"a\"),K13,IF(OR(M13=2,M13=\"b\"),K14,\"\"))))","v":"ΠΑΣΧΑΛΙΔΗΣ"},null,null,null,"60 63"]
[10,{"$f":"7-D14+4","v":7},{"$f":"IF(Setup!E2=3,4,3)","v":4},4,{"$f":"IF($B$2>=C14,1,0)","v":1},{"$f":"IF(NOT($G14=\"-\"),VLOOKUP($G14,DrawPrep!$A$3:$G$18,2,FALSE),\"\")","v":""},{"$f":"IF($B$2>=C14,\"-\",VLOOKUP($B14,Setup!$G$12:$H$27,2,FALSE))","v":"-"},{"$f":"IF(NOT($G14=\"-\"),VLOOKUP($G14,DrawPrep!$A$3:$G$18,6,FALSE),0)","v":0},{"$f":"IF(Setup!$B$24=\"#\",0,IF(NOT($G14=\"-\"),VLOOKUP($G14,DrawPrep!$A$3:$G$18,3,FALSE),0))","v":0},{"$f":"IF($I14>0,VLOOKUP($I14,DrawPrep!$C$3:$G$18,2,FALSE),\"bye\")","v":"bye"},"",{"$f":"IF($I14>0,VLOOKUP($I14,DrawPrep!$C$3:$G$18,3,FALSE),\"\")","v":""},null,null,1,{"$f":"UPPER(IF($A$2=\"R\",IF(OR(O14=1,O14=\"a\"),N13,IF(OR(O14=2,O14=\"b\"),N15,\"\")),IF(OR(O14=1,O14=\"a\"),N13,IF(OR(O14=2,O14=\"b\"),N15,\"\"))))","v":"ΠΑΣΧΑΛΙΔΗΣ"}]
[11,{"$f":"8-D15+4","v":8},null,4,0,{"$f":"IF(NOT($G15=\"-\"),VLOOKUP($G15,DrawPrep!$A$3:$G$18,2,FALSE),\"\")","v":0},{"$f":"VLOOKUP($B15,Setup!$G$12:$H$27,2,FALSE)","v":7},{"$f":"IF($G15>0,VLOOKUP($G15,DrawPrep!$A$3:$G$18,6,FALSE),0)","v":9},{"$f":"IF(Setup!$B$24=\"#\",0,IF($G15>0,VLOOKUP($G15,DrawPrep!$A$3:$G$18,3,FALSE),0))","v":29218},{"$f":"IF($I15>0,VLOOKUP($I15,DrawPrep!$C$3:$G$18,2,FALSE),\"bye\")","v":"ΠΛΑΤΗΣ  ΕΛΕΥΘΕΡΙΟΣ"},"ΠΛΑΤΗΣ",{"$f":"IF($I15>0,VLOOKUP($I15,DrawPrep!$C$3:$G$18,3,FALSE),\"\")","v":"Ο.Α.ΞΑΝΘΗΣ"},1,{"$f":"UPPER(IF($A$2=\"R\",IF(OR(M15=1,M15=\"a\"),I15,IF(OR(M15=2,M15=\"b\"),I16,\"\")),IF(OR(M15=1,M15=\"a\"),K15,IF(OR(M15=2,M15=\"b\"),K16,\"\"))))","v":"ΠΛΑΤΗΣ"},null,"41 53"]
[12,{"$f":"9-D16+4","v":8},6,5,{"$f":"IF($B$2>=C16,1,0)","v":1},{"$f":"IF(NOT($G16=\"-\"),VLOOKUP($G16,DrawPrep!$A$3:$G$18,2,FALSE),\"\")","v":""},{"$f":"IF($B$2>=C16,\"-\",VLOOKUP($B16,Setup!$G$12:$H$27,2,FALSE))","v":"-"},{"$f":"IF(NOT($G16=\"-\"),VLOOKUP($G16,DrawPrep!$A$3:$G$18,6,FALSE),0)","v":0},{"$f":"IF(Setup!$B$24=\"#\",0,IF(NOT($G16=\"-\"),VLOOKUP($G16,DrawPrep!$A$3:$G$18,3,FALSE),0))","v":0},{"$f":"IF($I16>0,VLOOKUP($I16,DrawPrep!$C$3:$G$18,2,FALSE),\"bye\")","v":"bye"},"",{"$f":"IF($I16>0,VLOOKUP($I16,DrawPrep!$C$3:$G$18,3,FALSE),\"\")","v":""},null,null,null,null,2,{"$f":"UPPER(IF($A$2=\"R\",IF(OR(Q16=1,Q16=\"a\"),P14,IF(OR(Q16=2,Q16=\"b\"),P18,\"\")),IF(OR(Q16=1,Q16=\"a\"),P14,IF(OR(Q16=2,Q16=\"b\"),P18,\"\"))))","v":"ΠΑΠΟΥΛΙΑΣ"}]
[13,{"$f":"10-D17+4","v":9},null,5,0,{"$f":"IF(NOT($G17=\"-\"),VLOOKUP($G17,DrawPrep!$A$3:$G$18,2,FALSE),\"\")","v":0},{"$f":"VLOOKUP($B17,Setup!$G$12:$H$27,2,FALSE)","v":10},{"$f":"IF($G17>0,VLOOKUP($G17,DrawPrep!$A$3:$G$18,6,FALSE),0)","v":0},{"$f":"IF(Setup!$B$24=\"#\",0,IF($G17>0,VLOOKUP($G17,DrawPrep!$A$3:$G$18,3,FALSE),0))","v":35881},{"$f":"IF($I17>0,VLOOKUP($I17,DrawPrep!$C$3:$G$18,2,FALSE),\"bye\")","v":"ΛΥΔΑΚΑΚΗΣ  ΔΗΜΗΤΡΙΟΣ"},"ΛΥΔΑΚΑΚΗΣ",{"$f":"IF($I17>0,VLOOKUP($I17,DrawPrep!$C$3:$G$18,3,FALSE),\"\")","v":"Α.Ο.ΧΡΥΣΟΥΠΟΛΗΣ"},2,{"$f":"UPPER(IF($A$2=\"R\",IF(OR(M17=1,M17=\"a\"),I17,IF(OR(M17=2,M17=\"b\"),I18,\"\")),IF(OR(M17=1,M17=\"a\"),K17,IF(OR(M17=2,M17=\"b\"),K18,\"\"))))","v":"ΠΡΑΤΙΚΑΚΗΣ"},null,null,null,"62 64"]
[14,{"$f":"11-D18+4","v":10},8,5,{"$f":"IF($B$2>=C18,1,0)","v":0},{"$f":"IF(NOT($G18=\"-\"),VLOOKUP($G18,DrawPrep!$A$3:$G$18,2,FALSE),\"\")","v":0},{"$f":"IF($B$2>=C18,\"-\",VLOOKUP($B18,Setup!$G$12:$H$27,2,FALSE))","v":9},{"$f":"IF(NOT($G18=\"-\"),VLOOKUP($G18,DrawPrep!$A$3:$G$18,6,FALSE),0)","v":"3"},{"$f":"IF(Setup!$B$24=\"#\",0,IF(NOT($G18=\"-\"),VLOOKUP($G18,DrawPrep!$A$3:$G$18,3,FALSE),0))","v":"32948"},{"$f":"IF($I18>0,VLOOKUP($I18,DrawPrep!$C$3:$G$18,2,FALSE),\"bye\")","v":"ΠΡΑΤΙΚΑΚΗΣ  ΜΑΝΟΣ"},"ΠΡΑΤΙΚΑΚΗΣ",{"$f":"IF($I18>0,VLOOKUP($I18,DrawPrep!$C$3:$G$18,3,FALSE),\"\")","v":"Ο.Α.ΞΑΝΘΗΣ"},null,"40 42",2,{"$f":"UPPER(IF($A$2=\"R\",IF(OR(O18=1,O18=\"a\"),N17,IF(OR(O18=2,O18=\"b\"),N19,\"\")),IF(OR(O18=1,O18=\"a\"),N17,IF(OR(O18=2,O18=\"b\"),N19,\"\"))))","v":"ΠΑΠΟΥΛΙΑΣ"}]
[15,{"$f":"12-D19+4","v":10},2,6,{"$f":"IF($B$2>=C19,1,0)","v":1},{"$f":"IF(NOT($G19=\"-\"),VLOOKUP($G19,DrawPrep!$A$3:$G$18,2,FALSE),\"\")","v":""},{"$f":"IF($B$2>=C19,\"-\",VLOOKUP($B19,Setup!$G$12:$H$27,2,FALSE))","v":"-"},{"$f":"IF(NOT($G19=\"-\"),VLOOKUP($G19,DrawPrep!$A$3:$G$18,6,FALSE),0)","v":0},{"$f":"IF(Setup!$B$24=\"#\",0,IF(NOT($G19=\"-\"),VLOOKUP($G19,DrawPrep!$A$3:$G$18,3,FALSE),0))","v":0},{"$f":"IF($I19>0,VLOOKUP($I19,DrawPrep!$C$3:$G$18,2,FALSE),\"bye\")","v":"bye"},"",{"$f":"IF($I19>0,VLOOKUP($I19,DrawPrep!$C$3:$G$18,3,FALSE),\"\")","v":""},2,{"$f":"UPPER(IF($A$2=\"R\",IF(OR(M19=1,M19=\"a\"),I19,IF(OR(M19=2,M19=\"b\"),I20,\"\")),IF(OR(M19=1,M19=\"a\"),K19,IF(OR(M19=2,M19=\"b\"),K20,\"\"))))","v":"ΠΑΠΟΥΛΙΑΣ"},null,"42 54 (7)"]
[16,2,null,6,0,{"$f":"IF(NOT($G20=\"-\"),VLOOKUP($G20,DrawPrep!$A$3:$G$18,2,FALSE),\"\")","v":0},{"$f":"VLOOKUP($B20,Setup!$G$12:$H$27,2,FALSE)","v":2},{"$f":"IF($G20>0,VLOOKUP($G20,DrawPrep!$A$3:$G$18,6,FALSE),0)","v":41},{"$f":"IF(Setup!$B$24=\"#\",0,IF($G20>0,VLOOKUP($G20,DrawPrep!$A$3:$G$18,3,FALSE),0))","v":29276},{"$f":"IF($I20>0,VLOOKUP($I20,DrawPrep!$C$3:$G$18,2,FALSE),\"bye\")","v":"ΠΑΠΟΥΛΙΑΣ  ΣΩΚΡΑΤΗΣ"},"ΠΑΠΟΥΛΙΑΣ",{"$f":"IF($I20>0,VLOOKUP($I20,DrawPrep!$C$3:$G$18,3,FALSE),\"\")","v":"Σ.Α.ΣΕΡΡΩΝ"}]
[null,null,null,null,null,null,null,null,null,null,null,null,null," ",null," ",null," "]
[]
[]
[null,null,null,null,null,null,null,null,null,"seeded players"]
[null,null,null,null,null,null,null,null,null,{"$f":"\"1. \" & IF(Setup!B19>0,LEFT(DrawPrep!D3,FIND(\" \",DrawPrep!D3)+1),\"\")","v":"1. ΠΟΥΛΑΚΗΣ  "}]
[null,null,null,null,null,null,null,null,null,{"$f":"\"2. \" & IF(Setup!B19>1,LEFT(DrawPrep!D4,FIND(\" \",DrawPrep!D4)+1),\"\")","v":"2. ΠΑΠΟΥΛΙΑΣ  "},null,null,null,null,null,null,null,"επιδιαιτητής"]
[null,null,null,null,null,null,null,null,null,{"$f":"\"3. \" & IF(Setup!B19>2,LEFT(DrawPrep!D5,FIND(\" \",DrawPrep!D5)+1),\"\")","v":"3. ΚΟΥΡΤΙΔΗΣ  "},null,null,null,null,null,null,null,{"$f":"Setup!B10","v":"ΠΕΤΡΙΔΗΣ  ΜΑΝΟΣ"}]
[null,null,null,null,null,null,null,null,null,{"$f":"\"4. \" & IF(Setup!B19>3,LEFT(DrawPrep!D6,FIND(\" \",DrawPrep!D6)+1),\"\")","v":"4. ΠΑΣΧΑΛΙΔΗΣ Μ"}]
[]
[]
[]
[]
[]
[]
[]
[]
[]
[]
[]
[null,null,null,null,null,null,null,null,null,"BoldPlayers"]
[null,null,null,null,null,null,null,null,null,{"$f":"IF(Setup!$B$19>0,LEFT(DrawPrep!D3,FIND(\" \",DrawPrep!D3)-1))","v":"ΠΟΥΛΑΚΗΣ"}]
[null,null,null,null,null,null,null,null,null,{"$f":"IF(Setup!$B$19>1,LEFT(DrawPrep!D4,FIND(\" \",DrawPrep!D4)-1))","v":"ΠΑΠΟΥΛΙΑΣ"}]
[null,null,null,null,null,null,null,null,null,{"$f":"IF(Setup!$B$19>2,LEFT(DrawPrep!D5,FIND(\" \",DrawPrep!D5)-1))","v":"ΚΟΥΡΤΙΔΗΣ"}]
[null,null,null,null,null,null,null,null,null,{"$f":"IF(Setup!$B$19>3,LEFT(DrawPrep!D6,FIND(\" \",DrawPrep!D6)-1))","v":"ΠΑΣΧΑΛΙΔΗΣ"}]