{"text_format":"1","workbook":"xlsx","n_sheets":8,"sheets":["Setup","DrawPrep","MD","Matches","notes","Rankings","CalcPrg","tmp"],"not_rendered":{"charts":0,"images":0,"macros":1,"external_links":0,"defined_names":4,"comments":0,"pivot_tables":0},"unopened":[],"bounds":{"document_bytes":16777216,"sheet_cells":100000,"rows_first":2000,"rows_last":500,"rows_between":2000,"halvings":0,"cell_chars":16384,"cell_head_chars":4096},"cells_cut":0,"cells_raw":0,"read":"whole","date_system":"1900"}

{"sheet":"Setup","index":0,"n_rows":31,"n_cols":8,"rows_kept":31,"cut":false,"hidden":false,"merged":[[1,3,2,3],[0,0,0,1]]}
["ΔΙΠΛΑ 16άρι ΤΑΜΠΛΟ",null,null,"Θέσεις","seed"]
[null,null,null,"3-4",{"$f":"VALUE(LEFT(F2,1))","v":3},"3 4"]
["Διοργανωτής: ","ΕΦΟΑ",null,null,{"$f":"VALUE(RIGHT(F2,1))","v":4}]
["Τίτλος Τουρνουά: ","1ο Ε2 2014"]
["type: ","e2-12"]
["Έδρα αγώνων: ","ΗΡΑΚΛΕΙΟ Ο.Α.Α."]
["Κατηγορία: ","Α12 Δ",null,"0 0 0 0 0 1 2 3 4 10 9 11 6 5 8 7 "]
["Έναρξη: ","28 Φεβ",null,"1 2 3 4 "]
["Λήξη: ","2 Μαρ",null,"0 0 0 0 0 0 0 0 0 0 0 0 0 0 0 0 0 0 0 0 0 0 0 0 0 0 0 0 0 0 0 0 0 0 0 0 0 0 0 0 "]
["Επιδιατητής: ","Νικηφοράκης Σταύρος"]
["Τηλέφωνο επιδ: ",6974735923,null,0,"seed","space pos","Index","Value"]
[null,null,null,{"$f":"IF(E12=\"-\",\"-\",IF(E12>0,D11+1,0))","v":0},{"$f":"IF(F12>0,VALUE(MID($D$7,1,F12-1)),\"-\")","v":0},{"$f":"IF(LEN($D$7)>1,FIND(\" \",$D$7,1),0)","v":2},0,0]
["Ηλικία (12, 14, 16, 18): ","12",null,{"$f":"IF(E13=\"-\",\"-\",IF(E13>0,D12+1,0))","v":0},{"$f":"IF(F13>0,VALUE(MID($D$7,F12+1,F13-F12-1)),\"-\")","v":0},{"$f":"IF(AND(F12>0,LEN($D$7)>F12+1),FIND(\" \",$D$7,F12+1),0)","v":4},0,0]
[null,null,null,0,0,6,0,0]
[null,null,null,0,0,8,0,0]
[null,null,null,0,0,10,0,0]
["Main Draw",{"$f":"\"(\"&COUNTBLANK(DrawPrep!H3:H18)&\")\"","v":"(5)"},null,1,1,12,1,1]
["Πλήθος bye (0-8): ",{"$f":"COUNTBLANK(DrawPrep!H3:H18)","v":5},null,2,2,14,2,2]
["Αριθμός θέσεων seeded: ",4,null,3,3,16,3,3]
[null,null,null,4,4,18,4,4]
[null,null,null,5,10,21,5,10]
[null,null,null,6,9,23,6,9]
[null,null,null,7,11,26,7,11]
[null,null,null,8,6,28,8,6]
["md  (# για off) ","ok",null,9,5,30,9,5]
[null,null,null,10,8,32,10,8]
["=RandUniq(3;4;2)",null,null,11,7,34,11,7]
[]
["=CONCATENATE(LEFT(D9;$B$18*2);LEFT(D8;$B$19*2);RandUniq($B$19+1;16-$B$18;16-$B$19-$B$18);\" \")"]
[]
[null,null," "]

{"sheet":"DrawPrep","index":1,"n_rows":66,"n_cols":23,"rows_kept":66,"cut":false,"hidden":false,"merged":[]}
[{"$f":"IF(Setup!B6>\" \",Setup!B3 & \", \" & Setup!B4 & \", \" & Setup!B6 & \", \" & Setup!B8 & \"-\" & Setup!B9,Setup!B3 & \", \" & Setup!B4 & \", \" & Setup!B8 & \"-\" & Setup!B9)","v":"ΕΦΟΑ, 1ο Ε2 2014, ΗΡΑΚΛΕΙΟ Ο.Α.Α., 28 Φεβ-2 Μαρ"},null,null,null,null,null,null,null,null,null,null,null,null,{"$f":"Setup!$B$7","v":"Α12 Δ"}]
["α/α","β-Δ","β-Μ","SortV","D>0","S>0","   Α.Μ.  ","Ονοματεπώνυμο","Σύλλογος","ptsD","ptsS","   Α.Μ.   ","Ονοματεπώνυμο","Σύλλογος","ptsD","ptsS","s1","s2","s3","s4","s5","SortPts","Rand"]
[1,{"$f":"J3+O3","v":0},{"$f":"K3+P3","v":145},{"$f":"IF(E3=2,1,IF(E3=1,2,IF(F3=2,3,IF(F3=1,4,5))))","v":3},{"$f":"COUNTIF(J3,\">0\")+COUNTIF(O3,\">0\")","v":0},{"$f":"COUNTIF(K3,\">0\")+COUNTIF(P3,\">0\")","v":2},31285,{"$f":"IF($G3=\"\",\"\",VLOOKUP(Setup!$B$13&\"-\"&$G3,Rankings!$A:$E,2,FALSE))","v":"ΚΩΣΤΟΥΡΟΣ ΔΗΜΗΤΡΙΟΣ"},{"$f":"IF($G3=\"\",\"\",VLOOKUP(Setup!$B$13&\"-\"&$G3,Rankings!$A:$E,3,FALSE))","v":"ΠΕΥΚΗ Γ.ΚΑΛΟΒΕΛΩΝΗΣ"},{"$f":"IF(COUNTIF(Rankings!$A:$A,Setup!$B$13&\"-\"&$G3)>0,VLOOKUP(Setup!$B$13&\"-\"&$G3,Rankings!$A:$E,5,FALSE),0)","v":0},{"$f":"IF(COUNTIF(Rankings!$A:$A,Setup!$B$13&\"-\"&$G3)>0,VLOOKUP(Setup!$B$13&\"-\"&$G3,Rankings!$A:$E,4,FALSE),0)","v":41.5},29179,{"$f":"IF($L3=\"\",\"\",VLOOKUP(Setup!$B$13&\"-\"&$L3,Rankings!$A:$E,2,FALSE))","v":"ΤΑΜΙΩΛΑΚΗΣ ΧΡΥΣΟΒΑΛΑΝΤΗΣ"},{"$f":"IF($L3=\"\",\"\",VLOOKUP(Setup!$B$13&\"-\"&$L3,Rankings!$A:$E,3,FALSE))","v":"ΗΡΑΚΛΕΙΟ Ο.Α.& Α."},{"$f":"IF(COUNTIF(Rankings!$A:$A,Setup!$B$13&\"-\"&$L3)>0,VLOOKUP(Setup!$B$13&\"-\"&$L3,Rankings!$A:$E,5,FALSE),0)","v":0},{"$f":"IF(COUNTIF(Rankings!$A:$A,Setup!$B$13&\"-\"&$L3)>0,VLOOKUP(Setup!$B$13&\"-\"&$L3,Rankings!$A:$E,4,FALSE),0)","v":103.5},{"$f":"B3+W3","v":1.7334584915927057E-2},{"$f":"IF(J3>0,(B3+P3/1000+W3/1000),(B3+K3/1000+W3/1000))","v":4.1517334584915931E-2},{"$f":"C3+W3","v":145.01733458491591},{"$f":"C3+W3","v":145.01733458491591},{"$f":"W3","v":1.7334584915927057E-2},{"$f":"IF(G3=\"\",0,VLOOKUP(D3,D3:U3,13+D3,FALSE))","v":145.01733458491591},1.7334584915927057E-2]
[2,0,86.5,3,0,2,29500,{"$f":"IF($G4=\"\",\"\",VLOOKUP(Setup!$B$13&\"-\"&$G4,Rankings!$A:$E,2,FALSE))","v":"ΤΡΙΑΝΤΑΦΥΛΛΟΥ ΝΤΑΝΙΕΛ"},{"$f":"IF($G4=\"\",\"\",VLOOKUP(Setup!$B$13&\"-\"&$G4,Rankings!$A:$E,3,FALSE))","v":"Ο.Α.ΑΝΑΦΛΥΣΤΟΣ ΣΑΡΩΝΙΔΑΣ"},{"$f":"IF(COUNTIF(Rankings!$A:$A,Setup!$B$13&\"-\"&$G4)>0,VLOOKUP(Setup!$B$13&\"-\"&$G4,Rankings!$A:$E,5,FALSE),0)","v":0},{"$f":"IF(COUNTIF(Rankings!$A:$A,Setup!$B$13&\"-\"&$G4)>0,VLOOKUP(Setup!$B$13&\"-\"&$G4,Rankings!$A:$E,4,FALSE),0)","v":58},31953,{"$f":"IF($L4=\"\",\"\",VLOOKUP(Setup!$B$13&\"-\"&$L4,Rankings!$A:$E,2,FALSE))","v":"ΣΙΜΑΤΟΣ ΓΕΩΡΓΙΟΣ"},{"$f":"IF($L4=\"\",\"\",VLOOKUP(Setup!$B$13&\"-\"&$L4,Rankings!$A:$E,3,FALSE))","v":"ΗΡΑΚΛΕΙΟ Ο.Α.& Α."},{"$f":"IF(COUNTIF(Rankings!$A:$A,Setup!$B$13&\"-\"&$L4)>0,VLOOKUP(Setup!$B$13&\"-\"&$L4,Rankings!$A:$E,5,FALSE),0)","v":0},{"$f":"IF(COUNTIF(Rankings!$A:$A,Setup!$B$13&\"-\"&$L4)>0,VLOOKUP(Setup!$B$13&\"-\"&$L4,Rankings!$A:$E,4,FALSE),0)","v":28.5},3.6986914925632768E-2,5.8036986914925634E-2,86.536986914925635,86.536986914925635,3.6986914925632768E-2,86.536986914925635,3.6986914925632768E-2]
[3,0,86,3,0,2,28777,{"$f":"IF($G5=\"\",\"\",VLOOKUP(Setup!$B$13&\"-\"&$G5,Rankings!$A:$E,2,FALSE))","v":"ΜΑΡΙΝΟΠΟΥΛΟΣ ΣΠΥΡΟΣ"},{"$f":"IF($G5=\"\",\"\",VLOOKUP(Setup!$B$13&\"-\"&$G5,Rankings!$A:$E,3,FALSE))","v":"Ο.Α.ΑΘΗΝΩΝ"},{"$f":"IF(COUNTIF(Rankings!$A:$A,Setup!$B$13&\"-\"&$G5)>0,VLOOKUP(Setup!$B$13&\"-\"&$G5,Rankings!$A:$E,5,FALSE),0)","v":0},{"$f":"IF(COUNTIF(Rankings!$A:$A,Setup!$B$13&\"-\"&$G5)>0,VLOOKUP(Setup!$B$13&\"-\"&$G5,Rankings!$A:$E,4,FALSE),0)","v":21},32605,{"$f":"IF($L5=\"\",\"\",VLOOKUP(Setup!$B$13&\"-\"&$L5,Rankings!$A:$E,2,FALSE))","v":"ΚΥΠΡΙΩΤΗΣ ΕΥΑΓΓΕΛΟΣ"},{"$f":"IF($L5=\"\",\"\",VLOOKUP(Setup!$B$13&\"-\"&$L5,Rankings!$A:$E,3,FALSE))","v":"Ο.Α.ΑΘΗΝΩΝ"},{"$f":"IF(COUNTIF(Rankings!$A:$A,Setup!$B$13&\"-\"&$L5)>0,VLOOKUP(Setup!$B$13&\"-\"&$L5,Rankings!$A:$E,5,FALSE),0)","v":0},{"$f":"IF(COUNTIF(Rankings!$A:$A,Setup!$B$13&\"-\"&$L5)>0,VLOOKUP(Setup!$B$13&\"-\"&$L5,Rankings!$A:$E,4,FALSE),0)","v":65},3.3788066285176367E-2,2.1033788066285176E-2,86.033788066285183,86.033788066285183,3.3788066285176367E-2,86.033788066285183,3.3788066285176367E-2]
[4,0,85,3,0,2,30524,{"$f":"IF($G6=\"\",\"\",VLOOKUP(Setup!$B$13&\"-\"&$G6,Rankings!$A:$E,2,FALSE))","v":"ΜΑΤΣΑΜΑΚΗΣ ΑΝΤΩΝΙΟΣ"},{"$f":"IF($G6=\"\",\"\",VLOOKUP(Setup!$B$13&\"-\"&$G6,Rankings!$A:$E,3,FALSE))","v":"Ο.Α.ΧΑΝΙΩΝ"},{"$f":"IF(COUNTIF(Rankings!$A:$A,Setup!$B$13&\"-\"&$G6)>0,VLOOKUP(Setup!$B$13&\"-\"&$G6,Rankings!$A:$E,5,FALSE),0)","v":0},{"$f":"IF(COUNTIF(Rankings!$A:$A,Setup!$B$13&\"-\"&$G6)>0,VLOOKUP(Setup!$B$13&\"-\"&$G6,Rankings!$A:$E,4,FALSE),0)","v":40},30535,{"$f":"IF($L6=\"\",\"\",VLOOKUP(Setup!$B$13&\"-\"&$L6,Rankings!$A:$E,2,FALSE))","v":"ΚΟΝΤΑΡΑΚΗΣ ΑΝΔΡΕΑΣ"},{"$f":"IF($L6=\"\",\"\",VLOOKUP(Setup!$B$13&\"-\"&$L6,Rankings!$A:$E,3,FALSE))","v":"Ο.Α.ΧΑΝΙΩΝ"},{"$f":"IF(COUNTIF(Rankings!$A:$A,Setup!$B$13&\"-\"&$L6)>0,VLOOKUP(Setup!$B$13&\"-\"&$L6,Rankings!$A:$E,5,FALSE),0)","v":0},{"$f":"IF(COUNTIF(Rankings!$A:$A,Setup!$B$13&\"-\"&$L6)>0,VLOOKUP(Setup!$B$13&\"-\"&$L6,Rankings!$A:$E,4,FALSE),0)","v":45},1.3494198484654364E-2,4.0013494198484656E-2,85.013494198484651,85.013494198484651,1.3494198484654364E-2,85.013494198484651,1.3494198484654364E-2]
[5,0,77,3,0,2,30531,{"$f":"IF($G7=\"\",\"\",VLOOKUP(Setup!$B$13&\"-\"&$G7,Rankings!$A:$E,2,FALSE))","v":"ΚΩΝΣΤΑΝΤΑΡΑΚΗΣ ΑΝΔΡΕΑΣ"},{"$f":"IF($G7=\"\",\"\",VLOOKUP(Setup!$B$13&\"-\"&$G7,Rankings!$A:$E,3,FALSE))","v":"Ο.Α.ΧΑΝΙΩΝ"},{"$f":"IF(COUNTIF(Rankings!$A:$A,Setup!$B$13&\"-\"&$G7)>0,VLOOKUP(Setup!$B$13&\"-\"&$G7,Rankings!$A:$E,5,FALSE),0)","v":0},{"$f":"IF(COUNTIF(Rankings!$A:$A,Setup!$B$13&\"-\"&$G7)>0,VLOOKUP(Setup!$B$13&\"-\"&$G7,Rankings!$A:$E,4,FALSE),0)","v":30},34511,{"$f":"IF($L7=\"\",\"\",VLOOKUP(Setup!$B$13&\"-\"&$L7,Rankings!$A:$E,2,FALSE))","v":"ΚΑΡΑΧΑΛΙΟΣ ΑΓΓΕΛΟΣ"},{"$f":"IF($L7=\"\",\"\",VLOOKUP(Setup!$B$13&\"-\"&$L7,Rankings!$A:$E,3,FALSE))","v":"Ο.Α.ΧΑΝΙΩΝ"},{"$f":"IF(COUNTIF(Rankings!$A:$A,Setup!$B$13&\"-\"&$L7)>0,VLOOKUP(Setup!$B$13&\"-\"&$L7,Rankings!$A:$E,5,FALSE),0)","v":0},{"$f":"IF(COUNTIF(Rankings!$A:$A,Setup!$B$13&\"-\"&$L7)>0,VLOOKUP(Setup!$B$13&\"-\"&$L7,Rankings!$A:$E,4,FALSE),0)","v":47},2.4638147638899186E-2,3.0024638147638897E-2,77.024638147638896,77.024638147638896,2.4638147638899186E-2,77.024638147638896,2.4638147638899186E-2]
[6,0,47.5,3,0,2,30710,{"$f":"IF($G8=\"\",\"\",VLOOKUP(Setup!$B$13&\"-\"&$G8,Rankings!$A:$E,2,FALSE))","v":"ΚΑΖΙΑΛΕΣ ΕΥΑΓΓΕΛΟΣ"},{"$f":"IF($G8=\"\",\"\",VLOOKUP(Setup!$B$13&\"-\"&$G8,Rankings!$A:$E,3,FALSE))","v":"Ο.Α. ΡΕΘΥΜΝΟΥ"},{"$f":"IF(COUNTIF(Rankings!$A:$A,Setup!$B$13&\"-\"&$G8)>0,VLOOKUP(Setup!$B$13&\"-\"&$G8,Rankings!$A:$E,5,FALSE),0)","v":0},{"$f":"IF(COUNTIF(Rankings!$A:$A,Setup!$B$13&\"-\"&$G8)>0,VLOOKUP(Setup!$B$13&\"-\"&$G8,Rankings!$A:$E,4,FALSE),0)","v":21},30546,{"$f":"IF($L8=\"\",\"\",VLOOKUP(Setup!$B$13&\"-\"&$L8,Rankings!$A:$E,2,FALSE))","v":"ΤΣΑΓΛΙΩΤΗΣ ΑΝΤΩΝΗΣ"},{"$f":"IF($L8=\"\",\"\",VLOOKUP(Setup!$B$13&\"-\"&$L8,Rankings!$A:$E,3,FALSE))","v":"Ο.Α.ΡΕΘΥΜΝΟΥ"},{"$f":"IF(COUNTIF(Rankings!$A:$A,Setup!$B$13&\"-\"&$L8)>0,VLOOKUP(Setup!$B$13&\"-\"&$L8,Rankings!$A:$E,5,FALSE),0)","v":0},{"$f":"IF(COUNTIF(Rankings!$A:$A,Setup!$B$13&\"-\"&$L8)>0,VLOOKUP(Setup!$B$13&\"-\"&$L8,Rankings!$A:$E,4,FALSE),0)","v":26.5},3.2452014588394938E-2,2.1032452014588397E-2,47.532452014588394,47.532452014588394,3.2452014588394938E-2,47.532452014588394,3.2452014588394938E-2]
[7,0,25,3,0,2,30776,{"$f":"IF($G9=\"\",\"\",VLOOKUP(Setup!$B$13&\"-\"&$G9,Rankings!$A:$E,2,FALSE))","v":"ΖΕΡΒΟΣ ΓΕΩΡΓΙΟΣ"},{"$f":"IF($G9=\"\",\"\",VLOOKUP(Setup!$B$13&\"-\"&$G9,Rankings!$A:$E,3,FALSE))","v":"Ο.Α.ΧΑΝΙΩΝ"},{"$f":"IF(COUNTIF(Rankings!$A:$A,Setup!$B$13&\"-\"&$G9)>0,VLOOKUP(Setup!$B$13&\"-\"&$G9,Rankings!$A:$E,5,FALSE),0)","v":0},{"$f":"IF(COUNTIF(Rankings!$A:$A,Setup!$B$13&\"-\"&$G9)>0,VLOOKUP(Setup!$B$13&\"-\"&$G9,Rankings!$A:$E,4,FALSE),0)","v":11.5},30537,{"$f":"IF($L9=\"\",\"\",VLOOKUP(Setup!$B$13&\"-\"&$L9,Rankings!$A:$E,2,FALSE))","v":"ΒΟΛΤΥΡΑΚΗΣ ΒΑΣΙΛΗΣ"},{"$f":"IF($L9=\"\",\"\",VLOOKUP(Setup!$B$13&\"-\"&$L9,Rankings!$A:$E,3,FALSE))","v":"Ο.Α.ΧΑΝΙΩΝ"},{"$f":"IF(COUNTIF(Rankings!$A:$A,Setup!$B$13&\"-\"&$L9)>0,VLOOKUP(Setup!$B$13&\"-\"&$L9,Rankings!$A:$E,5,FALSE),0)","v":0},{"$f":"IF(COUNTIF(Rankings!$A:$A,Setup!$B$13&\"-\"&$L9)>0,VLOOKUP(Setup!$B$13&\"-\"&$L9,Rankings!$A:$E,4,FALSE),0)","v":13.5},2.6315418407484324E-2,1.1526315418407485E-2,25.026315418407485,25.026315418407485,2.6315418407484324E-2,25.026315418407485,2.6315418407484324E-2]
[8,0,22.5,3,0,2,31810,{"$f":"IF($G10=\"\",\"\",VLOOKUP(Setup!$B$13&\"-\"&$G10,Rankings!$A:$E,2,FALSE))","v":"ΔΕΛΑΚΗΣ ΔΗΜΗΤΡΗΣ"},{"$f":"IF($G10=\"\",\"\",VLOOKUP(Setup!$B$13&\"-\"&$G10,Rankings!$A:$E,3,FALSE))","v":"ΗΡΑΚΛΕΙΟ Ο.Α.& Α."},{"$f":"IF(COUNTIF(Rankings!$A:$A,Setup!$B$13&\"-\"&$G10)>0,VLOOKUP(Setup!$B$13&\"-\"&$G10,Rankings!$A:$E,5,FALSE),0)","v":0},{"$f":"IF(COUNTIF(Rankings!$A:$A,Setup!$B$13&\"-\"&$G10)>0,VLOOKUP(Setup!$B$13&\"-\"&$G10,Rankings!$A:$E,4,FALSE),0)","v":12.5},33622,{"$f":"IF($L10=\"\",\"\",VLOOKUP(Setup!$B$13&\"-\"&$L10,Rankings!$A:$E,2,FALSE))","v":"ΜΠΟΥΡΑΣ ΙΩΑΝΝΗΣ"},{"$f":"IF($L10=\"\",\"\",VLOOKUP(Setup!$B$13&\"-\"&$L10,Rankings!$A:$E,3,FALSE))","v":"ΗΡΑΚΛΕΙΟ Ο.Α.& Α."},{"$f":"IF(COUNTIF(Rankings!$A:$A,Setup!$B$13&\"-\"&$L10)>0,VLOOKUP(Setup!$B$13&\"-\"&$L10,Rankings!$A:$E,5,FALSE),0)","v":0},{"$f":"IF(COUNTIF(Rankings!$A:$A,Setup!$B$13&\"-\"&$L10)>0,VLOOKUP(Setup!$B$13&\"-\"&$L10,Rankings!$A:$E,4,FALSE),0)","v":10},4.1043909423465426E-2,1.2541043909423465E-2,22.541043909423465,22.541043909423465,4.1043909423465426E-2,22.541043909423465,4.1043909423465426E-2]
[9,0,20,3,0,2,31816,{"$f":"IF($G11=\"\",\"\",VLOOKUP(Setup!$B$13&\"-\"&$G11,Rankings!$A:$E,2,FALSE))","v":"ΓΚΑΓΚΑΟΥΔΑΚΗΣ ΣΤΥΛΙΑΝΟΣ"},{"$f":"IF($G11=\"\",\"\",VLOOKUP(Setup!$B$13&\"-\"&$G11,Rankings!$A:$E,3,FALSE))","v":"ΗΡΑΚΛΕΙΟ Ο.Α.& Α."},{"$f":"IF(COUNTIF(Rankings!$A:$A,Setup!$B$13&\"-\"&$G11)>0,VLOOKUP(Setup!$B$13&\"-\"&$G11,Rankings!$A:$E,5,FALSE),0)","v":0},{"$f":"IF(COUNTIF(Rankings!$A:$A,Setup!$B$13&\"-\"&$G11)>0,VLOOKUP(Setup!$B$13&\"-\"&$G11,Rankings!$A:$E,4,FALSE),0)","v":10.5},31454,{"$f":"IF($L11=\"\",\"\",VLOOKUP(Setup!$B$13&\"-\"&$L11,Rankings!$A:$E,2,FALSE))","v":"ΜΠΟΓΡΗΣ ΕΥΑΓΓΕΛΟΣ"},{"$f":"IF($L11=\"\",\"\",VLOOKUP(Setup!$B$13&\"-\"&$L11,Rankings!$A:$E,3,FALSE))","v":"ΗΡΑΚΛΕΙΟ Ο.Α.& Α."},{"$f":"IF(COUNTIF(Rankings!$A:$A,Setup!$B$13&\"-\"&$L11)>0,VLOOKUP(Setup!$B$13&\"-\"&$L11,Rankings!$A:$E,5,FALSE),0)","v":0},{"$f":"IF(COUNTIF(Rankings!$A:$A,Setup!$B$13&\"-\"&$L11)>0,VLOOKUP(Setup!$B$13&\"-\"&$L11,Rankings!$A:$E,4,FALSE),0)","v":9.5},1.7585668443730482E-2,1.051758566844373E-2,20.017585668443729,20.017585668443729,1.7585668443730482E-2,20.017585668443729,1.7585668443730482E-2]
[10,0,18.5,3,0,2,30977,{"$f":"IF($G12=\"\",\"\",VLOOKUP(Setup!$B$13&\"-\"&$G12,Rankings!$A:$E,2,FALSE))","v":"ΝΟΥΧΑΚΗΣ ΓΕΩΡΓΙΟΣ"},{"$f":"IF($G12=\"\",\"\",VLOOKUP(Setup!$B$13&\"-\"&$G12,Rankings!$A:$E,3,FALSE))","v":"Ο.Α.ΣΟΥΔΑΣ"},{"$f":"IF(COUNTIF(Rankings!$A:$A,Setup!$B$13&\"-\"&$G12)>0,VLOOKUP(Setup!$B$13&\"-\"&$G12,Rankings!$A:$E,5,FALSE),0)","v":0},{"$f":"IF(COUNTIF(Rankings!$A:$A,Setup!$B$13&\"-\"&$G12)>0,VLOOKUP(Setup!$B$13&\"-\"&$G12,Rankings!$A:$E,4,FALSE),0)","v":10},32659,{"$f":"IF($L12=\"\",\"\",VLOOKUP(Setup!$B$13&\"-\"&$L12,Rankings!$A:$E,2,FALSE))","v":"ΑΣΤΡΕΙΝΙΔΗΣ ΦΙΛΙΠΠΟΣ"},{"$f":"IF($L12=\"\",\"\",VLOOKUP(Setup!$B$13&\"-\"&$L12,Rankings!$A:$E,3,FALSE))","v":"Α.Ο.Α.ΠΑΠΑΓΟΥ"},{"$f":"IF(COUNTIF(Rankings!$A:$A,Setup!$B$13&\"-\"&$L12)>0,VLOOKUP(Setup!$B$13&\"-\"&$L12,Rankings!$A:$E,5,FALSE),0)","v":0},{"$f":"IF(COUNTIF(Rankings!$A:$A,Setup!$B$13&\"-\"&$L12)>0,VLOOKUP(Setup!$B$13&\"-\"&$L12,Rankings!$A:$E,4,FALSE),0)","v":8.5},3.1785047136978654E-2,1.0031785047136978E-2,18.531785047136978,18.531785047136978,3.1785047136978654E-2,18.531785047136978,3.1785047136978654E-2]
[11,0,8,3,0,2,34836,{"$f":"IF($G13=\"\",\"\",VLOOKUP(Setup!$B$13&\"-\"&$G13,Rankings!$A:$E,2,FALSE))","v":"ΣΑΒΒΑΚΗΣ ΔΗΜΗΤΡΗΣ"},{"$f":"IF($G13=\"\",\"\",VLOOKUP(Setup!$B$13&\"-\"&$G13,Rankings!$A:$E,3,FALSE))","v":"Ο.Α.ΡΕΘΥΜΝΟΥ"},{"$f":"IF(COUNTIF(Rankings!$A:$A,Setup!$B$13&\"-\"&$G13)>0,VLOOKUP(Setup!$B$13&\"-\"&$G13,Rankings!$A:$E,5,FALSE),0)","v":0},{"$f":"IF(COUNTIF(Rankings!$A:$A,Setup!$B$13&\"-\"&$G13)>0,VLOOKUP(Setup!$B$13&\"-\"&$G13,Rankings!$A:$E,4,FALSE),0)","v":5.5},35333,{"$f":"IF($L13=\"\",\"\",VLOOKUP(Setup!$B$13&\"-\"&$L13,Rankings!$A:$E,2,FALSE))","v":"ΤΣΑΚΙΡΑΚΗΣ ΓΙΩΡΓΟΣ"},{"$f":"IF($L13=\"\",\"\",VLOOKUP(Setup!$B$13&\"-\"&$L13,Rankings!$A:$E,3,FALSE))","v":"ΗΡΑΚΛΕΙΟ Ο.Α.& Α."},{"$f":"IF(COUNTIF(Rankings!$A:$A,Setup!$B$13&\"-\"&$L13)>0,VLOOKUP(Setup!$B$13&\"-\"&$L13,Rankings!$A:$E,5,FALSE),0)","v":0},{"$f":"IF(COUNTIF(Rankings!$A:$A,Setup!$B$13&\"-\"&$L13)>0,VLOOKUP(Setup!$B$13&\"-\"&$L13,Rankings!$A:$E,4,FALSE),0)","v":2.5},1.0644074789532483E-2,5.5106440747895325E-3,8.010644074789532,8.010644074789532,1.0644074789532483E-2,8.010644074789532,1.0644074789532483E-2]
[12,0,0,5,0,0,null,{"$f":"IF($G14=\"\",\"\",VLOOKUP(Setup!$B$13&\"-\"&$G14,Rankings!$A:$E,2,FALSE))","v":""},{"$f":"IF($G14=\"\",\"\",VLOOKUP(Setup!$B$13&\"-\"&$G14,Rankings!$A:$E,3,FALSE))","v":""},{"$f":"IF(COUNTIF(Rankings!$A:$A,Setup!$B$13&\"-\"&$G14)>0,VLOOKUP(Setup!$B$13&\"-\"&$G14,Rankings!$A:$E,5,FALSE),0)","v":0},{"$f":"IF(COUNTIF(Rankings!$A:$A,Setup!$B$13&\"-\"&$G14)>0,VLOOKUP(Setup!$B$13&\"-\"&$G14,Rankings!$A:$E,4,FALSE),0)","v":0},null,{"$f":"IF($L14=\"\",\"\",VLOOKUP(Setup!$B$13&\"-\"&$L14,Rankings!$A:$E,2,FALSE))","v":""},{"$f":"IF($L14=\"\",\"\",VLOOKUP(Setup!$B$13&\"-\"&$L14,Rankings!$A:$E,3,FALSE))","v":""},{"$f":"IF(COUNTIF(Rankings!$A:$A,Setup!$B$13&\"-\"&$L14)>0,VLOOKUP(Setup!$B$13&\"-\"&$L14,Rankings!$A:$E,5,FALSE),0)","v":0},{"$f":"IF(COUNTIF(Rankings!$A:$A,Setup!$B$13&\"-\"&$L14)>0,VLOOKUP(Setup!$B$13&\"-\"&$L14,Rankings!$A:$E,4,FALSE),0)","v":0},4.3342189197474096E-2,4.3342189197474093E-5,4.3342189197474096E-2,4.3342189197474096E-2,4.3342189197474096E-2,0,4.3342189197474096E-2]
[13,0,0,5,0,0,null,{"$f":"IF($G15=\"\",\"\",VLOOKUP(Setup!$B$13&\"-\"&$G15,Rankings!$A:$E,2,FALSE))","v":""},{"$f":"IF($G15=\"\",\"\",VLOOKUP(Setup!$B$13&\"-\"&$G15,Rankings!$A:$E,3,FALSE))","v":""},{"$f":"IF(COUNTIF(Rankings!$A:$A,Setup!$B$13&\"-\"&$G15)>0,VLOOKUP(Setup!$B$13&\"-\"&$G15,Rankings!$A:$E,5,FALSE),0)","v":0},{"$f":"IF(COUNTIF(Rankings!$A:$A,Setup!$B$13&\"-\"&$G15)>0,VLOOKUP(Setup!$B$13&\"-\"&$G15,Rankings!$A:$E,4,FALSE),0)","v":0},null,{"$f":"IF($L15=\"\",\"\",VLOOKUP(Setup!$B$13&\"-\"&$L15,Rankings!$A:$E,2,FALSE))","v":""},{"$f":"IF($L15=\"\",\"\",VLOOKUP(Setup!$B$13&\"-\"&$L15,Rankings!$A:$E,3,FALSE))","v":""},{"$f":"IF(COUNTIF(Rankings!$A:$A,Setup!$B$13&\"-\"&$L15)>0,VLOOKUP(Setup!$B$13&\"-\"&$L15,Rankings!$A:$E,5,FALSE),0)","v":0},{"$f":"IF(COUNTIF(Rankings!$A:$A,Setup!$B$13&\"-\"&$L15)>0,VLOOKUP(Setup!$B$13&\"-\"&$L15,Rankings!$A:$E,4,FALSE),0)","v":0},4.2904768661496832E-2,4.2904768661496833E-5,4.2904768661496832E-2,4.2904768661496832E-2,4.2904768661496832E-2,0,4.2904768661496832E-2]
[14,0,0,5,0,0,null,{"$f":"IF($G16=\"\",\"\",VLOOKUP(Setup!$B$13&\"-\"&$G16,Rankings!$A:$E,2,FALSE))","v":""},{"$f":"IF($G16=\"\",\"\",VLOOKUP(Setup!$B$13&\"-\"&$G16,Rankings!$A:$E,3,FALSE))","v":""},{"$f":"IF(COUNTIF(Rankings!$A:$A,Setup!$B$13&\"-\"&$G16)>0,VLOOKUP(Setup!$B$13&\"-\"&$G16,Rankings!$A:$E,5,FALSE),0)","v":0},{"$f":"IF(COUNTIF(Rankings!$A:$A,Setup!$B$13&\"-\"&$G16)>0,VLOOKUP(Setup!$B$13&\"-\"&$G16,Rankings!$A:$E,4,FALSE),0)","v":0},null,{"$f":"IF($L16=\"\",\"\",VLOOKUP(Setup!$B$13&\"-\"&$L16,Rankings!$A:$E,2,FALSE))","v":""},{"$f":"IF($L16=\"\",\"\",VLOOKUP(Setup!$B$13&\"-\"&$L16,Rankings!$A:$E,3,FALSE))","v":""},{"$f":"IF(COUNTIF(Rankings!$A:$A,Setup!$B$13&\"-\"&$L16)>0,VLOOKUP(Setup!$B$13&\"-\"&$L16,Rankings!$A:$E,5,FALSE),0)","v":0},{"$f":"IF(COUNTIF(Rankings!$A:$A,Setup!$B$13&\"-\"&$L16)>0,VLOOKUP(Setup!$B$13&\"-\"&$L16,Rankings!$A:$E,4,FALSE),0)","v":0},4.2295700435180515E-2,4.2295700435180513E-5,4.2295700435180515E-2,4.2295700435180515E-2,4.2295700435180515E-2,0,4.2295700435180515E-2]
[15,0,0,5,0,0,null,{"$f":"IF($G17=\"\",\"\",VLOOKUP(Setup!$B$13&\"-\"&$G17,Rankings!$A:$E,2,FALSE))","v":""},{"$f":"IF($G17=\"\",\"\",VLOOKUP(Setup!$B$13&\"-\"&$G17,Rankings!$A:$E,3,FALSE))","v":""},{"$f":"IF(COUNTIF(Rankings!$A:$A,Setup!$B$13&\"-\"&$G17)>0,VLOOKUP(Setup!$B$13&\"-\"&$G17,Rankings!$A:$E,5,FALSE),0)","v":0},{"$f":"IF(COUNTIF(Rankings!$A:$A,Setup!$B$13&\"-\"&$G17)>0,VLOOKUP(Setup!$B$13&\"-\"&$G17,Rankings!$A:$E,4,FALSE),0)","v":0},null,{"$f":"IF($L17=\"\",\"\",VLOOKUP(Setup!$B$13&\"-\"&$L17,Rankings!$A:$E,2,FALSE))","v":""},{"$f":"IF($L17=\"\",\"\",VLOOKUP(Setup!$B$13&\"-\"&$L17,Rankings!$A:$E,3,FALSE))","v":""},{"$f":"IF(COUNTIF(Rankings!$A:$A,Setup!$B$13&\"-\"&$L17)>0,VLOOKUP(Setup!$B$13&\"-\"&$L17,Rankings!$A:$E,5,FALSE),0)","v":0},{"$f":"IF(COUNTIF(Rankings!$A:$A,Setup!$B$13&\"-\"&$L17)>0,VLOOKUP(Setup!$B$13&\"-\"&$L17,Rankings!$A:$E,4,FALSE),0)","v":0},4.13980657162768E-2,4.13980657162768E-5,4.13980657162768E-2,4.13980657162768E-2,4.13980657162768E-2,0,4.13980657162768E-2]
[16,0,0,5,0,0,null,{"$f":"IF($G18=\"\",\"\",VLOOKUP(Setup!$B$13&\"-\"&$G18,Rankings!$A:$E,2,FALSE))","v":""},{"$f":"IF($G18=\"\",\"\",VLOOKUP(Setup!$B$13&\"-\"&$G18,Rankings!$A:$E,3,FALSE))","v":""},{"$f":"IF(COUNTIF(Rankings!$A:$A,Setup!$B$13&\"-\"&$G18)>0,VLOOKUP(Setup!$B$13&\"-\"&$G18,Rankings!$A:$E,5,FALSE),0)","v":0},{"$f":"IF(COUNTIF(Rankings!$A:$A,Setup!$B$13&\"-\"&$G18)>0,VLOOKUP(Setup!$B$13&\"-\"&$G18,Rankings!$A:$E,4,FALSE),0)","v":0},null,{"$f":"IF($L18=\"\",\"\",VLOOKUP(Setup!$B$13&\"-\"&$L18,Rankings!$A:$E,2,FALSE))","v":""},{"$f":"IF($L18=\"\",\"\",VLOOKUP(Setup!$B$13&\"-\"&$L18,Rankings!$A:$E,3,FALSE))","v":""},{"$f":"IF(COUNTIF(Rankings!$A:$A,Setup!$B$13&\"-\"&$L18)>0,VLOOKUP(Setup!$B$13&\"-\"&$L18,Rankings!$A:$E,5,FALSE),0)","v":0},{"$f":"IF(COUNTIF(Rankings!$A:$A,Setup!$B$13&\"-\"&$L18)>0,VLOOKUP(Setup!$B$13&\"-\"&$L18,Rankings!$A:$E,4,FALSE),0)","v":0},4.1076148565636329E-2,4.1076148565636326E-5,4.1076148565636329E-2,4.1076148565636329E-2,4.1076148565636329E-2,0,4.1076148565636329E-2]
[17,0,0,5,0,0,null,{"$f":"IF($G19=\"\",\"\",VLOOKUP(Setup!$B$13&\"-\"&$G19,Rankings!$A:$E,2,FALSE))","v":""},{"$f":"IF($G19=\"\",\"\",VLOOKUP(Setup!$B$13&\"-\"&$G19,Rankings!$A:$E,3,FALSE))","v":""},{"$f":"IF(COUNTIF(Rankings!$A:$A,Setup!$B$13&\"-\"&$G19)>0,VLOOKUP(Setup!$B$13&\"-\"&$G19,Rankings!$A:$E,5,FALSE),0)","v":0},{"$f":"IF(COUNTIF(Rankings!$A:$A,Setup!$B$13&\"-\"&$G19)>0,VLOOKUP(Setup!$B$13&\"-\"&$G19,Rankings!$A:$E,4,FALSE),0)","v":0},null,{"$f":"IF($L19=\"\",\"\",VLOOKUP(Setup!$B$13&\"-\"&$L19,Rankings!$A:$E,2,FALSE))","v":""},{"$f":"IF($L19=\"\",\"\",VLOOKUP(Setup!$B$13&\"-\"&$L19,Rankings!$A:$E,3,FALSE))","v":""},{"$f":"IF(COUNTIF(Rankings!$A:$A,Setup!$B$13&\"-\"&$L19)>0,VLOOKUP(Setup!$B$13&\"-\"&$L19,Rankings!$A:$E,5,FALSE),0)","v":0},{"$f":"IF(COUNTIF(Rankings!$A:$A,Setup!$B$13&\"-\"&$L19)>0,VLOOKUP(Setup!$B$13&\"-\"&$L19,Rankings!$A:$E,4,FALSE),0)","v":0},3.9987863905085644E-2,3.9987863905085647E-5,3.9987863905085644E-2,3.9987863905085644E-2,3.9987863905085644E-2,0,3.9987863905085644E-2]
[18,0,0,5,0,0,null,{"$f":"IF($G20=\"\",\"\",VLOOKUP(Setup!$B$13&\"-\"&$G20,Rankings!$A:$E,2,FALSE))","v":""},{"$f":"IF($G20=\"\",\"\",VLOOKUP(Setup!$B$13&\"-\"&$G20,Rankings!$A:$E,3,FALSE))","v":""},{"$f":"IF(COUNTIF(Rankings!$A:$A,Setup!$B$13&\"-\"&$G20)>0,VLOOKUP(Setup!$B$13&\"-\"&$G20,Rankings!$A:$E,5,FALSE),0)","v":0},{"$f":"IF(COUNTIF(Rankings!$A:$A,Setup!$B$13&\"-\"&$G20)>0,VLOOKUP(Setup!$B$13&\"-\"&$G20,Rankings!$A:$E,4,FALSE),0)","v":0},null,{"$f":"IF($L20=\"\",\"\",VLOOKUP(Setup!$B$13&\"-\"&$L20,Rankings!$A:$E,2,FALSE))","v":""},{"$f":"IF($L20=\"\",\"\",VLOOKUP(Setup!$B$13&\"-\"&$L20,Rankings!$A:$E,3,FALSE))","v":""},{"$f":"IF(COUNTIF(Rankings!$A:$A,Setup!$B$13&\"-\"&$L20)>0,VLOOKUP(Setup!$B$13&\"-\"&$L20,Rankings!$A:$E,5,FALSE),0)","v":0},{"$f":"IF(COUNTIF(Rankings!$A:$A,Setup!$B$13&\"-\"&$L20)>0,VLOOKUP(Setup!$B$13&\"-\"&$L20,Rankings!$A:$E,4,FALSE),0)","v":0},3.9399485061373363E-2,3.9399485061373365E-5,3.9399485061373363E-2,3.9399485061373363E-2,3.9399485061373363E-2,0,3.9399485061373363E-2]
[19,0,0,5,0,0,null,{"$f":"IF($G21=\"\",\"\",VLOOKUP(Setup!$B$13&\"-\"&$G21,Rankings!$A:$E,2,FALSE))","v":""},{"$f":"IF($G21=\"\",\"\",VLOOKUP(Setup!$B$13&\"-\"&$G21,Rankings!$A:$E,3,FALSE))","v":""},{"$f":"IF(COUNTIF(Rankings!$A:$A,Setup!$B$13&\"-\"&$G21)>0,VLOOKUP(Setup!$B$13&\"-\"&$G21,Rankings!$A:$E,5,FALSE),0)","v":0},{"$f":"IF(COUNTIF(Rankings!$A:$A,Setup!$B$13&\"-\"&$G21)>0,VLOOKUP(Setup!$B$13&\"-\"&$G21,Rankings!$A:$E,4,FALSE),0)","v":0},null,{"$f":"IF($L21=\"\",\"\",VLOOKUP(Setup!$B$13&\"-\"&$L21,Rankings!$A:$E,2,FALSE))","v":""},{"$f":"IF($L21=\"\",\"\",VLOOKUP(Setup!$B$13&\"-\"&$L21,Rankings!$A:$E,3,FALSE))","v":""},{"$f":"IF(COUNTIF(Rankings!$A:$A,Setup!$B$13&\"-\"&$L21)>0,VLOOKUP(Setup!$B$13&\"-\"&$L21,Rankings!$A:$E,5,FALSE),0)","v":0},{"$f":"IF(COUNTIF(Rankings!$A:$A,Setup!$B$13&\"-\"&$L21)>0,VLOOKUP(Setup!$B$13&\"-\"&$L21,Rankings!$A:$E,4,FALSE),0)","v":0},3.8560727020799608E-2,3.8560727020799611E-5,3.8560727020799608E-2,3.8560727020799608E-2,3.8560727020799608E-2,0,3.8560727020799608E-2]
[20,0,0,5,0,0,null,{"$f":"IF($G22=\"\",\"\",VLOOKUP(Setup!$B$13&\"-\"&$G22,Rankings!$A:$E,2,FALSE))","v":""},{"$f":"IF($G22=\"\",\"\",VLOOKUP(Setup!$B$13&\"-\"&$G22,Rankings!$A:$E,3,FALSE))","v":""},{"$f":"IF(COUNTIF(Rankings!$A:$A,Setup!$B$13&\"-\"&$G22)>0,VLOOKUP(Setup!$B$13&\"-\"&$G22,Rankings!$A:$E,5,FALSE),0)","v":0},{"$f":"IF(COUNTIF(Rankings!$A:$A,Setup!$B$13&\"-\"&$G22)>0,VLOOKUP(Setup!$B$13&\"-\"&$G22,Rankings!$A:$E,4,FALSE),0)","v":0},null,{"$f":"IF($L22=\"\",\"\",VLOOKUP(Setup!$B$13&\"-\"&$L22,Rankings!$A:$E,2,FALSE))","v":""},{"$f":"IF($L22=\"\",\"\",VLOOKUP(Setup!$B$13&\"-\"&$L22,Rankings!$A:$E,3,FALSE))","v":""},{"$f":"IF(COUNTIF(Rankings!$A:$A,Setup!$B$13&\"-\"&$L22)>0,VLOOKUP(Setup!$B$13&\"-\"&$L22,Rankings!$A:$E,5,FALSE),0)","v":0},{"$f":"IF(COUNTIF(Rankings!$A:$A,Setup!$B$13&\"-\"&$L22)>0,VLOOKUP(Setup!$B$13&\"-\"&$L22,Rankings!$A:$E,4,FALSE),0)","v":0},3.7753704508849732E-2,3.7753704508849732E-5,3.7753704508849732E-2,3.7753704508849732E-2,3.7753704508849732E-2,0,3.7753704508849732E-2]
[21,0,0,5,0,0,null,{"$f":"IF($G23=\"\",\"\",VLOOKUP(Setup!$B$13&\"-\"&$G23,Rankings!$A:$E,2,FALSE))","v":""},{"$f":"IF($G23=\"\",\"\",VLOOKUP(Setup!$B$13&\"-\"&$G23,Rankings!$A:$E,3,FALSE))","v":""},{"$f":"IF(COUNTIF(Rankings!$A:$A,Setup!$B$13&\"-\"&$G23)>0,VLOOKUP(Setup!$B$13&\"-\"&$G23,Rankings!$A:$E,5,FALSE),0)","v":0},{"$f":"IF(COUNTIF(Rankings!$A:$A,Setup!$B$13&\"-\"&$G23)>0,VLOOKUP(Setup!$B$13&\"-\"&$G23,Rankings!$A:$E,4,FALSE),0)","v":0},null,{"$f":"IF($L23=\"\",\"\",VLOOKUP(Setup!$B$13&\"-\"&$L23,Rankings!$A:$E,2,FALSE))","v":""},{"$f":"IF($L23=\"\",\"\",VLOOKUP(Setup!$B$13&\"-\"&$L23,Rankings!$A:$E,3,FALSE))","v":""},{"$f":"IF(COUNTIF(Rankings!$A:$A,Setup!$B$13&\"-\"&$L23)>0,VLOOKUP(Setup!$B$13&\"-\"&$L23,Rankings!$A:$E,5,FALSE),0)","v":0},{"$f":"IF(COUNTIF(Rankings!$A:$A,Setup!$B$13&\"-\"&$L23)>0,VLOOKUP(Setup!$B$13&\"-\"&$L23,Rankings!$A:$E,4,FALSE),0)","v":0},3.7627597190890968E-2,3.7627597190890967E-5,3.7627597190890968E-2,3.7627597190890968E-2,3.7627597190890968E-2,0,3.7627597190890968E-2]
[22,0,0,5,0,0,null,{"$f":"IF($G24=\"\",\"\",VLOOKUP(Setup!$B$13&\"-\"&$G24,Rankings!$A:$E,2,FALSE))","v":""},{"$f":"IF($G24=\"\",\"\",VLOOKUP(Setup!$B$13&\"-\"&$G24,Rankings!$A:$E,3,FALSE))","v":""},{"$f":"IF(COUNTIF(Rankings!$A:$A,Setup!$B$13&\"-\"&$G24)>0,VLOOKUP(Setup!$B$13&\"-\"&$G24,Rankings!$A:$E,5,FALSE),0)","v":0},{"$f":"IF(COUNTIF(Rankings!$A:$A,Setup!$B$13&\"-\"&$G24)>0,VLOOKUP(Setup!$B$13&\"-\"&$G24,Rankings!$A:$E,4,FALSE),0)","v":0},null,{"$f":"IF($L24=\"\",\"\",VLOOKUP(Setup!$B$13&\"-\"&$L24,Rankings!$A:$E,2,FALSE))","v":""},{"$f":"IF($L24=\"\",\"\",VLOOKUP(Setup!$B$13&\"-\"&$L24,Rankings!$A:$E,3,FALSE))","v":""},{"$f":"IF(COUNTIF(Rankings!$A:$A,Setup!$B$13&\"-\"&$L24)>0,VLOOKUP(Setup!$B$13&\"-\"&$L24,Rankings!$A:$E,5,FALSE),0)","v":0},{"$f":"IF(COUNTIF(Rankings!$A:$A,Setup!$B$13&\"-\"&$L24)>0,VLOOKUP(Setup!$B$13&\"-\"&$L24,Rankings!$A:$E,4,FALSE),0)","v":0},3.6513062539042428E-2,3.6513062539042427E-5,3.6513062539042428E-2,3.6513062539042428E-2,3.6513062539042428E-2,0,3.6513062539042428E-2]
[23,0,0,5,0,0,null,{"$f":"IF($G25=\"\",\"\",VLOOKUP(Setup!$B$13&\"-\"&$G25,Rankings!$A:$E,2,FALSE))","v":""},{"$f":"IF($G25=\"\",\"\",VLOOKUP(Setup!$B$13&\"-\"&$G25,Rankings!$A:$E,3,FALSE))","v":""},{"$f":"IF(COUNTIF(Rankings!$A:$A,Setup!$B$13&\"-\"&$G25)>0,VLOOKUP(Setup!$B$13&\"-\"&$G25,Rankings!$A:$E,5,FALSE),0)","v":0},{"$f":"IF(COUNTIF(Rankings!$A:$A,Setup!$B$13&\"-\"&$G25)>0,VLOOKUP(Setup!$B$13&\"-\"&$G25,Rankings!$A:$E,4,FALSE),0)","v":0},null,{"$f":"IF($L25=\"\",\"\",VLOOKUP(Setup!$B$13&\"-\"&$L25,Rankings!$A:$E,2,FALSE))","v":""},{"$f":"IF($L25=\"\",\"\",VLOOKUP(Setup!$B$13&\"-\"&$L25,Rankings!$A:$E,3,FALSE))","v":""},{"$f":"IF(COUNTIF(Rankings!$A:$A,Setup!$B$13&\"-\"&$L25)>0,VLOOKUP(Setup!$B$13&\"-\"&$L25,Rankings!$A:$E,5,FALSE),0)","v":0},{"$f":"IF(COUNTIF(Rankings!$A:$A,Setup!$B$13&\"-\"&$L25)>0,VLOOKUP(Setup!$B$13&\"-\"&$L25,Rankings!$A:$E,4,FALSE),0)","v":0},3.5238146055760637E-2,3.5238146055760636E-5,3.5238146055760637E-2,3.5238146055760637E-2,3.5238146055760637E-2,0,3.5238146055760637E-2]
[24,0,0,5,0,0,null,{"$f":"IF($G26=\"\",\"\",VLOOKUP(Setup!$B$13&\"-\"&$G26,Rankings!$A:$E,2,FALSE))","v":""},{"$f":"IF($G26=\"\",\"\",VLOOKUP(Setup!$B$13&\"-\"&$G26,Rankings!$A:$E,3,FALSE))","v":""},{"$f":"IF(COUNTIF(Rankings!$A:$A,Setup!$B$13&\"-\"&$G26)>0,VLOOKUP(Setup!$B$13&\"-\"&$G26,Rankings!$A:$E,5,FALSE),0)","v":0},{"$f":"IF(COUNTIF(Rankings!$A:$A,Setup!$B$13&\"-\"&$G26)>0,VLOOKUP(Setup!$B$13&\"-\"&$G26,Rankings!$A:$E,4,FALSE),0)","v":0},null,{"$f":"IF($L26=\"\",\"\",VLOOKUP(Setup!$B$13&\"-\"&$L26,Rankings!$A:$E,2,FALSE))","v":""},{"$f":"IF($L26=\"\",\"\",VLOOKUP(Setup!$B$13&\"-\"&$L26,Rankings!$A:$E,3,FALSE))","v":""},{"$f":"IF(COUNTIF(Rankings!$A:$A,Setup!$B$13&\"-\"&$L26)>0,VLOOKUP(Setup!$B$13&\"-\"&$L26,Rankings!$A:$E,5,FALSE),0)","v":0},{"$f":"IF(COUNTIF(Rankings!$A:$A,Setup!$B$13&\"-\"&$L26)>0,VLOOKUP(Setup!$B$13&\"-\"&$L26,Rankings!$A:$E,4,FALSE),0)","v":0},3.4733831597236524E-2,3.4733831597236522E-5,3.4733831597236524E-2,3.4733831597236524E-2,3.4733831597236524E-2,0,3.4733831597236524E-2]
[25,0,0,5,0,0,null,{"$f":"IF($G27=\"\",\"\",VLOOKUP(Setup!$B$13&\"-\"&$G27,Rankings!$A:$E,2,FALSE))","v":""},{"$f":"IF($G27=\"\",\"\",VLOOKUP(Setup!$B$13&\"-\"&$G27,Rankings!$A:$E,3,FALSE))","v":""},{"$f":"IF(COUNTIF(Rankings!$A:$A,Setup!$B$13&\"-\"&$G27)>0,VLOOKUP(Setup!$B$13&\"-\"&$G27,Rankings!$A:$E,5,FALSE),0)","v":0},{"$f":"IF(COUNTIF(Rankings!$A:$A,Setup!$B$13&\"-\"&$G27)>0,VLOOKUP(Setup!$B$13&\"-\"&$G27,Rankings!$A:$E,4,FALSE),0)","v":0},null,{"$f":"IF($L27=\"\",\"\",VLOOKUP(Setup!$B$13&\"-\"&$L27,Rankings!$A:$E,2,FALSE))","v":""},{"$f":"IF($L27=\"\",\"\",VLOOKUP(Setup!$B$13&\"-\"&$L27,Rankings!$A:$E,3,FALSE))","v":""},{"$f":"IF(COUNTIF(Rankings!$A:$A,Setup!$B$13&\"-\"&$L27)>0,VLOOKUP(Setup!$B$13&\"-\"&$L27,Rankings!$A:$E,5,FALSE),0)","v":0},{"$f":"IF(COUNTIF(Rankings!$A:$A,Setup!$B$13&\"-\"&$L27)>0,VLOOKUP(Setup!$B$13&\"-\"&$L27,Rankings!$A:$E,4,FALSE),0)","v":0},3.4388212864654571E-2,3.438821286465457E-5,3.4388212864654571E-2,3.4388212864654571E-2,3.4388212864654571E-2,0,3.4388212864654571E-2]
[26,0,0,5,0,0,null,{"$f":"IF($G28=\"\",\"\",VLOOKUP(Setup!$B$13&\"-\"&$G28,Rankings!$A:$E,2,FALSE))","v":""},{"$f":"IF($G28=\"\",\"\",VLOOKUP(Setup!$B$13&\"-\"&$G28,Rankings!$A:$E,3,FALSE))","v":""},{"$f":"IF(COUNTIF(Rankings!$A:$A,Setup!$B$13&\"-\"&$G28)>0,VLOOKUP(Setup!$B$13&\"-\"&$G28,Rankings!$A:$E,5,FALSE),0)","v":0},{"$f":"IF(COUNTIF(Rankings!$A:$A,Setup!$B$13&\"-\"&$G28)>0,VLOOKUP(Setup!$B$13&\"-\"&$G28,Rankings!$A:$E,4,FALSE),0)","v":0},null,{"$f":"IF($L28=\"\",\"\",VLOOKUP(Setup!$B$13&\"-\"&$L28,Rankings!$A:$E,2,FALSE))","v":""},{"$f":"IF($L28=\"\",\"\",VLOOKUP(Setup!$B$13&\"-\"&$L28,Rankings!$A:$E,3,FALSE))","v":""},{"$f":"IF(COUNTIF(Rankings!$A:$A,Setup!$B$13&\"-\"&$L28)>0,VLOOKUP(Setup!$B$13&\"-\"&$L28,Rankings!$A:$E,5,FALSE),0)","v":0},{"$f":"IF(COUNTIF(Rankings!$A:$A,Setup!$B$13&\"-\"&$L28)>0,VLOOKUP(Setup!$B$13&\"-\"&$L28,Rankings!$A:$E,4,FALSE),0)","v":0},3.4314361544036179E-2,3.4314361544036182E-5,3.4314361544036179E-2,3.4314361544036179E-2,3.4314361544036179E-2,0,3.4314361544036179E-2]
[27,0,0,5,0,0,null,{"$f":"IF($G29=\"\",\"\",VLOOKUP(Setup!$B$13&\"-\"&$G29,Rankings!$A:$E,2,FALSE))","v":""},{"$f":"IF($G29=\"\",\"\",VLOOKUP(Setup!$B$13&\"-\"&$G29,Rankings!$A:$E,3,FALSE))","v":""},{"$f":"IF(COUNTIF(Rankings!$A:$A,Setup!$B$13&\"-\"&$G29)>0,VLOOKUP(Setup!$B$13&\"-\"&$G29,Rankings!$A:$E,5,FALSE),0)","v":0},{"$f":"IF(COUNTIF(Rankings!$A:$A,Setup!$B$13&\"-\"&$G29)>0,VLOOKUP(Setup!$B$13&\"-\"&$G29,Rankings!$A:$E,4,FALSE),0)","v":0},null,{"$f":"IF($L29=\"\",\"\",VLOOKUP(Setup!$B$13&\"-\"&$L29,Rankings!$A:$E,2,FALSE))","v":""},{"$f":"IF($L29=\"\",\"\",VLOOKUP(Setup!$B$13&\"-\"&$L29,Rankings!$A:$E,3,FALSE))","v":""},{"$f":"IF(COUNTIF(Rankings!$A:$A,Setup!$B$13&\"-\"&$L29)>0,VLOOKUP(Setup!$B$13&\"-\"&$L29,Rankings!$A:$E,5,FALSE),0)","v":0},{"$f":"IF(COUNTIF(Rankings!$A:$A,Setup!$B$13&\"-\"&$L29)>0,VLOOKUP(Setup!$B$13&\"-\"&$L29,Rankings!$A:$E,4,FALSE),0)","v":0},3.3829844140856415E-2,3.3829844140856415E-5,3.3829844140856415E-2,3.3829844140856415E-2,3.3829844140856415E-2,0,3.3829844140856415E-2]
[28,0,0,5,0,0,null,{"$f":"IF($G30=\"\",\"\",VLOOKUP(Setup!$B$13&\"-\"&$G30,Rankings!$A:$E,2,FALSE))","v":""},{"$f":"IF($G30=\"\",\"\",VLOOKUP(Setup!$B$13&\"-\"&$G30,Rankings!$A:$E,3,FALSE))","v":""},{"$f":"IF(COUNTIF(Rankings!$A:$A,Setup!$B$13&\"-\"&$G30)>0,VLOOKUP(Setup!$B$13&\"-\"&$G30,Rankings!$A:$E,5,FALSE),0)","v":0},{"$f":"IF(COUNTIF(Rankings!$A:$A,Setup!$B$13&\"-\"&$G30)>0,VLOOKUP(Setup!$B$13&\"-\"&$G30,Rankings!$A:$E,4,FALSE),0)","v":0},null,{"$f":"IF($L30=\"\",\"\",VLOOKUP(Setup!$B$13&\"-\"&$L30,Rankings!$A:$E,2,FALSE))","v":""},{"$f":"IF($L30=\"\",\"\",VLOOKUP(Setup!$B$13&\"-\"&$L30,Rankings!$A:$E,3,FALSE))","v":""},{"$f":"IF(COUNTIF(Rankings!$A:$A,Setup!$B$13&\"-\"&$L30)>0,VLOOKUP(Setup!$B$13&\"-\"&$L30,Rankings!$A:$E,5,FALSE),0)","v":0},{"$f":"IF(COUNTIF(Rankings!$A:$A,Setup!$B$13&\"-\"&$L30)>0,VLOOKUP(Setup!$B$13&\"-\"&$L30,Rankings!$A:$E,4,FALSE),0)","v":0},3.3145972746865128E-2,3.3145972746865129E-5,3.3145972746865128E-2,3.3145972746865128E-2,3.3145972746865128E-2,0,3.3145972746865128E-2]
[29,0,0,5,0,0,null,{"$f":"IF($G31=\"\",\"\",VLOOKUP(Setup!$B$13&\"-\"&$G31,Rankings!$A:$E,2,FALSE))","v":""},{"$f":"IF($G31=\"\",\"\",VLOOKUP(Setup!$B$13&\"-\"&$G31,Rankings!$A:$E,3,FALSE))","v":""},{"$f":"IF(COUNTIF(Rankings!$A:$A,Setup!$B$13&\"-\"&$G31)>0,VLOOKUP(Setup!$B$13&\"-\"&$G31,Rankings!$A:$E,5,FALSE),0)","v":0},{"$f":"IF(COUNTIF(Rankings!$A:$A,Setup!$B$13&\"-\"&$G31)>0,VLOOKUP(Setup!$B$13&\"-\"&$G31,Rankings!$A:$E,4,FALSE),0)","v":0},null,{"$f":"IF($L31=\"\",\"\",VLOOKUP(Setup!$B$13&\"-\"&$L31,Rankings!$A:$E,2,FALSE))","v":""},{"$f":"IF($L31=\"\",\"\",VLOOKUP(Setup!$B$13&\"-\"&$L31,Rankings!$A:$E,3,FALSE))","v":""},{"$f":"IF(COUNTIF(Rankings!$A:$A,Setup!$B$13&\"-\"&$L31)>0,VLOOKUP(Setup!$B$13&\"-\"&$L31,Rankings!$A:$E,5,FALSE),0)","v":0},{"$f":"IF(COUNTIF(Rankings!$A:$A,Setup!$B$13&\"-\"&$L31)>0,VLOOKUP(Setup!$B$13&\"-\"&$L31,Rankings!$A:$E,4,FALSE),0)","v":0},3.2933167049274063E-2,3.2933167049274063E-5,3.2933167049274063E-2,3.2933167049274063E-2,3.2933167049274063E-2,0,3.2933167049274063E-2]
[30,0,0,5,0,0,null,{"$f":"IF($G32=\"\",\"\",VLOOKUP(Setup!$B$13&\"-\"&$G32,Rankings!$A:$E,2,FALSE))","v":""},{"$f":"IF($G32=\"\",\"\",VLOOKUP(Setup!$B$13&\"-\"&$G32,Rankings!$A:$E,3,FALSE))","v":""},{"$f":"IF(COUNTIF(Rankings!$A:$A,Setup!$B$13&\"-\"&$G32)>0,VLOOKUP(Setup!$B$13&\"-\"&$G32,Rankings!$A:$E,5,FALSE),0)","v":0},{"$f":"IF(COUNTIF(Rankings!$A:$A,Setup!$B$13&\"-\"&$G32)>0,VLOOKUP(Setup!$B$13&\"-\"&$G32,Rankings!$A:$E,4,FALSE),0)","v":0},null,{"$f":"IF($L32=\"\",\"\",VLOOKUP(Setup!$B$13&\"-\"&$L32,Rankings!$A:$E,2,FALSE))","v":""},{"$f":"IF($L32=\"\",\"\",VLOOKUP(Setup!$B$13&\"-\"&$L32,Rankings!$A:$E,3,FALSE))","v":""},{"$f":"IF(COUNTIF(Rankings!$A:$A,Setup!$B$13&\"-\"&$L32)>0,VLOOKUP(Setup!$B$13&\"-\"&$L32,Rankings!$A:$E,5,FALSE),0)","v":0},{"$f":"IF(COUNTIF(Rankings!$A:$A,Setup!$B$13&\"-\"&$L32)>0,VLOOKUP(Setup!$B$13&\"-\"&$L32,Rankings!$A:$E,4,FALSE),0)","v":0},3.251491169991081E-2,3.2514911699910812E-5,3.251491169991081E-2,3.251491169991081E-2,3.251491169991081E-2,0,3.251491169991081E-2]
[31,0,0,5,0,0,null,{"$f":"IF($G33=\"\",\"\",VLOOKUP(Setup!$B$13&\"-\"&$G33,Rankings!$A:$E,2,FALSE))","v":""},{"$f":"IF($G33=\"\",\"\",VLOOKUP(Setup!$B$13&\"-\"&$G33,Rankings!$A:$E,3,FALSE))","v":""},{"$f":"IF(COUNTIF(Rankings!$A:$A,Setup!$B$13&\"-\"&$G33)>0,VLOOKUP(Setup!$B$13&\"-\"&$G33,Rankings!$A:$E,5,FALSE),0)","v":0},{"$f":"IF(COUNTIF(Rankings!$A:$A,Setup!$B$13&\"-\"&$G33)>0,VLOOKUP(Setup!$B$13&\"-\"&$G33,Rankings!$A:$E,4,FALSE),0)","v":0},null,{"$f":"IF($L33=\"\",\"\",VLOOKUP(Setup!$B$13&\"-\"&$L33,Rankings!$A:$E,2,FALSE))","v":""},{"$f":"IF($L33=\"\",\"\",VLOOKUP(Setup!$B$13&\"-\"&$L33,Rankings!$A:$E,3,FALSE))","v":""},{"$f":"IF(COUNTIF(Rankings!$A:$A,Setup!$B$13&\"-\"&$L33)>0,VLOOKUP(Setup!$B$13&\"-\"&$L33,Rankings!$A:$E,5,FALSE),0)","v":0},{"$f":"IF(COUNTIF(Rankings!$A:$A,Setup!$B$13&\"-\"&$L33)>0,VLOOKUP(Setup!$B$13&\"-\"&$L33,Rankings!$A:$E,4,FALSE),0)","v":0},3.0017024903125866E-2,3.0017024903125864E-5,3.0017024903125866E-2,3.0017024903125866E-2,3.0017024903125866E-2,0,3.0017024903125866E-2]
[32,0,0,5,0,0,null,{"$f":"IF($G34=\"\",\"\",VLOOKUP(Setup!$B$13&\"-\"&$G34,Rankings!$A:$E,2,FALSE))","v":""},{"$f":"IF($G34=\"\",\"\",VLOOKUP(Setup!$B$13&\"-\"&$G34,Rankings!$A:$E,3,FALSE))","v":""},{"$f":"IF(COUNTIF(Rankings!$A:$A,Setup!$B$13&\"-\"&$G34)>0,VLOOKUP(Setup!$B$13&\"-\"&$G34,Rankings!$A:$E,5,FALSE),0)","v":0},{"$f":"IF(COUNTIF(Rankings!$A:$A,Setup!$B$13&\"-\"&$G34)>0,VLOOKUP(Setup!$B$13&\"-\"&$G34,Rankings!$A:$E,4,FALSE),0)","v":0},null,{"$f":"IF($L34=\"\",\"\",VLOOKUP(Setup!$B$13&\"-\"&$L34,Rankings!$A:$E,2,FALSE))","v":""},{"$f":"IF($L34=\"\",\"\",VLOOKUP(Setup!$B$13&\"-\"&$L34,Rankings!$A:$E,3,FALSE))","v":""},{"$f":"IF(COUNTIF(Rankings!$A:$A,Setup!$B$13&\"-\"&$L34)>0,VLOOKUP(Setup!$B$13&\"-\"&$L34,Rankings!$A:$E,5,FALSE),0)","v":0},{"$f":"IF(COUNTIF(Rankings!$A:$A,Setup!$B$13&\"-\"&$L34)>0,VLOOKUP(Setup!$B$13&\"-\"&$L34,Rankings!$A:$E,4,FALSE),0)","v":0},2.7975524618067547E-2,2.7975524618067547E-5,2.7975524618067547E-2,2.7975524618067547E-2,2.7975524618067547E-2,0,2.7975524618067547E-2]
[33,{"$f":"J35+O35","v":0},{"$f":"K35+P35","v":0},{"$f":"IF(E35=2,1,IF(E35=1,2,IF(F35=2,3,IF(F35=1,4,5))))","v":5},{"$f":"COUNTIF(J35,\">0\")+COUNTIF(O35,\">0\")","v":0},{"$f":"COUNTIF(K35,\">0\")+COUNTIF(P35,\">0\")","v":0},null,{"$f":"IF($G35=\"\",\"\",VLOOKUP(Setup!$B$13&\"-\"&$G35,Rankings!$A:$E,2,FALSE))","v":""},{"$f":"IF($G35=\"\",\"\",VLOOKUP(Setup!$B$13&\"-\"&$G35,Rankings!$A:$E,3,FALSE))","v":""},{"$f":"IF(COUNTIF(Rankings!$A:$A,Setup!$B$13&\"-\"&$G35)>0,VLOOKUP(Setup!$B$13&\"-\"&$G35,Rankings!$A:$E,5,FALSE),0)","v":0},{"$f":"IF(COUNTIF(Rankings!$A:$A,Setup!$B$13&\"-\"&$G35)>0,VLOOKUP(Setup!$B$13&\"-\"&$G35,Rankings!$A:$E,4,FALSE),0)","v":0},null,{"$f":"IF($L35=\"\",\"\",VLOOKUP(Setup!$B$13&\"-\"&$L35,Rankings!$A:$E,2,FALSE))","v":""},{"$f":"IF($L35=\"\",\"\",VLOOKUP(Setup!$B$13&\"-\"&$L35,Rankings!$A:$E,3,FALSE))","v":""},{"$f":"IF(COUNTIF(Rankings!$A:$A,Setup!$B$13&\"-\"&$L35)>0,VLOOKUP(Setup!$B$13&\"-\"&$L35,Rankings!$A:$E,5,FALSE),0)","v":0},{"$f":"IF(COUNTIF(Rankings!$A:$A,Setup!$B$13&\"-\"&$L35)>0,VLOOKUP(Setup!$B$13&\"-\"&$L35,Rankings!$A:$E,4,FALSE),0)","v":0},{"$f":"B35+W35","v":2.7878712391499538E-2},{"$f":"IF(J35>0,(B35+P35/1000+W35/1000),(B35+K35/1000+W35/1000))","v":2.7878712391499537E-5},{"$f":"C35+W35","v":2.7878712391499538E-2},{"$f":"C35+W35","v":2.7878712391499538E-2},{"$f":"W35","v":2.7878712391499538E-2},{"$f":"IF(G35=\"\",0,VLOOKUP(D35,D35:U35,13+D35,FALSE))","v":0},2.7878712391499538E-2]
[34,0,0,5,0,0,null,{"$f":"IF($G36=\"\",\"\",VLOOKUP(Setup!$B$13&\"-\"&$G36,Rankings!$A:$E,2,FALSE))","v":""},{"$f":"IF($G36=\"\",\"\",VLOOKUP(Setup!$B$13&\"-\"&$G36,Rankings!$A:$E,3,FALSE))","v":""},{"$f":"IF(COUNTIF(Rankings!$A:$A,Setup!$B$13&\"-\"&$G36)>0,VLOOKUP(Setup!$B$13&\"-\"&$G36,Rankings!$A:$E,5,FALSE),0)","v":0},{"$f":"IF(COUNTIF(Rankings!$A:$A,Setup!$B$13&\"-\"&$G36)>0,VLOOKUP(Setup!$B$13&\"-\"&$G36,Rankings!$A:$E,4,FALSE),0)","v":0},null,{"$f":"IF($L36=\"\",\"\",VLOOKUP(Setup!$B$13&\"-\"&$L36,Rankings!$A:$E,2,FALSE))","v":""},{"$f":"IF($L36=\"\",\"\",VLOOKUP(Setup!$B$13&\"-\"&$L36,Rankings!$A:$E,3,FALSE))","v":""},{"$f":"IF(COUNTIF(Rankings!$A:$A,Setup!$B$13&\"-\"&$L36)>0,VLOOKUP(Setup!$B$13&\"-\"&$L36,Rankings!$A:$E,5,FALSE),0)","v":0},{"$f":"IF(COUNTIF(Rankings!$A:$A,Setup!$B$13&\"-\"&$L36)>0,VLOOKUP(Setup!$B$13&\"-\"&$L36,Rankings!$A:$E,4,FALSE),0)","v":0},2.781197050120646E-2,2.781197050120646E-5,2.781197050120646E-2,2.781197050120646E-2,2.781197050120646E-2,0,2.781197050120646E-2]
[35,0,0,5,0,0,null,{"$f":"IF($G37=\"\",\"\",VLOOKUP(Setup!$B$13&\"-\"&$G37,Rankings!$A:$E,2,FALSE))","v":""},{"$f":"IF($G37=\"\",\"\",VLOOKUP(Setup!$B$13&\"-\"&$G37,Rankings!$A:$E,3,FALSE))","v":""},{"$f":"IF(COUNTIF(Rankings!$A:$A,Setup!$B$13&\"-\"&$G37)>0,VLOOKUP(Setup!$B$13&\"-\"&$G37,Rankings!$A:$E,5,FALSE),0)","v":0},{"$f":"IF(COUNTIF(Rankings!$A:$A,Setup!$B$13&\"-\"&$G37)>0,VLOOKUP(Setup!$B$13&\"-\"&$G37,Rankings!$A:$E,4,FALSE),0)","v":0},null,{"$f":"IF($L37=\"\",\"\",VLOOKUP(Setup!$B$13&\"-\"&$L37,Rankings!$A:$E,2,FALSE))","v":""},{"$f":"IF($L37=\"\",\"\",VLOOKUP(Setup!$B$13&\"-\"&$L37,Rankings!$A:$E,3,FALSE))","v":""},{"$f":"IF(COUNTIF(Rankings!$A:$A,Setup!$B$13&\"-\"&$L37)>0,VLOOKUP(Setup!$B$13&\"-\"&$L37,Rankings!$A:$E,5,FALSE),0)","v":0},{"$f":"IF(COUNTIF(Rankings!$A:$A,Setup!$B$13&\"-\"&$L37)>0,VLOOKUP(Setup!$B$13&\"-\"&$L37,Rankings!$A:$E,4,FALSE),0)","v":0},2.5958941610439424E-2,2.5958941610439425E-5,2.5958941610439424E-2,2.5958941610439424E-2,2.5958941610439424E-2,0,2.5958941610439424E-2]
[36,0,0,5,0,0,null,{"$f":"IF($G38=\"\",\"\",VLOOKUP(Setup!$B$13&\"-\"&$G38,Rankings!$A:$E,2,FALSE))","v":""},{"$f":"IF($G38=\"\",\"\",VLOOKUP(Setup!$B$13&\"-\"&$G38,Rankings!$A:$E,3,FALSE))","v":""},{"$f":"IF(COUNTIF(Rankings!$A:$A,Setup!$B$13&\"-\"&$G38)>0,VLOOKUP(Setup!$B$13&\"-\"&$G38,Rankings!$A:$E,5,FALSE),0)","v":0},{"$f":"IF(COUNTIF(Rankings!$A:$A,Setup!$B$13&\"-\"&$G38)>0,VLOOKUP(Setup!$B$13&\"-\"&$G38,Rankings!$A:$E,4,FALSE),0)","v":0},null,{"$f":"IF($L38=\"\",\"\",VLOOKUP(Setup!$B$13&\"-\"&$L38,Rankings!$A:$E,2,FALSE))","v":""},{"$f":"IF($L38=\"\",\"\",VLOOKUP(Setup!$B$13&\"-\"&$L38,Rankings!$A:$E,3,FALSE))","v":""},{"$f":"IF(COUNTIF(Rankings!$A:$A,Setup!$B$13&\"-\"&$L38)>0,VLOOKUP(Setup!$B$13&\"-\"&$L38,Rankings!$A:$E,5,FALSE),0)","v":0},{"$f":"IF(COUNTIF(Rankings!$A:$A,Setup!$B$13&\"-\"&$L38)>0,VLOOKUP(Setup!$B$13&\"-\"&$L38,Rankings!$A:$E,4,FALSE),0)","v":0},2.5069922215317151E-2,2.506992221531715E-5,2.5069922215317151E-2,2.5069922215317151E-2,2.5069922215317151E-2,0,2.5069922215317151E-2]
[37,0,0,5,0,0,null,{"$f":"IF($G39=\"\",\"\",VLOOKUP(Setup!$B$13&\"-\"&$G39,Rankings!$A:$E,2,FALSE))","v":""},{"$f":"IF($G39=\"\",\"\",VLOOKUP(Setup!$B$13&\"-\"&$G39,Rankings!$A:$E,3,FALSE))","v":""},{"$f":"IF(COUNTIF(Rankings!$A:$A,Setup!$B$13&\"-\"&$G39)>0,VLOOKUP(Setup!$B$13&\"-\"&$G39,Rankings!$A:$E,5,FALSE),0)","v":0},{"$f":"IF(COUNTIF(Rankings!$A:$A,Setup!$B$13&\"-\"&$G39)>0,VLOOKUP(Setup!$B$13&\"-\"&$G39,Rankings!$A:$E,4,FALSE),0)","v":0},null,{"$f":"IF($L39=\"\",\"\",VLOOKUP(Setup!$B$13&\"-\"&$L39,Rankings!$A:$E,2,FALSE))","v":""},{"$f":"IF($L39=\"\",\"\",VLOOKUP(Setup!$B$13&\"-\"&$L39,Rankings!$A:$E,3,FALSE))","v":""},{"$f":"IF(COUNTIF(Rankings!$A:$A,Setup!$B$13&\"-\"&$L39)>0,VLOOKUP(Setup!$B$13&\"-\"&$L39,Rankings!$A:$E,5,FALSE),0)","v":0},{"$f":"IF(COUNTIF(Rankings!$A:$A,Setup!$B$13&\"-\"&$L39)>0,VLOOKUP(Setup!$B$13&\"-\"&$L39,Rankings!$A:$E,4,FALSE),0)","v":0},2.4309252361079049E-2,2.4309252361079049E-5,2.4309252361079049E-2,2.4309252361079049E-2,2.4309252361079049E-2,0,2.4309252361079049E-2]
[38,0,0,5,0,0,null,{"$f":"IF($G40=\"\",\"\",VLOOKUP(Setup!$B$13&\"-\"&$G40,Rankings!$A:$E,2,FALSE))","v":""},{"$f":"IF($G40=\"\",\"\",VLOOKUP(Setup!$B$13&\"-\"&$G40,Rankings!$A:$E,3,FALSE))","v":""},{"$f":"IF(COUNTIF(Rankings!$A:$A,Setup!$B$13&\"-\"&$G40)>0,VLOOKUP(Setup!$B$13&\"-\"&$G40,Rankings!$A:$E,5,FALSE),0)","v":0},{"$f":"IF(COUNTIF(Rankings!$A:$A,Setup!$B$13&\"-\"&$G40)>0,VLOOKUP(Setup!$B$13&\"-\"&$G40,Rankings!$A:$E,4,FALSE),0)","v":0},null,{"$f":"IF($L40=\"\",\"\",VLOOKUP(Setup!$B$13&\"-\"&$L40,Rankings!$A:$E,2,FALSE))","v":""},{"$f":"IF($L40=\"\",\"\",VLOOKUP(Setup!$B$13&\"-\"&$L40,Rankings!$A:$E,3,FALSE))","v":""},{"$f":"IF(COUNTIF(Rankings!$A:$A,Setup!$B$13&\"-\"&$L40)>0,VLOOKUP(Setup!$B$13&\"-\"&$L40,Rankings!$A:$E,5,FALSE),0)","v":0},{"$f":"IF(COUNTIF(Rankings!$A:$A,Setup!$B$13&\"-\"&$L40)>0,VLOOKUP(Setup!$B$13&\"-\"&$L40,Rankings!$A:$E,4,FALSE),0)","v":0},2.3629002680783353E-2,2.3629002680783354E-5,2.3629002680783353E-2,2.3629002680783353E-2,2.3629002680783353E-2,0,2.3629002680783353E-2]
[39,0,0,5,0,0,null,{"$f":"IF($G41=\"\",\"\",VLOOKUP(Setup!$B$13&\"-\"&$G41,Rankings!$A:$E,2,FALSE))","v":""},{"$f":"IF($G41=\"\",\"\",VLOOKUP(Setup!$B$13&\"-\"&$G41,Rankings!$A:$E,3,FALSE))","v":""},{"$f":"IF(COUNTIF(Rankings!$A:$A,Setup!$B$13&\"-\"&$G41)>0,VLOOKUP(Setup!$B$13&\"-\"&$G41,Rankings!$A:$E,5,FALSE),0)","v":0},{"$f":"IF(COUNTIF(Rankings!$A:$A,Setup!$B$13&\"-\"&$G41)>0,VLOOKUP(Setup!$B$13&\"-\"&$G41,Rankings!$A:$E,4,FALSE),0)","v":0},null,{"$f":"IF($L41=\"\",\"\",VLOOKUP(Setup!$B$13&\"-\"&$L41,Rankings!$A:$E,2,FALSE))","v":""},{"$f":"IF($L41=\"\",\"\",VLOOKUP(Setup!$B$13&\"-\"&$L41,Rankings!$A:$E,3,FALSE))","v":""},{"$f":"IF(COUNTIF(Rankings!$A:$A,Setup!$B$13&\"-\"&$L41)>0,VLOOKUP(Setup!$B$13&\"-\"&$L41,Rankings!$A:$E,5,FALSE),0)","v":0},{"$f":"IF(COUNTIF(Rankings!$A:$A,Setup!$B$13&\"-\"&$L41)>0,VLOOKUP(Setup!$B$13&\"-\"&$L41,Rankings!$A:$E,4,FALSE),0)","v":0},2.3610198845519091E-2,2.361019884551909E-5,2.3610198845519091E-2,2.3610198845519091E-2,2.3610198845519091E-2,0,2.3610198845519091E-2]
[40,0,0,5,0,0,null,{"$f":"IF($G42=\"\",\"\",VLOOKUP(Setup!$B$13&\"-\"&$G42,Rankings!$A:$E,2,FALSE))","v":""},{"$f":"IF($G42=\"\",\"\",VLOOKUP(Setup!$B$13&\"-\"&$G42,Rankings!$A:$E,3,FALSE))","v":""},{"$f":"IF(COUNTIF(Rankings!$A:$A,Setup!$B$13&\"-\"&$G42)>0,VLOOKUP(Setup!$B$13&\"-\"&$G42,Rankings!$A:$E,5,FALSE),0)","v":0},{"$f":"IF(COUNTIF(Rankings!$A:$A,Setup!$B$13&\"-\"&$G42)>0,VLOOKUP(Setup!$B$13&\"-\"&$G42,Rankings!$A:$E,4,FALSE),0)","v":0},null,{"$f":"IF($L42=\"\",\"\",VLOOKUP(Setup!$B$13&\"-\"&$L42,Rankings!$A:$E,2,FALSE))","v":""},{"$f":"IF($L42=\"\",\"\",VLOOKUP(Setup!$B$13&\"-\"&$L42,Rankings!$A:$E,3,FALSE))","v":""},{"$f":"IF(COUNTIF(Rankings!$A:$A,Setup!$B$13&\"-\"&$L42)>0,VLOOKUP(Setup!$B$13&\"-\"&$L42,Rankings!$A:$E,5,FALSE),0)","v":0},{"$f":"IF(COUNTIF(Rankings!$A:$A,Setup!$B$13&\"-\"&$L42)>0,VLOOKUP(Setup!$B$13&\"-\"&$L42,Rankings!$A:$E,4,FALSE),0)","v":0},2.226394754404951E-2,2.226394754404951E-5,2.226394754404951E-2,2.226394754404951E-2,2.226394754404951E-2,0,2.226394754404951E-2]
[41,0,0,5,0,0,null,{"$f":"IF($G43=\"\",\"\",VLOOKUP(Setup!$B$13&\"-\"&$G43,Rankings!$A:$E,2,FALSE))","v":""},{"$f":"IF($G43=\"\",\"\",VLOOKUP(Setup!$B$13&\"-\"&$G43,Rankings!$A:$E,3,FALSE))","v":""},{"$f":"IF(COUNTIF(Rankings!$A:$A,Setup!$B$13&\"-\"&$G43)>0,VLOOKUP(Setup!$B$13&\"-\"&$G43,Rankings!$A:$E,5,FALSE),0)","v":0},{"$f":"IF(COUNTIF(Rankings!$A:$A,Setup!$B$13&\"-\"&$G43)>0,VLOOKUP(Setup!$B$13&\"-\"&$G43,Rankings!$A:$E,4,FALSE),0)","v":0},null,{"$f":"IF($L43=\"\",\"\",VLOOKUP(Setup!$B$13&\"-\"&$L43,Rankings!$A:$E,2,FALSE))","v":""},{"$f":"IF($L43=\"\",\"\",VLOOKUP(Setup!$B$13&\"-\"&$L43,Rankings!$A:$E,3,FALSE))","v":""},{"$f":"IF(COUNTIF(Rankings!$A:$A,Setup!$B$13&\"-\"&$L43)>0,VLOOKUP(Setup!$B$13&\"-\"&$L43,Rankings!$A:$E,5,FALSE),0)","v":0},{"$f":"IF(COUNTIF(Rankings!$A:$A,Setup!$B$13&\"-\"&$L43)>0,VLOOKUP(Setup!$B$13&\"-\"&$L43,Rankings!$A:$E,4,FALSE),0)","v":0},2.2100984810082724E-2,2.2100984810082724E-5,2.2100984810082724E-2,2.2100984810082724E-2,2.2100984810082724E-2,0,2.2100984810082724E-2]
[42,0,0,5,0,0,null,{"$f":"IF($G44=\"\",\"\",VLOOKUP(Setup!$B$13&\"-\"&$G44,Rankings!$A:$E,2,FALSE))","v":""},{"$f":"IF($G44=\"\",\"\",VLOOKUP(Setup!$B$13&\"-\"&$G44,Rankings!$A:$E,3,FALSE))","v":""},{"$f":"IF(COUNTIF(Rankings!$A:$A,Setup!$B$13&\"-\"&$G44)>0,VLOOKUP(Setup!$B$13&\"-\"&$G44,Rankings!$A:$E,5,FALSE),0)","v":0},{"$f":"IF(COUNTIF(Rankings!$A:$A,Setup!$B$13&\"-\"&$G44)>0,VLOOKUP(Setup!$B$13&\"-\"&$G44,Rankings!$A:$E,4,FALSE),0)","v":0},null,{"$f":"IF($L44=\"\",\"\",VLOOKUP(Setup!$B$13&\"-\"&$L44,Rankings!$A:$E,2,FALSE))","v":""},{"$f":"IF($L44=\"\",\"\",VLOOKUP(Setup!$B$13&\"-\"&$L44,Rankings!$A:$E,3,FALSE))","v":""},{"$f":"IF(COUNTIF(Rankings!$A:$A,Setup!$B$13&\"-\"&$L44)>0,VLOOKUP(Setup!$B$13&\"-\"&$L44,Rankings!$A:$E,5,FALSE),0)","v":0},{"$f":"IF(COUNTIF(Rankings!$A:$A,Setup!$B$13&\"-\"&$L44)>0,VLOOKUP(Setup!$B$13&\"-\"&$L44,Rankings!$A:$E,4,FALSE),0)","v":0},2.1887126077770394E-2,2.1887126077770395E-5,2.1887126077770394E-2,2.1887126077770394E-2,2.1887126077770394E-2,0,2.1887126077770394E-2]
[43,0,0,5,0,0,null,{"$f":"IF($G45=\"\",\"\",VLOOKUP(Setup!$B$13&\"-\"&$G45,Rankings!$A:$E,2,FALSE))","v":""},{"$f":"IF($G45=\"\",\"\",VLOOKUP(Setup!$B$13&\"-\"&$G45,Rankings!$A:$E,3,FALSE))","v":""},{"$f":"IF(COUNTIF(Rankings!$A:$A,Setup!$B$13&\"-\"&$G45)>0,VLOOKUP(Setup!$B$13&\"-\"&$G45,Rankings!$A:$E,5,FALSE),0)","v":0},{"$f":"IF(COUNTIF(Rankings!$A:$A,Setup!$B$13&\"-\"&$G45)>0,VLOOKUP(Setup!$B$13&\"-\"&$G45,Rankings!$A:$E,4,FALSE),0)","v":0},null,{"$f":"IF($L45=\"\",\"\",VLOOKUP(Setup!$B$13&\"-\"&$L45,Rankings!$A:$E,2,FALSE))","v":""},{"$f":"IF($L45=\"\",\"\",VLOOKUP(Setup!$B$13&\"-\"&$L45,Rankings!$A:$E,3,FALSE))","v":""},{"$f":"IF(COUNTIF(Rankings!$A:$A,Setup!$B$13&\"-\"&$L45)>0,VLOOKUP(Setup!$B$13&\"-\"&$L45,Rankings!$A:$E,5,FALSE),0)","v":0},{"$f":"IF(COUNTIF(Rankings!$A:$A,Setup!$B$13&\"-\"&$L45)>0,VLOOKUP(Setup!$B$13&\"-\"&$L45,Rankings!$A:$E,4,FALSE),0)","v":0},1.9977450973708569E-2,1.9977450973708571E-5,1.9977450973708569E-2,1.9977450973708569E-2,1.9977450973708569E-2,0,1.9977450973708569E-2]
[44,0,0,5,0,0,null,{"$f":"IF($G46=\"\",\"\",VLOOKUP(Setup!$B$13&\"-\"&$G46,Rankings!$A:$E,2,FALSE))","v":""},{"$f":"IF($G46=\"\",\"\",VLOOKUP(Setup!$B$13&\"-\"&$G46,Rankings!$A:$E,3,FALSE))","v":""},{"$f":"IF(COUNTIF(Rankings!$A:$A,Setup!$B$13&\"-\"&$G46)>0,VLOOKUP(Setup!$B$13&\"-\"&$G46,Rankings!$A:$E,5,FALSE),0)","v":0},{"$f":"IF(COUNTIF(Rankings!$A:$A,Setup!$B$13&\"-\"&$G46)>0,VLOOKUP(Setup!$B$13&\"-\"&$G46,Rankings!$A:$E,4,FALSE),0)","v":0},null,{"$f":"IF($L46=\"\",\"\",VLOOKUP(Setup!$B$13&\"-\"&$L46,Rankings!$A:$E,2,FALSE))","v":""},{"$f":"IF($L46=\"\",\"\",VLOOKUP(Setup!$B$13&\"-\"&$L46,Rankings!$A:$E,3,FALSE))","v":""},{"$f":"IF(COUNTIF(Rankings!$A:$A,Setup!$B$13&\"-\"&$L46)>0,VLOOKUP(Setup!$B$13&\"-\"&$L46,Rankings!$A:$E,5,FALSE),0)","v":0},{"$f":"IF(COUNTIF(Rankings!$A:$A,Setup!$B$13&\"-\"&$L46)>0,VLOOKUP(Setup!$B$13&\"-\"&$L46,Rankings!$A:$E,4,FALSE),0)","v":0},1.6740312314857789E-2,1.6740312314857789E-5,1.6740312314857789E-2,1.6740312314857789E-2,1.6740312314857789E-2,0,1.6740312314857789E-2]
[45,0,0,5,0,0,null,{"$f":"IF($G47=\"\",\"\",VLOOKUP(Setup!$B$13&\"-\"&$G47,Rankings!$A:$E,2,FALSE))","v":""},{"$f":"IF($G47=\"\",\"\",VLOOKUP(Setup!$B$13&\"-\"&$G47,Rankings!$A:$E,3,FALSE))","v":""},{"$f":"IF(COUNTIF(Rankings!$A:$A,Setup!$B$13&\"-\"&$G47)>0,VLOOKUP(Setup!$B$13&\"-\"&$G47,Rankings!$A:$E,5,FALSE),0)","v":0},{"$f":"IF(COUNTIF(Rankings!$A:$A,Setup!$B$13&\"-\"&$G47)>0,VLOOKUP(Setup!$B$13&\"-\"&$G47,Rankings!$A:$E,4,FALSE),0)","v":0},null,{"$f":"IF($L47=\"\",\"\",VLOOKUP(Setup!$B$13&\"-\"&$L47,Rankings!$A:$E,2,FALSE))","v":""},{"$f":"IF($L47=\"\",\"\",VLOOKUP(Setup!$B$13&\"-\"&$L47,Rankings!$A:$E,3,FALSE))","v":""},{"$f":"IF(COUNTIF(Rankings!$A:$A,Setup!$B$13&\"-\"&$L47)>0,VLOOKUP(Setup!$B$13&\"-\"&$L47,Rankings!$A:$E,5,FALSE),0)","v":0},{"$f":"IF(COUNTIF(Rankings!$A:$A,Setup!$B$13&\"-\"&$L47)>0,VLOOKUP(Setup!$B$13&\"-\"&$L47,Rankings!$A:$E,4,FALSE),0)","v":0},1.5189556802775672E-2,1.5189556802775673E-5,1.5189556802775672E-2,1.5189556802775672E-2,1.5189556802775672E-2,0,1.5189556802775672E-2]
[46,0,0,5,0,0,null,{"$f":"IF($G48=\"\",\"\",VLOOKUP(Setup!$B$13&\"-\"&$G48,Rankings!$A:$E,2,FALSE))","v":""},{"$f":"IF($G48=\"\",\"\",VLOOKUP(Setup!$B$13&\"-\"&$G48,Rankings!$A:$E,3,FALSE))","v":""},{"$f":"IF(COUNTIF(Rankings!$A:$A,Setup!$B$13&\"-\"&$G48)>0,VLOOKUP(Setup!$B$13&\"-\"&$G48,Rankings!$A:$E,5,FALSE),0)","v":0},{"$f":"IF(COUNTIF(Rankings!$A:$A,Setup!$B$13&\"-\"&$G48)>0,VLOOKUP(Setup!$B$13&\"-\"&$G48,Rankings!$A:$E,4,FALSE),0)","v":0},null,{"$f":"IF($L48=\"\",\"\",VLOOKUP(Setup!$B$13&\"-\"&$L48,Rankings!$A:$E,2,FALSE))","v":""},{"$f":"IF($L48=\"\",\"\",VLOOKUP(Setup!$B$13&\"-\"&$L48,Rankings!$A:$E,3,FALSE))","v":""},{"$f":"IF(COUNTIF(Rankings!$A:$A,Setup!$B$13&\"-\"&$L48)>0,VLOOKUP(Setup!$B$13&\"-\"&$L48,Rankings!$A:$E,5,FALSE),0)","v":0},{"$f":"IF(COUNTIF(Rankings!$A:$A,Setup!$B$13&\"-\"&$L48)>0,VLOOKUP(Setup!$B$13&\"-\"&$L48,Rankings!$A:$E,4,FALSE),0)","v":0},1.3693414951109146E-2,1.3693414951109146E-5,1.3693414951109146E-2,1.3693414951109146E-2,1.3693414951109146E-2,0,1.3693414951109146E-2]
[47,0,0,5,0,0,null,{"$f":"IF($G49=\"\",\"\",VLOOKUP(Setup!$B$13&\"-\"&$G49,Rankings!$A:$E,2,FALSE))","v":""},{"$f":"IF($G49=\"\",\"\",VLOOKUP(Setup!$B$13&\"-\"&$G49,Rankings!$A:$E,3,FALSE))","v":""},{"$f":"IF(COUNTIF(Rankings!$A:$A,Setup!$B$13&\"-\"&$G49)>0,VLOOKUP(Setup!$B$13&\"-\"&$G49,Rankings!$A:$E,5,FALSE),0)","v":0},{"$f":"IF(COUNTIF(Rankings!$A:$A,Setup!$B$13&\"-\"&$G49)>0,VLOOKUP(Setup!$B$13&\"-\"&$G49,Rankings!$A:$E,4,FALSE),0)","v":0},null,{"$f":"IF($L49=\"\",\"\",VLOOKUP(Setup!$B$13&\"-\"&$L49,Rankings!$A:$E,2,FALSE))","v":""},{"$f":"IF($L49=\"\",\"\",VLOOKUP(Setup!$B$13&\"-\"&$L49,Rankings!$A:$E,3,FALSE))","v":""},{"$f":"IF(COUNTIF(Rankings!$A:$A,Setup!$B$13&\"-\"&$L49)>0,VLOOKUP(Setup!$B$13&\"-\"&$L49,Rankings!$A:$E,5,FALSE),0)","v":0},{"$f":"IF(COUNTIF(Rankings!$A:$A,Setup!$B$13&\"-\"&$L49)>0,VLOOKUP(Setup!$B$13&\"-\"&$L49,Rankings!$A:$E,4,FALSE),0)","v":0},1.3490016277999718E-2,1.3490016277999718E-5,1.3490016277999718E-2,1.3490016277999718E-2,1.3490016277999718E-2,0,1.3490016277999718E-2]
[48,0,0,5,0,0,null,{"$f":"IF($G50=\"\",\"\",VLOOKUP(Setup!$B$13&\"-\"&$G50,Rankings!$A:$E,2,FALSE))","v":""},{"$f":"IF($G50=\"\",\"\",VLOOKUP(Setup!$B$13&\"-\"&$G50,Rankings!$A:$E,3,FALSE))","v":""},{"$f":"IF(COUNTIF(Rankings!$A:$A,Setup!$B$13&\"-\"&$G50)>0,VLOOKUP(Setup!$B$13&\"-\"&$G50,Rankings!$A:$E,5,FALSE),0)","v":0},{"$f":"IF(COUNTIF(Rankings!$A:$A,Setup!$B$13&\"-\"&$G50)>0,VLOOKUP(Setup!$B$13&\"-\"&$G50,Rankings!$A:$E,4,FALSE),0)","v":0},null,{"$f":"IF($L50=\"\",\"\",VLOOKUP(Setup!$B$13&\"-\"&$L50,Rankings!$A:$E,2,FALSE))","v":""},{"$f":"IF($L50=\"\",\"\",VLOOKUP(Setup!$B$13&\"-\"&$L50,Rankings!$A:$E,3,FALSE))","v":""},{"$f":"IF(COUNTIF(Rankings!$A:$A,Setup!$B$13&\"-\"&$L50)>0,VLOOKUP(Setup!$B$13&\"-\"&$L50,Rankings!$A:$E,5,FALSE),0)","v":0},{"$f":"IF(COUNTIF(Rankings!$A:$A,Setup!$B$13&\"-\"&$L50)>0,VLOOKUP(Setup!$B$13&\"-\"&$L50,Rankings!$A:$E,4,FALSE),0)","v":0},1.2866523881327445E-2,1.2866523881327445E-5,1.2866523881327445E-2,1.2866523881327445E-2,1.2866523881327445E-2,0,1.2866523881327445E-2]
[49,0,0,5,0,0,null,{"$f":"IF($G51=\"\",\"\",VLOOKUP(Setup!$B$13&\"-\"&$G51,Rankings!$A:$E,2,FALSE))","v":""},{"$f":"IF($G51=\"\",\"\",VLOOKUP(Setup!$B$13&\"-\"&$G51,Rankings!$A:$E,3,FALSE))","v":""},{"$f":"IF(COUNTIF(Rankings!$A:$A,Setup!$B$13&\"-\"&$G51)>0,VLOOKUP(Setup!$B$13&\"-\"&$G51,Rankings!$A:$E,5,FALSE),0)","v":0},{"$f":"IF(COUNTIF(Rankings!$A:$A,Setup!$B$13&\"-\"&$G51)>0,VLOOKUP(Setup!$B$13&\"-\"&$G51,Rankings!$A:$E,4,FALSE),0)","v":0},null,{"$f":"IF($L51=\"\",\"\",VLOOKUP(Setup!$B$13&\"-\"&$L51,Rankings!$A:$E,2,FALSE))","v":""},{"$f":"IF($L51=\"\",\"\",VLOOKUP(Setup!$B$13&\"-\"&$L51,Rankings!$A:$E,3,FALSE))","v":""},{"$f":"IF(COUNTIF(Rankings!$A:$A,Setup!$B$13&\"-\"&$L51)>0,VLOOKUP(Setup!$B$13&\"-\"&$L51,Rankings!$A:$E,5,FALSE),0)","v":0},{"$f":"IF(COUNTIF(Rankings!$A:$A,Setup!$B$13&\"-\"&$L51)>0,VLOOKUP(Setup!$B$13&\"-\"&$L51,Rankings!$A:$E,4,FALSE),0)","v":0},1.2511545882030174E-2,1.2511545882030174E-5,1.2511545882030174E-2,1.2511545882030174E-2,1.2511545882030174E-2,0,1.2511545882030174E-2]
[50,0,0,5,0,0,null,{"$f":"IF($G52=\"\",\"\",VLOOKUP(Setup!$B$13&\"-\"&$G52,Rankings!$A:$E,2,FALSE))","v":""},{"$f":"IF($G52=\"\",\"\",VLOOKUP(Setup!$B$13&\"-\"&$G52,Rankings!$A:$E,3,FALSE))","v":""},{"$f":"IF(COUNTIF(Rankings!$A:$A,Setup!$B$13&\"-\"&$G52)>0,VLOOKUP(Setup!$B$13&\"-\"&$G52,Rankings!$A:$E,5,FALSE),0)","v":0},{"$f":"IF(COUNTIF(Rankings!$A:$A,Setup!$B$13&\"-\"&$G52)>0,VLOOKUP(Setup!$B$13&\"-\"&$G52,Rankings!$A:$E,4,FALSE),0)","v":0},null,{"$f":"IF($L52=\"\",\"\",VLOOKUP(Setup!$B$13&\"-\"&$L52,Rankings!$A:$E,2,FALSE))","v":""},{"$f":"IF($L52=\"\",\"\",VLOOKUP(Setup!$B$13&\"-\"&$L52,Rankings!$A:$E,3,FALSE))","v":""},{"$f":"IF(COUNTIF(Rankings!$A:$A,Setup!$B$13&\"-\"&$L52)>0,VLOOKUP(Setup!$B$13&\"-\"&$L52,Rankings!$A:$E,5,FALSE),0)","v":0},{"$f":"IF(COUNTIF(Rankings!$A:$A,Setup!$B$13&\"-\"&$L52)>0,VLOOKUP(Setup!$B$13&\"-\"&$L52,Rankings!$A:$E,4,FALSE),0)","v":0},1.201579860675544E-2,1.201579860675544E-5,1.201579860675544E-2,1.201579860675544E-2,1.201579860675544E-2,0,1.201579860675544E-2]
[51,0,0,5,0,0,null,{"$f":"IF($G53=\"\",\"\",VLOOKUP(Setup!$B$13&\"-\"&$G53,Rankings!$A:$E,2,FALSE))","v":""},{"$f":"IF($G53=\"\",\"\",VLOOKUP(Setup!$B$13&\"-\"&$G53,Rankings!$A:$E,3,FALSE))","v":""},{"$f":"IF(COUNTIF(Rankings!$A:$A,Setup!$B$13&\"-\"&$G53)>0,VLOOKUP(Setup!$B$13&\"-\"&$G53,Rankings!$A:$E,5,FALSE),0)","v":0},{"$f":"IF(COUNTIF(Rankings!$A:$A,Setup!$B$13&\"-\"&$G53)>0,VLOOKUP(Setup!$B$13&\"-\"&$G53,Rankings!$A:$E,4,FALSE),0)","v":0},null,{"$f":"IF($L53=\"\",\"\",VLOOKUP(Setup!$B$13&\"-\"&$L53,Rankings!$A:$E,2,FALSE))","v":""},{"$f":"IF($L53=\"\",\"\",VLOOKUP(Setup!$B$13&\"-\"&$L53,Rankings!$A:$E,3,FALSE))","v":""},{"$f":"IF(COUNTIF(Rankings!$A:$A,Setup!$B$13&\"-\"&$L53)>0,VLOOKUP(Setup!$B$13&\"-\"&$L53,Rankings!$A:$E,5,FALSE),0)","v":0},{"$f":"IF(COUNTIF(Rankings!$A:$A,Setup!$B$13&\"-\"&$L53)>0,VLOOKUP(Setup!$B$13&\"-\"&$L53,Rankings!$A:$E,4,FALSE),0)","v":0},1.1969071547523902E-2,1.1969071547523902E-5,1.1969071547523902E-2,1.1969071547523902E-2,1.1969071547523902E-2,0,1.1969071547523902E-2]
[52,0,0,5,0,0,null,{"$f":"IF($G54=\"\",\"\",VLOOKUP(Setup!$B$13&\"-\"&$G54,Rankings!$A:$E,2,FALSE))","v":""},{"$f":"IF($G54=\"\",\"\",VLOOKUP(Setup!$B$13&\"-\"&$G54,Rankings!$A:$E,3,FALSE))","v":""},{"$f":"IF(COUNTIF(Rankings!$A:$A,Setup!$B$13&\"-\"&$G54)>0,VLOOKUP(Setup!$B$13&\"-\"&$G54,Rankings!$A:$E,5,FALSE),0)","v":0},{"$f":"IF(COUNTIF(Rankings!$A:$A,Setup!$B$13&\"-\"&$G54)>0,VLOOKUP(Setup!$B$13&\"-\"&$G54,Rankings!$A:$E,4,FALSE),0)","v":0},null,{"$f":"IF($L54=\"\",\"\",VLOOKUP(Setup!$B$13&\"-\"&$L54,Rankings!$A:$E,2,FALSE))","v":""},{"$f":"IF($L54=\"\",\"\",VLOOKUP(Setup!$B$13&\"-\"&$L54,Rankings!$A:$E,3,FALSE))","v":""},{"$f":"IF(COUNTIF(Rankings!$A:$A,Setup!$B$13&\"-\"&$L54)>0,VLOOKUP(Setup!$B$13&\"-\"&$L54,Rankings!$A:$E,5,FALSE),0)","v":0},{"$f":"IF(COUNTIF(Rankings!$A:$A,Setup!$B$13&\"-\"&$L54)>0,VLOOKUP(Setup!$B$13&\"-\"&$L54,Rankings!$A:$E,4,FALSE),0)","v":0},1.0907259421687042E-2,1.0907259421687043E-5,1.0907259421687042E-2,1.0907259421687042E-2,1.0907259421687042E-2,0,1.0907259421687042E-2]
[53,0,0,5,0,0,null,{"$f":"IF($G55=\"\",\"\",VLOOKUP(Setup!$B$13&\"-\"&$G55,Rankings!$A:$E,2,FALSE))","v":""},{"$f":"IF($G55=\"\",\"\",VLOOKUP(Setup!$B$13&\"-\"&$G55,Rankings!$A:$E,3,FALSE))","v":""},{"$f":"IF(COUNTIF(Rankings!$A:$A,Setup!$B$13&\"-\"&$G55)>0,VLOOKUP(Setup!$B$13&\"-\"&$G55,Rankings!$A:$E,5,FALSE),0)","v":0},{"$f":"IF(COUNTIF(Rankings!$A:$A,Setup!$B$13&\"-\"&$G55)>0,VLOOKUP(Setup!$B$13&\"-\"&$G55,Rankings!$A:$E,4,FALSE),0)","v":0},null,{"$f":"IF($L55=\"\",\"\",VLOOKUP(Setup!$B$13&\"-\"&$L55,Rankings!$A:$E,2,FALSE))","v":""},{"$f":"IF($L55=\"\",\"\",VLOOKUP(Setup!$B$13&\"-\"&$L55,Rankings!$A:$E,3,FALSE))","v":""},{"$f":"IF(COUNTIF(Rankings!$A:$A,Setup!$B$13&\"-\"&$L55)>0,VLOOKUP(Setup!$B$13&\"-\"&$L55,Rankings!$A:$E,5,FALSE),0)","v":0},{"$f":"IF(COUNTIF(Rankings!$A:$A,Setup!$B$13&\"-\"&$L55)>0,VLOOKUP(Setup!$B$13&\"-\"&$L55,Rankings!$A:$E,4,FALSE),0)","v":0},1.0218488859543269E-2,1.0218488859543269E-5,1.0218488859543269E-2,1.0218488859543269E-2,1.0218488859543269E-2,0,1.0218488859543269E-2]
[54,0,0,5,0,0,null,{"$f":"IF($G56=\"\",\"\",VLOOKUP(Setup!$B$13&\"-\"&$G56,Rankings!$A:$E,2,FALSE))","v":""},{"$f":"IF($G56=\"\",\"\",VLOOKUP(Setup!$B$13&\"-\"&$G56,Rankings!$A:$E,3,FALSE))","v":""},{"$f":"IF(COUNTIF(Rankings!$A:$A,Setup!$B$13&\"-\"&$G56)>0,VLOOKUP(Setup!$B$13&\"-\"&$G56,Rankings!$A:$E,5,FALSE),0)","v":0},{"$f":"IF(COUNTIF(Rankings!$A:$A,Setup!$B$13&\"-\"&$G56)>0,VLOOKUP(Setup!$B$13&\"-\"&$G56,Rankings!$A:$E,4,FALSE),0)","v":0},null,{"$f":"IF($L56=\"\",\"\",VLOOKUP(Setup!$B$13&\"-\"&$L56,Rankings!$A:$E,2,FALSE))","v":""},{"$f":"IF($L56=\"\",\"\",VLOOKUP(Setup!$B$13&\"-\"&$L56,Rankings!$A:$E,3,FALSE))","v":""},{"$f":"IF(COUNTIF(Rankings!$A:$A,Setup!$B$13&\"-\"&$L56)>0,VLOOKUP(Setup!$B$13&\"-\"&$L56,Rankings!$A:$E,5,FALSE),0)","v":0},{"$f":"IF(COUNTIF(Rankings!$A:$A,Setup!$B$13&\"-\"&$L56)>0,VLOOKUP(Setup!$B$13&\"-\"&$L56,Rankings!$A:$E,4,FALSE),0)","v":0},9.7415684614897587E-3,9.7415684614897594E-6,9.7415684614897587E-3,9.7415684614897587E-3,9.7415684614897587E-3,0,9.7415684614897587E-3]
[55,0,0,5,0,0,null,{"$f":"IF($G57=\"\",\"\",VLOOKUP(Setup!$B$13&\"-\"&$G57,Rankings!$A:$E,2,FALSE))","v":""},{"$f":"IF($G57=\"\",\"\",VLOOKUP(Setup!$B$13&\"-\"&$G57,Rankings!$A:$E,3,FALSE))","v":""},{"$f":"IF(COUNTIF(Rankings!$A:$A,Setup!$B$13&\"-\"&$G57)>0,VLOOKUP(Setup!$B$13&\"-\"&$G57,Rankings!$A:$E,5,FALSE),0)","v":0},{"$f":"IF(COUNTIF(Rankings!$A:$A,Setup!$B$13&\"-\"&$G57)>0,VLOOKUP(Setup!$B$13&\"-\"&$G57,Rankings!$A:$E,4,FALSE),0)","v":0},null,{"$f":"IF($L57=\"\",\"\",VLOOKUP(Setup!$B$13&\"-\"&$L57,Rankings!$A:$E,2,FALSE))","v":""},{"$f":"IF($L57=\"\",\"\",VLOOKUP(Setup!$B$13&\"-\"&$L57,Rankings!$A:$E,3,FALSE))","v":""},{"$f":"IF(COUNTIF(Rankings!$A:$A,Setup!$B$13&\"-\"&$L57)>0,VLOOKUP(Setup!$B$13&\"-\"&$L57,Rankings!$A:$E,5,FALSE),0)","v":0},{"$f":"IF(COUNTIF(Rankings!$A:$A,Setup!$B$13&\"-\"&$L57)>0,VLOOKUP(Setup!$B$13&\"-\"&$L57,Rankings!$A:$E,4,FALSE),0)","v":0},7.6622926021615379E-3,7.6622926021615372E-6,7.6622926021615379E-3,7.6622926021615379E-3,7.6622926021615379E-3,0,7.6622926021615379E-3]
[56,0,0,5,0,0,null,{"$f":"IF($G58=\"\",\"\",VLOOKUP(Setup!$B$13&\"-\"&$G58,Rankings!$A:$E,2,FALSE))","v":""},{"$f":"IF($G58=\"\",\"\",VLOOKUP(Setup!$B$13&\"-\"&$G58,Rankings!$A:$E,3,FALSE))","v":""},{"$f":"IF(COUNTIF(Rankings!$A:$A,Setup!$B$13&\"-\"&$G58)>0,VLOOKUP(Setup!$B$13&\"-\"&$G58,Rankings!$A:$E,5,FALSE),0)","v":0},{"$f":"IF(COUNTIF(Rankings!$A:$A,Setup!$B$13&\"-\"&$G58)>0,VLOOKUP(Setup!$B$13&\"-\"&$G58,Rankings!$A:$E,4,FALSE),0)","v":0},null,{"$f":"IF($L58=\"\",\"\",VLOOKUP(Setup!$B$13&\"-\"&$L58,Rankings!$A:$E,2,FALSE))","v":""},{"$f":"IF($L58=\"\",\"\",VLOOKUP(Setup!$B$13&\"-\"&$L58,Rankings!$A:$E,3,FALSE))","v":""},{"$f":"IF(COUNTIF(Rankings!$A:$A,Setup!$B$13&\"-\"&$L58)>0,VLOOKUP(Setup!$B$13&\"-\"&$L58,Rankings!$A:$E,5,FALSE),0)","v":0},{"$f":"IF(COUNTIF(Rankings!$A:$A,Setup!$B$13&\"-\"&$L58)>0,VLOOKUP(Setup!$B$13&\"-\"&$L58,Rankings!$A:$E,4,FALSE),0)","v":0},6.2745213797389095E-3,6.2745213797389096E-6,6.2745213797389095E-3,6.2745213797389095E-3,6.2745213797389095E-3,0,6.2745213797389095E-3]
[57,0,0,5,0,0,null,{"$f":"IF($G59=\"\",\"\",VLOOKUP(Setup!$B$13&\"-\"&$G59,Rankings!$A:$E,2,FALSE))","v":""},{"$f":"IF($G59=\"\",\"\",VLOOKUP(Setup!$B$13&\"-\"&$G59,Rankings!$A:$E,3,FALSE))","v":""},{"$f":"IF(COUNTIF(Rankings!$A:$A,Setup!$B$13&\"-\"&$G59)>0,VLOOKUP(Setup!$B$13&\"-\"&$G59,Rankings!$A:$E,5,FALSE),0)","v":0},{"$f":"IF(COUNTIF(Rankings!$A:$A,Setup!$B$13&\"-\"&$G59)>0,VLOOKUP(Setup!$B$13&\"-\"&$G59,Rankings!$A:$E,4,FALSE),0)","v":0},null,{"$f":"IF($L59=\"\",\"\",VLOOKUP(Setup!$B$13&\"-\"&$L59,Rankings!$A:$E,2,FALSE))","v":""},{"$f":"IF($L59=\"\",\"\",VLOOKUP(Setup!$B$13&\"-\"&$L59,Rankings!$A:$E,3,FALSE))","v":""},{"$f":"IF(COUNTIF(Rankings!$A:$A,Setup!$B$13&\"-\"&$L59)>0,VLOOKUP(Setup!$B$13&\"-\"&$L59,Rankings!$A:$E,5,FALSE),0)","v":0},{"$f":"IF(COUNTIF(Rankings!$A:$A,Setup!$B$13&\"-\"&$L59)>0,VLOOKUP(Setup!$B$13&\"-\"&$L59,Rankings!$A:$E,4,FALSE),0)","v":0},6.1465522288429823E-3,6.1465522288429821E-6,6.1465522288429823E-3,6.1465522288429823E-3,6.1465522288429823E-3,0,6.1465522288429823E-3]
[58,0,0,5,0,0,null,{"$f":"IF($G60=\"\",\"\",VLOOKUP(Setup!$B$13&\"-\"&$G60,Rankings!$A:$E,2,FALSE))","v":""},{"$f":"IF($G60=\"\",\"\",VLOOKUP(Setup!$B$13&\"-\"&$G60,Rankings!$A:$E,3,FALSE))","v":""},{"$f":"IF(COUNTIF(Rankings!$A:$A,Setup!$B$13&\"-\"&$G60)>0,VLOOKUP(Setup!$B$13&\"-\"&$G60,Rankings!$A:$E,5,FALSE),0)","v":0},{"$f":"IF(COUNTIF(Rankings!$A:$A,Setup!$B$13&\"-\"&$G60)>0,VLOOKUP(Setup!$B$13&\"-\"&$G60,Rankings!$A:$E,4,FALSE),0)","v":0},null,{"$f":"IF($L60=\"\",\"\",VLOOKUP(Setup!$B$13&\"-\"&$L60,Rankings!$A:$E,2,FALSE))","v":""},{"$f":"IF($L60=\"\",\"\",VLOOKUP(Setup!$B$13&\"-\"&$L60,Rankings!$A:$E,3,FALSE))","v":""},{"$f":"IF(COUNTIF(Rankings!$A:$A,Setup!$B$13&\"-\"&$L60)>0,VLOOKUP(Setup!$B$13&\"-\"&$L60,Rankings!$A:$E,5,FALSE),0)","v":0},{"$f":"IF(COUNTIF(Rankings!$A:$A,Setup!$B$13&\"-\"&$L60)>0,VLOOKUP(Setup!$B$13&\"-\"&$L60,Rankings!$A:$E,4,FALSE),0)","v":0},5.9834451407245548E-3,5.9834451407245545E-6,5.9834451407245548E-3,5.9834451407245548E-3,5.9834451407245548E-3,0,5.9834451407245548E-3]
[59,0,0,5,0,0,null,{"$f":"IF($G61=\"\",\"\",VLOOKUP(Setup!$B$13&\"-\"&$G61,Rankings!$A:$E,2,FALSE))","v":""},{"$f":"IF($G61=\"\",\"\",VLOOKUP(Setup!$B$13&\"-\"&$G61,Rankings!$A:$E,3,FALSE))","v":""},{"$f":"IF(COUNTIF(Rankings!$A:$A,Setup!$B$13&\"-\"&$G61)>0,VLOOKUP(Setup!$B$13&\"-\"&$G61,Rankings!$A:$E,5,FALSE),0)","v":0},{"$f":"IF(COUNTIF(Rankings!$A:$A,Setup!$B$13&\"-\"&$G61)>0,VLOOKUP(Setup!$B$13&\"-\"&$G61,Rankings!$A:$E,4,FALSE),0)","v":0},null,{"$f":"IF($L61=\"\",\"\",VLOOKUP(Setup!$B$13&\"-\"&$L61,Rankings!$A:$E,2,FALSE))","v":""},{"$f":"IF($L61=\"\",\"\",VLOOKUP(Setup!$B$13&\"-\"&$L61,Rankings!$A:$E,3,FALSE))","v":""},{"$f":"IF(COUNTIF(Rankings!$A:$A,Setup!$B$13&\"-\"&$L61)>0,VLOOKUP(Setup!$B$13&\"-\"&$L61,Rankings!$A:$E,5,FALSE),0)","v":0},{"$f":"IF(COUNTIF(Rankings!$A:$A,Setup!$B$13&\"-\"&$L61)>0,VLOOKUP(Setup!$B$13&\"-\"&$L61,Rankings!$A:$E,4,FALSE),0)","v":0},5.283575895968496E-3,5.2835758959684958E-6,5.283575895968496E-3,5.283575895968496E-3,5.283575895968496E-3,0,5.283575895968496E-3]
[60,0,0,5,0,0,null,{"$f":"IF($G62=\"\",\"\",VLOOKUP(Setup!$B$13&\"-\"&$G62,Rankings!$A:$E,2,FALSE))","v":""},{"$f":"IF($G62=\"\",\"\",VLOOKUP(Setup!$B$13&\"-\"&$G62,Rankings!$A:$E,3,FALSE))","v":""},{"$f":"IF(COUNTIF(Rankings!$A:$A,Setup!$B$13&\"-\"&$G62)>0,VLOOKUP(Setup!$B$13&\"-\"&$G62,Rankings!$A:$E,5,FALSE),0)","v":0},{"$f":"IF(COUNTIF(Rankings!$A:$A,Setup!$B$13&\"-\"&$G62)>0,VLOOKUP(Setup!$B$13&\"-\"&$G62,Rankings!$A:$E,4,FALSE),0)","v":0},null,{"$f":"IF($L62=\"\",\"\",VLOOKUP(Setup!$B$13&\"-\"&$L62,Rankings!$A:$E,2,FALSE))","v":""},{"$f":"IF($L62=\"\",\"\",VLOOKUP(Setup!$B$13&\"-\"&$L62,Rankings!$A:$E,3,FALSE))","v":""},{"$f":"IF(COUNTIF(Rankings!$A:$A,Setup!$B$13&\"-\"&$L62)>0,VLOOKUP(Setup!$B$13&\"-\"&$L62,Rankings!$A:$E,5,FALSE),0)","v":0},{"$f":"IF(COUNTIF(Rankings!$A:$A,Setup!$B$13&\"-\"&$L62)>0,VLOOKUP(Setup!$B$13&\"-\"&$L62,Rankings!$A:$E,4,FALSE),0)","v":0},4.9035516606613545E-3,4.9035516606613544E-6,4.9035516606613545E-3,4.9035516606613545E-3,4.9035516606613545E-3,0,4.9035516606613545E-3]
[61,0,0,5,0,0,null,{"$f":"IF($G63=\"\",\"\",VLOOKUP(Setup!$B$13&\"-\"&$G63,Rankings!$A:$E,2,FALSE))","v":""},{"$f":"IF($G63=\"\",\"\",VLOOKUP(Setup!$B$13&\"-\"&$G63,Rankings!$A:$E,3,FALSE))","v":""},{"$f":"IF(COUNTIF(Rankings!$A:$A,Setup!$B$13&\"-\"&$G63)>0,VLOOKUP(Setup!$B$13&\"-\"&$G63,Rankings!$A:$E,5,FALSE),0)","v":0},{"$f":"IF(COUNTIF(Rankings!$A:$A,Setup!$B$13&\"-\"&$G63)>0,VLOOKUP(Setup!$B$13&\"-\"&$G63,Rankings!$A:$E,4,FALSE),0)","v":0},null,{"$f":"IF($L63=\"\",\"\",VLOOKUP(Setup!$B$13&\"-\"&$L63,Rankings!$A:$E,2,FALSE))","v":""},{"$f":"IF($L63=\"\",\"\",VLOOKUP(Setup!$B$13&\"-\"&$L63,Rankings!$A:$E,3,FALSE))","v":""},{"$f":"IF(COUNTIF(Rankings!$A:$A,Setup!$B$13&\"-\"&$L63)>0,VLOOKUP(Setup!$B$13&\"-\"&$L63,Rankings!$A:$E,5,FALSE),0)","v":0},{"$f":"IF(COUNTIF(Rankings!$A:$A,Setup!$B$13&\"-\"&$L63)>0,VLOOKUP(Setup!$B$13&\"-\"&$L63,Rankings!$A:$E,4,FALSE),0)","v":0},4.1045206795773193E-3,4.1045206795773194E-6,4.1045206795773193E-3,4.1045206795773193E-3,4.1045206795773193E-3,0,4.1045206795773193E-3]
[62,0,0,5,0,0,null,{"$f":"IF($G64=\"\",\"\",VLOOKUP(Setup!$B$13&\"-\"&$G64,Rankings!$A:$E,2,FALSE))","v":""},{"$f":"IF($G64=\"\",\"\",VLOOKUP(Setup!$B$13&\"-\"&$G64,Rankings!$A:$E,3,FALSE))","v":""},{"$f":"IF(COUNTIF(Rankings!$A:$A,Setup!$B$13&\"-\"&$G64)>0,VLOOKUP(Setup!$B$13&\"-\"&$G64,Rankings!$A:$E,5,FALSE),0)","v":0},{"$f":"IF(COUNTIF(Rankings!$A:$A,Setup!$B$13&\"-\"&$G64)>0,VLOOKUP(Setup!$B$13&\"-\"&$G64,Rankings!$A:$E,4,FALSE),0)","v":0},null,{"$f":"IF($L64=\"\",\"\",VLOOKUP(Setup!$B$13&\"-\"&$L64,Rankings!$A:$E,2,FALSE))","v":""},{"$f":"IF($L64=\"\",\"\",VLOOKUP(Setup!$B$13&\"-\"&$L64,Rankings!$A:$E,3,FALSE))","v":""},{"$f":"IF(COUNTIF(Rankings!$A:$A,Setup!$B$13&\"-\"&$L64)>0,VLOOKUP(Setup!$B$13&\"-\"&$L64,Rankings!$A:$E,5,FALSE),0)","v":0},{"$f":"IF(COUNTIF(Rankings!$A:$A,Setup!$B$13&\"-\"&$L64)>0,VLOOKUP(Setup!$B$13&\"-\"&$L64,Rankings!$A:$E,4,FALSE),0)","v":0},3.9210337622193163E-3,3.921033762219316E-6,3.9210337622193163E-3,3.9210337622193163E-3,3.9210337622193163E-3,0,3.9210337622193163E-3]
[63,0,0,5,0,0,null,{"$f":"IF($G65=\"\",\"\",VLOOKUP(Setup!$B$13&\"-\"&$G65,Rankings!$A:$E,2,FALSE))","v":""},{"$f":"IF($G65=\"\",\"\",VLOOKUP(Setup!$B$13&\"-\"&$G65,Rankings!$A:$E,3,FALSE))","v":""},{"$f":"IF(COUNTIF(Rankings!$A:$A,Setup!$B$13&\"-\"&$G65)>0,VLOOKUP(Setup!$B$13&\"-\"&$G65,Rankings!$A:$E,5,FALSE),0)","v":0},{"$f":"IF(COUNTIF(Rankings!$A:$A,Setup!$B$13&\"-\"&$G65)>0,VLOOKUP(Setup!$B$13&\"-\"&$G65,Rankings!$A:$E,4,FALSE),0)","v":0},null,{"$f":"IF($L65=\"\",\"\",VLOOKUP(Setup!$B$13&\"-\"&$L65,Rankings!$A:$E,2,FALSE))","v":""},{"$f":"IF($L65=\"\",\"\",VLOOKUP(Setup!$B$13&\"-\"&$L65,Rankings!$A:$E,3,FALSE))","v":""},{"$f":"IF(COUNTIF(Rankings!$A:$A,Setup!$B$13&\"-\"&$L65)>0,VLOOKUP(Setup!$B$13&\"-\"&$L65,Rankings!$A:$E,5,FALSE),0)","v":0},{"$f":"IF(COUNTIF(Rankings!$A:$A,Setup!$B$13&\"-\"&$L65)>0,VLOOKUP(Setup!$B$13&\"-\"&$L65,Rankings!$A:$E,4,FALSE),0)","v":0},2.4271227114927223E-3,2.4271227114927224E-6,2.4271227114927223E-3,2.4271227114927223E-3,2.4271227114927223E-3,0,2.4271227114927223E-3]
[64,0,0,5,0,0,null,{"$f":"IF($G66=\"\",\"\",VLOOKUP(Setup!$B$13&\"-\"&$G66,Rankings!$A:$E,2,FALSE))","v":""},{"$f":"IF($G66=\"\",\"\",VLOOKUP(Setup!$B$13&\"-\"&$G66,Rankings!$A:$E,3,FALSE))","v":""},{"$f":"IF(COUNTIF(Rankings!$A:$A,Setup!$B$13&\"-\"&$G66)>0,VLOOKUP(Setup!$B$13&\"-\"&$G66,Rankings!$A:$E,5,FALSE),0)","v":0},{"$f":"IF(COUNTIF(Rankings!$A:$A,Setup!$B$13&\"-\"&$G66)>0,VLOOKUP(Setup!$B$13&\"-\"&$G66,Rankings!$A:$E,4,FALSE),0)","v":0},null,{"$f":"IF($L66=\"\",\"\",VLOOKUP(Setup!$B$13&\"-\"&$L66,Rankings!$A:$E,2,FALSE))","v":""},{"$f":"IF($L66=\"\",\"\",VLOOKUP(Setup!$B$13&\"-\"&$L66,Rankings!$A:$E,3,FALSE))","v":""},{"$f":"IF(COUNTIF(Rankings!$A:$A,Setup!$B$13&\"-\"&$L66)>0,VLOOKUP(Setup!$B$13&\"-\"&$L66,Rankings!$A:$E,5,FALSE),0)","v":0},{"$f":"IF(COUNTIF(Rankings!$A:$A,Setup!$B$13&\"-\"&$L66)>0,VLOOKUP(Setup!$B$13&\"-\"&$L66,Rankings!$A:$E,4,FALSE),0)","v":0},3.616525415892837E-5,3.616525415892837E-8,3.616525415892837E-5,3.616525415892837E-5,3.616525415892837E-5,0,3.616525415892837E-5]

{"sheet":"MD","index":2,"n_rows":67,"n_cols":29,"rows_kept":67,"cut":false,"hidden":false,"merged":[[41,7,41,9],[34,0,35,0],[40,7,40,9],[4,0,5,0],[6,0,7,0],[8,0,9,0],[10,0,11,0],[12,0,13,0],[14,0,15,0],[16,0,17,0],[32,0,33,0],[30,0,31,0],[18,0,19,0],[20,0,21,0],[22,0,23,0],[24,0,25,0],[10,5,11,5],[12,5,13,5],[26,0,27,0],[28,0,29,0],[26,5,27,5],[20,5,21,5],[0,0,0,13],[22,5,23,5],[24,5,25,5],[42,7,42,9],[43,7,43,9],[28,5,29,5],[30,5,31,5],[32,5,33,5],[34,5,35,5],[14,5,15,5],[16,5,17,5],[18,5,19,5],[2,7,2,9],[4,5,5,5],[6,5,7,5],[8,5,9,5]]}
[{"$f":"Setup!B3 & \", \" & Setup!B4 & \", \" & Setup!B6 & \", \" & Setup!B8 & \"-\" & Setup!B9","v":"ΕΦΟΑ, 1ο Ε2 2014, ΗΡΑΚΛΕΙΟ Ο.Α.Α., 28 Φεβ-2 Μαρ"},null,null,null,null,null,null,null,null,null,null,null,null,null,null,{"$f":"Setup!$B$7","v":"Α12 Δ"}]
[null,{"$f":"Setup!$B$18","v":5},null,null,null,null,{"$f":"\"p\"&VLOOKUP(Setup!$B$5,tmp!$K$23:$P$34,2,FALSE)","v":"p1"},null,null,null,null,{"$f":"\"p\"&VLOOKUP(Setup!$B$5,tmp!$K$23:$P$34,3,FALSE)","v":"p2"},null,{"$f":"\"p\"&VLOOKUP(Setup!$B$5,tmp!$K$23:$P$34,4,FALSE)","v":"p3"},null,{"$f":"\"p\"&VLOOKUP(Setup!$B$5,tmp!$K$28:$P$34,5,FALSE)&\"-\"&VLOOKUP(Setup!$B$5,tmp!$K$28:$P$34,6,FALSE)","v":"p4-8"}]
[null,null,null,null,null,null,null,16,null,null,null,8,null,4,null,"2 & w"]
["α/α",null,"ByeOrder","ByeSum","ByeCnt","seed","  Α.Μ.  ","Ονοματεπώνυμο","επώνυμο","Σύλλογος",null,null,null,null,null,null,null,null,null,null,null,null,null,null,null," "]
[1,1,null,null,0,{"$f":"VLOOKUP($B5,Setup!$G$12:$H$27,2,FALSE)","v":1},{"$f":"IF(Setup!$B$25=\"#\",0,IF(F5>0,VLOOKUP(F5,DrawPrep!$A$3:$N$18,7,FALSE),0))","v":31285},{"$f":"IF(G5>0,VLOOKUP(G5,DrawPrep!$G$3:$N$18,2,FALSE),\"bye\")","v":"ΚΩΣΤΟΥΡΟΣ ΔΗΜΗΤΡΙΟΣ"},{"$f":"IF(NOT(G5>0),\"\", IF(ISERROR(FIND(\"-\",H5)), LEFT(H5,FIND(\" \",H5)-1),  IF(FIND(\"-\",H5)>FIND(\" \",H5),LEFT(H5,FIND(\" \",H5)-1),   LEFT(H5,FIND(\"-\",H5)-1)    )))","v":"ΚΩΣΤΟΥΡΟΣ"},{"$f":"IF($G5>0,VLOOKUP($G5,DrawPrep!$G$3:$L$18,3,FALSE),\"\")","v":"ΠΕΥΚΗ Γ.ΚΑΛΟΒΕΛΩΝΗΣ"},null,{"$f":"UPPER(IF($A$2=\"R\",IF(OR(K6=1,K6=\"a\"),G5,IF(OR(K6=2,K6=\"b\"),G7,\"\")),IF(OR(K6=1,K6=\"1\"),I5,IF(OR(K6=2,K6=\"b\"),I7,\"\"))))","v":"ΚΩΣΤΟΥΡΟΣ"},null,null,null,null,null,null,null,null,null,null,null,{"$f":"G5","v":31285},{"$f":"H5","v":"ΚΩΣΤΟΥΡΟΣ ΔΗΜΗΤΡΙΟΣ"},null,{"$f":"L5","v":"ΚΩΣΤΟΥΡΟΣ"}]
[null,null,null,null,null,null,{"$f":"IF(Setup!$B$25=\"#\",0,IF(F5>0,VLOOKUP(F5,DrawPrep!$A$3:$N$18,12,FALSE),0))","v":29179},{"$f":"IF(G6>0,VLOOKUP(G6,DrawPrep!$L$3:$N$18,2,FALSE),\" \")","v":"ΤΑΜΙΩΛΑΚΗΣ ΧΡΥΣΟΒΑΛΑΝΤΗΣ"},{"$f":"IF(NOT(G6>0),\"\", IF(ISERROR(FIND(\"-\",H6)), LEFT(H6,FIND(\" \",H6)-1),  IF(FIND(\"-\",H6)>FIND(\" \",H6),LEFT(H6,FIND(\" \",H6)-1),   LEFT(H6,FIND(\"-\",H6)-1)    )))","v":"ΤΑΜΙΩΛΑΚΗΣ"},{"$f":"IF($G6>0,VLOOKUP($G6,DrawPrep!$L$3:$N$18,3,FALSE),\"\")","v":"ΗΡΑΚΛΕΙΟ Ο.Α.& Α."},1,{"$f":"UPPER(IF($A$2=\"R\",IF(OR(K6=1,K6=\"a\"),G6,IF(OR(K6=2,K6=\"b\"),G8,\"\")),IF(OR(K6=1,K6=\"1\"),I6,IF(OR(K6=2,K6=\"b\"),I8,\"\"))))","v":"ΤΑΜΙΩΛΑΚΗΣ"},null,null,null,null,null,null,null,null,null,null,null,{"$f":"G6","v":29179},"ΤΑΜΙΩΛΑΚΗΣ ΧΡΥΣΟΒΑΛΑΝΤΗΣ",null,{"$f":"L6","v":"ΤΑΜΙΩΛΑΚΗΣ"}]
[2,{"$f":"1-D7+4","v":4},1,{"$f":"E7","v":1},{"$f":"IF($B$2>=C7,1,0)","v":1},{"$f":"IF($B$2>=C7,\"-\",VLOOKUP($B7,Setup!$G$12:$H$27,2,FALSE))","v":"-"},{"$f":"IF(Setup!$B$25=\"#\",0,IF(NOT(F7=\"-\"),VLOOKUP(F7,DrawPrep!$A$3:$N$18,7,FALSE),0))","v":0},{"$f":"IF(G7>0,VLOOKUP(G7,DrawPrep!$G$3:$L$18,2,FALSE),\"bye\")","v":"bye"},"",{"$f":"IF($G7>0,VLOOKUP($G7,DrawPrep!$G$3:$L$18,3,FALSE),\"\")","v":""},null,null,null,{"$f":"UPPER(IF($A$2=\"R\",IF(OR(M8=1,M8=\"a\"),L5,IF(OR(M8=2,M7=\"b\"),L9,\"\")),IF(OR(M8=1,M8=\"a\"),L5,IF(OR(M8=2,M8=\"b\"),L9,\"\"))))","v":"ΚΩΣΤΟΥΡΟΣ"},null,null,null,null,null,null,null,null,null,0,"bye",null,0,{"$f":"N7","v":"ΚΩΣΤΟΥΡΟΣ"}]
[null,null,null,null,null,null,{"$f":"IF(Setup!$B$25=\"#\",0,IF(NOT(F7=\"-\"),VLOOKUP(F7,DrawPrep!$A$3:$N$18,12,FALSE),0))","v":0},{"$f":"IF(G8>0,VLOOKUP(G8,DrawPrep!$L$3:$N$18,2,FALSE),\" \")","v":" "},"",{"$f":"IF($G8>0,VLOOKUP($G8,DrawPrep!$L$3:$N$18,3,FALSE),\"\")","v":""},null,null,1,{"$f":"UPPER(IF($A$2=\"R\",IF(OR(M8=1,M8=\"a\"),L6,IF(OR(M8=2,M8=\"b\"),L10,\"\")),IF(OR(M8=1,M8=\"a\"),L6,IF(OR(M8=2,M8=\"b\"),L10,\"\"))))","v":"ΤΑΜΙΩΛΑΚΗΣ"},null,null,null,null,null,null,null,null,null,0," ",null,null,{"$f":"N8","v":"ΤΑΜΙΩΛΑΚΗΣ"}]
[3,{"$f":"2-D9+4","v":5},null,{"$f":"D7+E9","v":1},0,{"$f":"VLOOKUP($B9,Setup!$G$12:$H$27,2,FALSE)","v":10},{"$f":"IF(Setup!$B$25=\"#\",0,IF(F9>0,VLOOKUP(F9,DrawPrep!$A$3:$N$18,7,FALSE),0))","v":30977},{"$f":"IF(G9>0,VLOOKUP(G9,DrawPrep!$G$3:$L$18,2,FALSE),\"bye\")","v":"ΝΟΥΧΑΚΗΣ ΓΕΩΡΓΙΟΣ"},"ΝΟΥΧΑΚΗΣ",{"$f":"IF($G9>0,VLOOKUP($G9,DrawPrep!$G$3:$L$18,3,FALSE),\"\")","v":"Ο.Α.ΣΟΥΔΑΣ"},null,{"$f":"UPPER(IF($A$2=\"R\",IF(OR(K10=1,K10=\"a\"),G9,IF(OR(K10=2,K10=\"b\"),G11,\"\")),IF(OR(K10=1,K10=\"1\"),I9,IF(OR(K10=2,K10=\"b\"),I11,\"\"))))","v":"ΝΟΥΧΑΚΗΣ"},null,"61, 60",null,null,null,null,null,null,null,null,null,30977,"ΝΟΥΧΑΚΗΣ ΓΕΩΡΓΙΟΣ",null,"ΝΟΥΧΑΚΗΣ","61, 60"]
[null,null,null,null,null,null,{"$f":"IF(Setup!$B$25=\"#\",0,IF(F9>0,VLOOKUP(F9,DrawPrep!$A$3:$N$18,12,FALSE),0))","v":32659},{"$f":"IF(G10>0,VLOOKUP(G10,DrawPrep!$L$3:$N$18,2,FALSE),\" \")","v":"ΑΣΤΡΕΙΝΙΔΗΣ ΦΙΛΙΠΠΟΣ"},"ΑΣΤΡΕΙΝΙΔΗΣ",{"$f":"IF($G10>0,VLOOKUP($G10,DrawPrep!$L$3:$N$18,3,FALSE),\"\")","v":"Α.Ο.Α.ΠΑΠΑΓΟΥ"},1,{"$f":"UPPER(IF($A$2=\"R\",IF(OR(K10=1,K10=\"a\"),G10,IF(OR(K10=2,K10=\"b\"),G12,\"\")),IF(OR(K10=1,K10=\"1\"),I10,IF(OR(K10=2,K10=\"b\"),I12,\"\"))))","v":"ΑΣΤΡΕΙΝΙΔΗΣ"},null,null,null,null,null,null,null,null,null,null,null,32659,"ΑΣΤΡΕΙΝΙΔΗΣ ΦΙΛΙΠΠΟΣ",null,"ΑΣΤΡΕΙΝΙΔΗΣ"]
[4,{"$f":"3-D11+4","v":6},7,{"$f":"D9+E11","v":1},{"$f":"IF($B$2>=C11,1,0)","v":0},{"$f":"IF($B$2>=C11,\"-\",VLOOKUP($B11,Setup!$G$12:$H$27,2,FALSE))","v":9},{"$f":"IF(Setup!$B$25=\"#\",0,IF(NOT(F11=\"-\"),VLOOKUP(F11,DrawPrep!$A$3:$N$18,7,FALSE),0))","v":31816},{"$f":"IF(G11>0,VLOOKUP(G11,DrawPrep!$G$3:$L$18,2,FALSE),\"bye\")","v":"ΓΚΑΓΚΑΟΥΔΑΚΗΣ ΣΤΥΛΙΑΝΟΣ"},"ΓΚΑΓΚΑΟΥΔΑΚΗΣ",{"$f":"IF($G11>0,VLOOKUP($G11,DrawPrep!$G$3:$L$18,3,FALSE),\"\")","v":"ΗΡΑΚΛΕΙΟ Ο.Α.& Α."},null,"75, 64",null,null,null,{"$f":"UPPER(IF($A$2=\"R\",IF(OR(O12=1,O12=\"a\"),N7,IF(OR(O12=2,O12=\"b\"),N15,\"\")),IF(OR(O12=1,O12=\"a\"),N7,IF(OR(O12=2,O12=\"b\"),N15,\"\"))))","v":"ΜΑΡΙΝΟΠΟΥΛΟΣ"},null,null,null,null,null,null,null,31816,"ΓΚΑΓΚΑΟΥΔΑΚΗΣ ΣΤΥΛΙΑΝΟΣ",null,"75, 64",null,{"$f":"P11","v":"ΜΑΡΙΝΟΠΟΥΛΟΣ"}]
[null,null,null,null,null,null,{"$f":"IF(Setup!$B$25=\"#\",0,IF(NOT(F11=\"-\"),VLOOKUP(F11,DrawPrep!$A$3:$N$18,12,FALSE),0))","v":31454},{"$f":"IF(G12>0,VLOOKUP(G12,DrawPrep!$L$3:$N$18,2,FALSE),\" \")","v":"ΜΠΟΓΡΗΣ ΕΥΑΓΓΕΛΟΣ"},"ΜΠΟΓΡΗΣ",{"$f":"IF($G12>0,VLOOKUP($G12,DrawPrep!$L$3:$N$18,3,FALSE),\"\")","v":"ΗΡΑΚΛΕΙΟ Ο.Α.& Α."},null,null,null,null,2,{"$f":"UPPER(IF($A$2=\"R\",IF(OR(O12=1,O12=\"a\"),N8,IF(OR(O12=2,O12=\"b\"),N16,\"\")),IF(OR(O12=1,O12=\"a\"),N8,IF(OR(O12=2,O12=\"b\"),N16,\"\"))))","v":"ΚΥΠΡΙΩΤΗΣ"},null,null,null,null,null,null,null,31454,"ΜΠΟΓΡΗΣ ΕΥΑΓΓΕΛΟΣ",null,null,null,{"$f":"P12","v":"ΚΥΠΡΙΩΤΗΣ"}]
[5,{"$f":"4-D13+4","v":7},null,{"$f":"D11+E13","v":1},0,{"$f":"VLOOKUP($B13,Setup!$G$12:$H$27,2,FALSE)","v":11},{"$f":"IF(Setup!$B$25=\"#\",0,IF(F13>0,VLOOKUP(F13,DrawPrep!$A$3:$N$18,7,FALSE),0))","v":34836},{"$f":"IF(G13>0,VLOOKUP(G13,DrawPrep!$G$3:$L$18,2,FALSE),\"bye\")","v":"ΣΑΒΒΑΚΗΣ ΔΗΜΗΤΡΗΣ"},"ΣΑΒΒΑΚΗΣ",{"$f":"IF($G13>0,VLOOKUP($G13,DrawPrep!$G$3:$L$18,3,FALSE),\"\")","v":"Ο.Α.ΡΕΘΥΜΝΟΥ"},null,{"$f":"UPPER(IF($A$2=\"R\",IF(OR(K14=1,K14=\"a\"),G13,IF(OR(K14=2,K14=\"b\"),G15,\"\")),IF(OR(K14=1,K14=\"1\"),I13,IF(OR(K14=2,K14=\"b\"),I15,\"\"))))","v":"ΣΑΒΒΑΚΗΣ"},null,null,null,"61, 46 (10-6)",null,null,null,null,null,null,null,34836,"ΣΑΒΒΑΚΗΣ ΔΗΜΗΤΡΗΣ",null,"ΣΑΒΒΑΚΗΣ",null,"61, 46 (10-6)"]
[null,null,null,null,null,null,{"$f":"IF(Setup!$B$25=\"#\",0,IF(F13>0,VLOOKUP(F13,DrawPrep!$A$3:$N$18,12,FALSE),0))","v":35333},{"$f":"IF(G14>0,VLOOKUP(G14,DrawPrep!$L$3:$N$18,2,FALSE),\" \")","v":"ΤΣΑΚΙΡΑΚΗΣ ΓΙΩΡΓΟΣ"},"ΤΣΑΚΙΡΑΚΗΣ",{"$f":"IF($G14>0,VLOOKUP($G14,DrawPrep!$L$3:$N$18,3,FALSE),\"\")","v":"ΗΡΑΚΛΕΙΟ Ο.Α.& Α."},1,{"$f":"UPPER(IF($A$2=\"R\",IF(OR(K14=1,K14=\"a\"),G14,IF(OR(K14=2,K14=\"b\"),G16,\"\")),IF(OR(K14=1,K14=\"1\"),I14,IF(OR(K14=2,K14=\"b\"),I16,\"\"))))","v":"ΤΣΑΚΙΡΑΚΗΣ"},null,null,null,null,null,null,null,null,null,null,null,35333,"ΤΣΑΚΙΡΑΚΗΣ ΓΙΩΡΓΟΣ",null,"ΤΣΑΚΙΡΑΚΗΣ"]
[6,{"$f":"5-D15+4","v":7},5,{"$f":"D13+E15","v":2},{"$f":"IF($B$2>=C15,1,0)","v":1},{"$f":"IF($B$2>=C15,\"-\",VLOOKUP($B15,Setup!$G$12:$H$27,2,FALSE))","v":"-"},{"$f":"IF(Setup!$B$25=\"#\",0,IF(NOT(F15=\"-\"),VLOOKUP(F15,DrawPrep!$A$3:$N$18,7,FALSE),0))","v":0},{"$f":"IF(G15>0,VLOOKUP(G15,DrawPrep!$G$3:$L$18,2,FALSE),\"bye\")","v":"bye"},"",{"$f":"IF($G15>0,VLOOKUP($G15,DrawPrep!$G$3:$L$18,3,FALSE),\"\")","v":""},null,null,null,{"$f":"UPPER(IF($A$2=\"R\",IF(OR(M16=1,M16=\"a\"),L13,IF(OR(M16=2,M15=\"b\"),L17,\"\")),IF(OR(M16=1,M16=\"a\"),L13,IF(OR(M16=2,M16=\"b\"),L17,\"\"))))","v":"ΜΑΡΙΝΟΠΟΥΛΟΣ"},null,null,null,null,null,null,null,null,null,0,"bye",null,0,"ΜΑΡΙΝΟΠΟΥΛΟΣ"]
[null,null,null,null,null,null,{"$f":"IF(Setup!$B$25=\"#\",0,IF(NOT(F15=\"-\"),VLOOKUP(F15,DrawPrep!$A$3:$N$18,12,FALSE),0))","v":0},{"$f":"IF(G16>0,VLOOKUP(G16,DrawPrep!$L$3:$N$18,2,FALSE),\" \")","v":" "},"",{"$f":"IF($G16>0,VLOOKUP($G16,DrawPrep!$L$3:$N$18,3,FALSE),\"\")","v":""},null,null,2,{"$f":"UPPER(IF($A$2=\"R\",IF(OR(M16=1,M16=\"a\"),L14,IF(OR(M16=2,M16=\"b\"),L18,\"\")),IF(OR(M16=1,M16=\"a\"),L14,IF(OR(M16=2,M16=\"b\"),L18,\"\"))))","v":"ΚΥΠΡΙΩΤΗΣ"},null,null,null,null,null,null,null,null,null,0," ",null,null,"ΚΥΠΡΙΩΤΗΣ"]
[7,{"$f":"6-D17+4","v":7},{"$f":"VALUE(Setup!E2)","v":3},{"$f":"D15+E17","v":3},{"$f":"IF($B$2>=C17,1,0)","v":1},{"$f":"IF($B$2>=C17,\"-\",VLOOKUP($B17,Setup!$G$12:$H$27,2,FALSE))","v":"-"},{"$f":"IF(Setup!$B$25=\"#\",0,IF(NOT(F17=\"-\"),VLOOKUP(F17,DrawPrep!$A$3:$N$18,7,FALSE),0))","v":0},{"$f":"IF(G17>0,VLOOKUP(G17,DrawPrep!$G$3:$L$18,2,FALSE),\"bye\")","v":"bye"},"",{"$f":"IF($G17>0,VLOOKUP($G17,DrawPrep!$G$3:$L$18,3,FALSE),\"\")","v":""},null,{"$f":"UPPER(IF($A$2=\"R\",IF(OR(K18=1,K18=\"a\"),G17,IF(OR(K18=2,K18=\"b\"),G19,\"\")),IF(OR(K18=1,K18=\"1\"),I17,IF(OR(K18=2,K18=\"b\"),I19,\"\"))))","v":"ΜΑΡΙΝΟΠΟΥΛΟΣ"},null,"60, 60",null,null,null,null,null,null,null,null,null,0,"bye",null,"ΜΑΡΙΝΟΠΟΥΛΟΣ","60, 60"]
[null,null,null,null,null,null,{"$f":"IF(Setup!$B$25=\"#\",0,IF(NOT(F17=\"-\"),VLOOKUP(F17,DrawPrep!$A$3:$N$18,12,FALSE),0))","v":0},{"$f":"IF(G18>0,VLOOKUP(G18,DrawPrep!$L$3:$N$18,2,FALSE),\" \")","v":" "},"",{"$f":"IF($G18>0,VLOOKUP($G18,DrawPrep!$L$3:$N$18,3,FALSE),\"\")","v":""},2,{"$f":"UPPER(IF($A$2=\"R\",IF(OR(K18=1,K18=\"a\"),G18,IF(OR(K18=2,K18=\"b\"),G20,\"\")),IF(OR(K18=1,K18=\"1\"),I18,IF(OR(K18=2,K18=\"b\"),I20,\"\"))))","v":"ΚΥΠΡΙΩΤΗΣ"},null,null,null,"winners",null,null,null,null,null,null,null,0," ",null,"ΚΥΠΡΙΩΤΗΣ"]
[8,{"$f":"VALUE(Setup!E2)","v":3},null,{"$f":"D17+E19","v":3},0,{"$f":"VLOOKUP($B19,Setup!$G$12:$H$27,2,FALSE)","v":3},{"$f":"IF(Setup!$B$25=\"#\",0,IF(F19>0,VLOOKUP(F19,DrawPrep!$A$3:$N$18,7,FALSE),0))","v":28777},{"$f":"IF(G19>0,VLOOKUP(G19,DrawPrep!$G$3:$L$18,2,FALSE),\"bye\")","v":"ΜΑΡΙΝΟΠΟΥΛΟΣ ΣΠΥΡΟΣ"},"ΜΑΡΙΝΟΠΟΥΛΟΣ",{"$f":"IF($G19>0,VLOOKUP($G19,DrawPrep!$G$3:$L$18,3,FALSE),\"\")","v":"Ο.Α.ΑΘΗΝΩΝ"},null,null,null,null,null,{"$f":"UPPER(IF($A$2=\"R\",IF(OR(O20=1,O20=\"a\"),P11,IF(OR(O20=2,O20=\"b\"),P27,\"\")),IF(OR(O20=1,O20=\"a\"),P11,IF(OR(O20=2,O20=\"b\"),P27,\"\"))))","v":"ΜΑΡΙΝΟΠΟΥΛΟΣ"},null,null,null,null,null,null,null,28777,"ΜΑΡΙΝΟΠΟΥΛΟΣ ΣΠΥΡΟΣ",null,0,null,"ΜΑΡΙΝΟΠΟΥΛΟΣ"]
[null,null,null,null,null,null,{"$f":"IF(Setup!$B$25=\"#\",0,IF(F19>0,VLOOKUP(F19,DrawPrep!$A$3:$N$18,12,FALSE),0))","v":32605},{"$f":"IF(G20>0,VLOOKUP(G20,DrawPrep!$L$3:$N$18,2,FALSE),\" \")","v":"ΚΥΠΡΙΩΤΗΣ ΕΥΑΓΓΕΛΟΣ"},"ΚΥΠΡΙΩΤΗΣ",{"$f":"IF($G20>0,VLOOKUP($G20,DrawPrep!$L$3:$N$18,3,FALSE),\"\")","v":"Ο.Α.ΑΘΗΝΩΝ"},null,null,null,null,1,{"$f":"UPPER(IF($A$2=\"R\",IF(OR(O20=1,O20=\"a\"),P12,IF(OR(O20=2,O20=\"b\"),P28,\"\")),IF(OR(O20=1,O20=\"a\"),P12,IF(OR(O20=2,O20=\"b\"),P28,\"\"))))","v":"ΚΥΠΡΙΩΤΗΣ"},null,null,null,null,null,null,null,32605,"ΚΥΠΡΙΩΤΗΣ ΕΥΑΓΓΕΛΟΣ",null,null,null,"ΚΥΠΡΙΩΤΗΣ"]
[9,{"$f":"VALUE(Setup!E3)","v":4},null,{"$f":"D19+E21","v":3},0,{"$f":"VLOOKUP($B21,Setup!$G$12:$H$27,2,FALSE)","v":4},{"$f":"IF(Setup!$B$25=\"#\",0,IF(F21>0,VLOOKUP(F21,DrawPrep!$A$3:$N$18,7,FALSE),0))","v":30524},{"$f":"IF(G21>0,VLOOKUP(G21,DrawPrep!$G$3:$L$18,2,FALSE),\"bye\")","v":"ΜΑΤΣΑΜΑΚΗΣ ΑΝΤΩΝΙΟΣ"},"ΜΑΤΣΑΜΑΚΗΣ",{"$f":"IF($G21>0,VLOOKUP($G21,DrawPrep!$G$3:$L$18,3,FALSE),\"\")","v":"Ο.Α.ΧΑΝΙΩΝ"},null,{"$f":"UPPER(IF($A$2=\"R\",IF(OR(K22=1,K22=\"a\"),G21,IF(OR(K22=2,K22=\"b\"),G23,\"\")),IF(OR(K22=1,K22=\"1\"),I21,IF(OR(K22=2,K22=\"b\"),I23,\"\"))))","v":"ΜΑΤΣΑΜΑΚΗΣ"},null,null,null,"64, 76(1)",null,null,null,null,null,null,null,30524,"ΜΑΤΣΑΜΑΚΗΣ ΑΝΤΩΝΙΟΣ",null,"ΜΑΤΣΑΜΑΚΗΣ",null,"64, 76(1)"]
[null,null,null,null,null,null,{"$f":"IF(Setup!$B$25=\"#\",0,IF(F21>0,VLOOKUP(F21,DrawPrep!$A$3:$N$18,12,FALSE),0))","v":30535},{"$f":"IF(G22>0,VLOOKUP(G22,DrawPrep!$L$3:$N$18,2,FALSE),\" \")","v":"ΚΟΝΤΑΡΑΚΗΣ ΑΝΔΡΕΑΣ"},"ΚΟΝΤΑΡΑΚΗΣ",{"$f":"IF($G22>0,VLOOKUP($G22,DrawPrep!$L$3:$N$18,3,FALSE),\"\")","v":"Ο.Α.ΧΑΝΙΩΝ"},1,{"$f":"UPPER(IF($A$2=\"R\",IF(OR(K22=1,K22=\"a\"),G22,IF(OR(K22=2,K22=\"b\"),G24,\"\")),IF(OR(K22=1,K22=\"1\"),I22,IF(OR(K22=2,K22=\"b\"),I24,\"\"))))","v":"ΚΟΝΤΑΡΑΚΗΣ"},null,null,null,null,null,null,null,null,null,null,null,30535,"ΚΟΝΤΑΡΑΚΗΣ ΑΝΔΡΕΑΣ",null,"ΚΟΝΤΑΡΑΚΗΣ"]
[10,{"$f":"7-D23+4","v":7},{"$f":"VALUE(Setup!E3)","v":4},{"$f":"D21+E23","v":4},{"$f":"IF($B$2>=C23,1,0)","v":1},{"$f":"IF($B$2>=C23,\"-\",VLOOKUP($B23,Setup!$G$12:$H$27,2,FALSE))","v":"-"},{"$f":"IF(Setup!$B$25=\"#\",0,IF(NOT(F23=\"-\"),VLOOKUP(F23,DrawPrep!$A$3:$N$18,7,FALSE),0))","v":0},{"$f":"IF(G23>0,VLOOKUP(G23,DrawPrep!$G$3:$L$18,2,FALSE),\"bye\")","v":"bye"},"",{"$f":"IF($G23>0,VLOOKUP($G23,DrawPrep!$G$3:$L$18,3,FALSE),\"\")","v":""},null,null,null,{"$f":"UPPER(IF($A$2=\"R\",IF(OR(M24=1,M24=\"a\"),L21,IF(OR(M24=2,M23=\"b\"),L25,\"\")),IF(OR(M24=1,M24=\"a\"),L21,IF(OR(M24=2,M24=\"b\"),L25,\"\"))))","v":"ΜΑΤΣΑΜΑΚΗΣ"},null,null,null,null,null,null,null,null,null,0,"bye",null,0,"ΜΑΤΣΑΜΑΚΗΣ"]
[null,null,null,null,null,null,{"$f":"IF(Setup!$B$25=\"#\",0,IF(NOT(F23=\"-\"),VLOOKUP(F23,DrawPrep!$A$3:$N$18,12,FALSE),0))","v":0},{"$f":"IF(G24>0,VLOOKUP(G24,DrawPrep!$L$3:$N$18,2,FALSE),\" \")","v":" "},"",{"$f":"IF($G24>0,VLOOKUP($G24,DrawPrep!$L$3:$N$18,3,FALSE),\"\")","v":""},null,null,1,{"$f":"UPPER(IF($A$2=\"R\",IF(OR(M24=1,M24=\"a\"),L22,IF(OR(M24=2,M24=\"b\"),L26,\"\")),IF(OR(M24=1,M24=\"a\"),L22,IF(OR(M24=2,M24=\"b\"),L26,\"\"))))","v":"ΚΟΝΤΑΡΑΚΗΣ"},null,null,null,null,null,null,null,null,null,0," ",null,null,"ΚΟΝΤΑΡΑΚΗΣ"]
[11,{"$f":"8-D25+4","v":8},null,{"$f":"D23+E25","v":4},0,{"$f":"VLOOKUP($B25,Setup!$G$12:$H$27,2,FALSE)","v":6},{"$f":"IF(Setup!$B$25=\"#\",0,IF(F25>0,VLOOKUP(F25,DrawPrep!$A$3:$N$18,7,FALSE),0))","v":30710},{"$f":"IF(G25>0,VLOOKUP(G25,DrawPrep!$G$3:$L$18,2,FALSE),\"bye\")","v":"ΚΑΖΙΑΛΕΣ ΕΥΑΓΓΕΛΟΣ"},"ΚΑΖΙΑΛΕΣ",{"$f":"IF($G25>0,VLOOKUP($G25,DrawPrep!$G$3:$L$18,3,FALSE),\"\")","v":"Ο.Α. ΡΕΘΥΜΝΟΥ"},null,{"$f":"UPPER(IF($A$2=\"R\",IF(OR(K26=1,K26=\"a\"),G25,IF(OR(K26=2,K26=\"b\"),G27,\"\")),IF(OR(K26=1,K26=\"1\"),I25,IF(OR(K26=2,K26=\"b\"),I27,\"\"))))","v":"ΚΩΝΣΤΑΝΤΑΡΑΚΗΣ"},null,"63, 62",null,null,null,null,null,null,null,null,null,30710,"ΚΑΖΙΑΛΕΣ ΕΥΑΓΓΕΛΟΣ",null,"ΚΩΝΣΤΑΝΤΑΡΑΚΗΣ","63, 62"]
[null,null,null,null,null,null,{"$f":"IF(Setup!$B$25=\"#\",0,IF(F25>0,VLOOKUP(F25,DrawPrep!$A$3:$N$18,12,FALSE),0))","v":30546},{"$f":"IF(G26>0,VLOOKUP(G26,DrawPrep!$L$3:$N$18,2,FALSE),\" \")","v":"ΤΣΑΓΛΙΩΤΗΣ ΑΝΤΩΝΗΣ"},"ΤΣΑΓΛΙΩΤΗΣ",{"$f":"IF($G26>0,VLOOKUP($G26,DrawPrep!$L$3:$N$18,3,FALSE),\"\")","v":"Ο.Α.ΡΕΘΥΜΝΟΥ"},2,{"$f":"UPPER(IF($A$2=\"R\",IF(OR(K26=1,K26=\"a\"),G26,IF(OR(K26=2,K26=\"b\"),G28,\"\")),IF(OR(K26=1,K26=\"1\"),I26,IF(OR(K26=2,K26=\"b\"),I28,\"\"))))","v":"ΚΑΡΑΧΑΛΙΟΣ"},null,null,null,null,null,null,null,null,null,null,null,30546,"ΤΣΑΓΛΙΩΤΗΣ ΑΝΤΩΝΗΣ",null,"ΚΑΡΑΧΑΛΙΟΣ"]
[12,{"$f":"9-D27+4","v":9},6,{"$f":"D25+E27","v":4},{"$f":"IF($B$2>=C27,1,0)","v":0},{"$f":"IF($B$2>=C27,\"-\",VLOOKUP($B27,Setup!$G$12:$H$27,2,FALSE))","v":5},{"$f":"IF(Setup!$B$25=\"#\",0,IF(NOT(F27=\"-\"),VLOOKUP(F27,DrawPrep!$A$3:$N$18,7,FALSE),0))","v":30531},{"$f":"IF(G27>0,VLOOKUP(G27,DrawPrep!$G$3:$L$18,2,FALSE),\"bye\")","v":"ΚΩΝΣΤΑΝΤΑΡΑΚΗΣ ΑΝΔΡΕΑΣ"},"ΚΩΝΣΤΑΝΤΑΡΑΚΗΣ",{"$f":"IF($G27>0,VLOOKUP($G27,DrawPrep!$G$3:$L$18,3,FALSE),\"\")","v":"Ο.Α.ΧΑΝΙΩΝ"},null,"63, 63",null,null,null,{"$f":"UPPER(IF($A$2=\"R\",IF(OR(O28=1,O28=\"a\"),N23,IF(OR(O28=2,O28=\"b\"),N31,\"\")),IF(OR(O28=1,O28=\"a\"),N23,IF(OR(O28=2,O28=\"b\"),N31,\"\"))))","v":"ΤΡΙΑΝΤΑΦΥΛΛΟΥ"},null,null,null,null,null,null,null,30531,"ΚΩΝΣΤΑΝΤΑΡΑΚΗΣ ΑΝΔΡΕΑΣ",null,"63, 63",null,"ΤΡΙΑΝΤΑΦΥΛΛΟΥ"]
[null,null,null,null,null,null,{"$f":"IF(Setup!$B$25=\"#\",0,IF(NOT(F27=\"-\"),VLOOKUP(F27,DrawPrep!$A$3:$N$18,12,FALSE),0))","v":34511},{"$f":"IF(G28>0,VLOOKUP(G28,DrawPrep!$L$3:$N$18,2,FALSE),\" \")","v":"ΚΑΡΑΧΑΛΙΟΣ ΑΓΓΕΛΟΣ"},"ΚΑΡΑΧΑΛΙΟΣ",{"$f":"IF($G28>0,VLOOKUP($G28,DrawPrep!$L$3:$N$18,3,FALSE),\"\")","v":"Ο.Α.ΧΑΝΙΩΝ"},null,null,null,null,2,{"$f":"UPPER(IF($A$2=\"R\",IF(OR(O28=1,O28=\"a\"),N24,IF(OR(O28=2,O28=\"b\"),N32,\"\")),IF(OR(O28=1,O28=\"a\"),N24,IF(OR(O28=2,O28=\"b\"),N32,\"\"))))","v":"ΣΙΜΑΤΟΣ"},null,null,null,null,null,null,null,34511,"ΚΑΡΑΧΑΛΙΟΣ ΑΓΓΕΛΟΣ",null,null,null,"ΣΙΜΑΤΟΣ"]
[13,{"$f":"10-D29+4","v":10},null,{"$f":"D27+E29","v":4},0,{"$f":"VLOOKUP($B29,Setup!$G$12:$H$27,2,FALSE)","v":8},{"$f":"IF(Setup!$B$25=\"#\",0,IF(F29>0,VLOOKUP(F29,DrawPrep!$A$3:$N$18,7,FALSE),0))","v":31810},{"$f":"IF(G29>0,VLOOKUP(G29,DrawPrep!$G$3:$L$18,2,FALSE),\"bye\")","v":"ΔΕΛΑΚΗΣ ΔΗΜΗΤΡΗΣ"},"ΔΕΛΑΚΗΣ",{"$f":"IF($G29>0,VLOOKUP($G29,DrawPrep!$G$3:$L$18,3,FALSE),\"\")","v":"ΗΡΑΚΛΕΙΟ Ο.Α.& Α."},null,{"$f":"UPPER(IF($A$2=\"R\",IF(OR(K30=1,K30=\"a\"),G29,IF(OR(K30=2,K30=\"b\"),G31,\"\")),IF(OR(K30=1,K30=\"1\"),I29,IF(OR(K30=2,K30=\"b\"),I31,\"\"))))","v":"ΖΕΡΒΟΣ"},null,null,null,"62, 26 (10-6)",null,null,null,null,null,null,null,31810,"ΔΕΛΑΚΗΣ ΔΗΜΗΤΡΗΣ",null,"ΖΕΡΒΟΣ",null,"62, 26 (10-6)"]
[null,null,null,null,null,null,{"$f":"IF(Setup!$B$25=\"#\",0,IF(F29>0,VLOOKUP(F29,DrawPrep!$A$3:$N$18,12,FALSE),0))","v":33622},{"$f":"IF(G30>0,VLOOKUP(G30,DrawPrep!$L$3:$N$18,2,FALSE),\" \")","v":"ΜΠΟΥΡΑΣ ΙΩΑΝΝΗΣ"},"ΜΠΟΥΡΑΣ",{"$f":"IF($G30>0,VLOOKUP($G30,DrawPrep!$L$3:$N$18,3,FALSE),\"\")","v":"ΗΡΑΚΛΕΙΟ Ο.Α.& Α."},2,{"$f":"UPPER(IF($A$2=\"R\",IF(OR(K30=1,K30=\"a\"),G30,IF(OR(K30=2,K30=\"b\"),G32,\"\")),IF(OR(K30=1,K30=\"1\"),I30,IF(OR(K30=2,K30=\"b\"),I32,\"\"))))","v":"ΒΟΛΤΥΡΑΚΗΣ"},null,null,null,null,null,null,null,null,null,null,null,33622,"ΜΠΟΥΡΑΣ ΙΩΑΝΝΗΣ",null,"ΒΟΛΤΥΡΑΚΗΣ"]
[14,{"$f":"11-D31+4","v":11},8,{"$f":"D29+E31","v":4},{"$f":"IF($B$2>=C31,1,0)","v":0},{"$f":"IF($B$2>=C31,\"-\",VLOOKUP($B31,Setup!$G$12:$H$27,2,FALSE))","v":7},{"$f":"IF(Setup!$B$25=\"#\",0,IF(NOT(F31=\"-\"),VLOOKUP(F31,DrawPrep!$A$3:$N$18,7,FALSE),0))","v":30776},{"$f":"IF(G31>0,VLOOKUP(G31,DrawPrep!$G$3:$L$18,2,FALSE),\"bye\")","v":"ΖΕΡΒΟΣ ΓΕΩΡΓΙΟΣ"},"ΖΕΡΒΟΣ",{"$f":"IF($G31>0,VLOOKUP($G31,DrawPrep!$G$3:$L$18,3,FALSE),\"\")","v":"Ο.Α.ΧΑΝΙΩΝ"},null,"63, 63",null,{"$f":"UPPER(IF($A$2=\"R\",IF(OR(M32=1,M32=\"a\"),L29,IF(OR(M32=2,M31=\"b\"),L33,\"\")),IF(OR(M32=1,M32=\"a\"),L29,IF(OR(M32=2,M32=\"b\"),L33,\"\"))))","v":"ΤΡΙΑΝΤΑΦΥΛΛΟΥ"},null,null,null,null,null,null,null,null,null,30776,"ΖΕΡΒΟΣ ΓΕΩΡΓΙΟΣ",null,"63, 63","ΤΡΙΑΝΤΑΦΥΛΛΟΥ"]
[null,null,null,null,null,null,{"$f":"IF(Setup!$B$25=\"#\",0,IF(NOT(F31=\"-\"),VLOOKUP(F31,DrawPrep!$A$3:$N$18,12,FALSE),0))","v":30537},{"$f":"IF(G32>0,VLOOKUP(G32,DrawPrep!$L$3:$N$18,2,FALSE),\" \")","v":"ΒΟΛΤΥΡΑΚΗΣ ΒΑΣΙΛΗΣ"},"ΒΟΛΤΥΡΑΚΗΣ",{"$f":"IF($G32>0,VLOOKUP($G32,DrawPrep!$L$3:$N$18,3,FALSE),\"\")","v":"Ο.Α.ΧΑΝΙΩΝ"},null,null,2,{"$f":"UPPER(IF($A$2=\"R\",IF(OR(M32=1,M32=\"a\"),L30,IF(OR(M32=2,M32=\"b\"),L34,\"\")),IF(OR(M32=1,M32=\"a\"),L30,IF(OR(M32=2,M32=\"b\"),L34,\"\"))))","v":"ΣΙΜΑΤΟΣ"},null,null,null,null,null,null,null,null,null,30537,"ΒΟΛΤΥΡΑΚΗΣ ΒΑΣΙΛΗΣ",null,null,"ΣΙΜΑΤΟΣ"]
[15,{"$f":"12-D33+4","v":11},2,{"$f":"D31+E33","v":5},{"$f":"IF($B$2>=C33,1,0)","v":1},{"$f":"IF($B$2>=C33,\"-\",VLOOKUP($B33,Setup!$G$12:$H$27,2,FALSE))","v":"-"},{"$f":"IF(Setup!$B$25=\"#\",0,IF(NOT(F33=\"-\"),VLOOKUP(F33,DrawPrep!$A$3:$N$18,7,FALSE),0))","v":0},{"$f":"IF(G33>0,VLOOKUP(G33,DrawPrep!$G$3:$L$18,2,FALSE),\"bye\")","v":"bye"},"",{"$f":"IF($G33>0,VLOOKUP($G33,DrawPrep!$G$3:$L$18,3,FALSE),\"\")","v":""},null,{"$f":"UPPER(IF($A$2=\"R\",IF(OR(K34=1,K34=\"a\"),G33,IF(OR(K34=2,K34=\"b\"),G35,\"\")),IF(OR(K34=1,K34=\"1\"),I33,IF(OR(K34=2,K34=\"b\"),I35,\"\"))))","v":"ΤΡΙΑΝΤΑΦΥΛΛΟΥ"},null,"62, 61",null,null,null,null,null,null,null,null,null,0,"bye",null,"ΤΡΙΑΝΤΑΦΥΛΛΟΥ","62, 61"]
[null,null,null,null,null,null,{"$f":"IF(Setup!$B$25=\"#\",0,IF(NOT(F33=\"-\"),VLOOKUP(F33,DrawPrep!$A$3:$N$18,12,FALSE),0))","v":0},{"$f":"IF(G34>0,VLOOKUP(G34,DrawPrep!$L$3:$N$18,2,FALSE),\" \")","v":" "},"",{"$f":"IF($G34>0,VLOOKUP($G34,DrawPrep!$L$3:$N$18,3,FALSE),\"\")","v":""},2,{"$f":"UPPER(IF($A$2=\"R\",IF(OR(K34=1,K34=\"a\"),G34,IF(OR(K34=2,K34=\"b\"),G36,\"\")),IF(OR(K34=1,K34=\"1\"),I34,IF(OR(K34=2,K34=\"b\"),I36,\"\"))))","v":"ΣΙΜΑΤΟΣ"},null,null,null,null,null,null,null,null,null,null,null,0," ",null,"ΣΙΜΑΤΟΣ"]
[16,2,null,{"$f":"D33+E35","v":5},0,{"$f":"VLOOKUP($B35,Setup!$G$12:$H$27,2,FALSE)","v":2},{"$f":"IF(Setup!$B$25=\"#\",0,IF(F35>0,VLOOKUP(F35,DrawPrep!$A$3:$N$18,7,FALSE),0))","v":29500},{"$f":"IF(G35>0,VLOOKUP(G35,DrawPrep!$G$3:$L$18,2,FALSE),\"bye\")","v":"ΤΡΙΑΝΤΑΦΥΛΛΟΥ ΝΤΑΝΙΕΛ"},"ΤΡΙΑΝΤΑΦΥΛΛΟΥ",{"$f":"IF($G35>0,VLOOKUP($G35,DrawPrep!$G$3:$L$18,3,FALSE),\"\")","v":"Ο.Α.ΑΝΑΦΛΥΣΤΟΣ ΣΑΡΩΝΙΔΑΣ"},null,null,null,null,null,null,null,null,null,null,null,null,null,29500,"ΤΡΙΑΝΤΑΦΥΛΛΟΥ ΝΤΑΝΙΕΛ",null,0]
[null,null,null,null,null,null,{"$f":"IF(Setup!$B$25=\"#\",0,IF(F35>0,VLOOKUP(F35,DrawPrep!$A$3:$N$18,12,FALSE),0))","v":31953},{"$f":"IF(G36>0,VLOOKUP(G36,DrawPrep!$L$3:$N$18,2,FALSE),\" \")","v":"ΣΙΜΑΤΟΣ ΓΕΩΡΓΙΟΣ"},"ΣΙΜΑΤΟΣ",{"$f":"IF($G36>0,VLOOKUP($G36,DrawPrep!$L$3:$N$18,3,FALSE),\"\")","v":"ΗΡΑΚΛΕΙΟ Ο.Α.& Α."},null,null,null,null,null,null,null,null,null,null,null,null,null,31953,"ΣΙΜΑΤΟΣ ΓΕΩΡΓΙΟΣ"]
[]
[]
[]
[null,null,null,null,null,null,null,"seeded players",null,null,null,null,null,null,null,"επιδιαιτητής"]
[null,null,null,null,null,null,null,{"$f":"\"1. \" & IF(Setup!$B$19>0,LEFT(DrawPrep!$H$3,FIND(\" \",DrawPrep!$H$3)+1)&\" - \"&LEFT(DrawPrep!$M$3,FIND(\" \",DrawPrep!$M$3)+1),\"\")","v":"1. ΚΩΣΤΟΥΡΟΣ Δ - ΤΑΜΙΩΛΑΚΗΣ Χ"},null,null,null,null,null,null,null,{"$f":"Setup!$B$10","v":"Νικηφοράκης Σταύρος"}]
[null,null,null,null,null,null,null,{"$f":"\"2. \" & IF(Setup!$B$19>1,LEFT(DrawPrep!$H$4,FIND(\" \",DrawPrep!$H$4)+1)&\" - \"&LEFT(DrawPrep!$M$4,FIND(\" \",DrawPrep!$M$4)+1),\"\")","v":"2. ΤΡΙΑΝΤΑΦΥΛΛΟΥ Ν - ΣΙΜΑΤΟΣ Γ"}]
[null,null,null,null,null,null,null,{"$f":"\"3. \" & IF(Setup!$B$19>2,LEFT(DrawPrep!$H$5,FIND(\" \",DrawPrep!$H$5)+1)&\" - \"&LEFT(DrawPrep!$M$5,FIND(\" \",DrawPrep!$M$5)+1),\"\")","v":"3. ΜΑΡΙΝΟΠΟΥΛΟΣ Σ - ΚΥΠΡΙΩΤΗΣ Ε"}]
[null,null,null,null,null,null,null,{"$f":"\"4. \" & IF(Setup!$B$19>3,LEFT(DrawPrep!$H$6,FIND(\" \",DrawPrep!$H$6)+1)&\" - \"&LEFT(DrawPrep!$M$6,FIND(\" \",DrawPrep!$M$6)+1),\"\")","v":"4. ΜΑΤΣΑΜΑΚΗΣ Α - ΚΟΝΤΑΡΑΚΗΣ Α"}]
[]
[]
[]
[]
[]
[]
[]
[]
[]
[]
[]
[]
[]
[]
[null,null,null,null,null,null,null,"BoldPlayers"]
[null,null,null,null,null,null,null,{"$f":"IF(Setup!$B$19>0,LEFT(DrawPrep!$H$3,FIND(\" \",DrawPrep!$H$3)-1))","v":"ΚΩΣΤΟΥΡΟΣ"}]
[null,null,null,null,null,null,null,{"$f":"IF(Setup!$B$19>0,LEFT(DrawPrep!$M$3,FIND(\" \",DrawPrep!$M$3)-1),\"\")","v":"ΤΑΜΙΩΛΑΚΗΣ"}]
[null,null,null,null,null,null,null,{"$f":"IF(Setup!$B$19>0,LEFT(DrawPrep!$H$4,FIND(\" \",DrawPrep!$H$4)-1))","v":"ΤΡΙΑΝΤΑΦΥΛΛΟΥ"}]
[null,null,null,null,null,null,null,{"$f":"IF(Setup!$B$19>0,LEFT(DrawPrep!$M$4,FIND(\" \",DrawPrep!$M$4)-1),\"\")","v":"ΣΙΜΑΤΟΣ"}]
[null,null,null,null,null,null,null,{"$f":"IF(Setup!$B$19>0,LEFT(DrawPrep!$H$5,FIND(\" \",DrawPrep!$H$5)-1))","v":"ΜΑΡΙΝΟΠΟΥΛΟΣ"}]
[null,null,null,null,null,null,null,{"$f":"IF(Setup!$B$19>0,LEFT(DrawPrep!$M$5,FIND(\" \",DrawPrep!$M$5)-1),\"\")","v":"ΚΥΠΡΙΩΤΗΣ"}]
[null,null,null,null,null,null,null,{"$f":"IF(Setup!$B$19>0,LEFT(DrawPrep!$H$6,FIND(\" \",DrawPrep!$H$6)-1))","v":"ΜΑΤΣΑΜΑΚΗΣ"}]
[null,null,null,null,null,null,null,{"$f":"IF(Setup!$B$19>0,LEFT(DrawPrep!$M$6,FIND(\" \",DrawPrep!$M$6)-1),\"\")","v":"ΚΟΝΤΑΡΑΚΗΣ"}]

{"sheet":"Matches","index":3,"n_rows":21,"n_cols":6,"rows_kept":21,"cut":false,"hidden":false,"merged":[[2,5,3,5],[15,5,16,5],[0,0,0,5],[1,0,1,5]]}
[{"$f":"CONCATENATE(Setup!B3,\", \",Setup!B4,\", \",Setup!B6)","v":"ΕΦΟΑ, 1ο Ε2 2014, ΗΡΑΚΛΕΙΟ Ο.Α.Α."}]
[{"$f":"Setup!$B$10","v":"Νικηφοράκης Σταύρος"}]
["Πρόγραμμα αγώνων",null,null,null,"Round 1","i"]
["ΩΡΑ","Κτγρ.","Αθλητές ζευγάρι α'",null,"Αθλητές ζευγάρι β'"]
["Έναρξη","Α12 Δ","ΚΩΣΤΟΥΡΟΣ Δ - ΤΑΜΙΩΛΑΚΗΣ Χ"," ",""]
[null,"Α12 Δ","ΝΟΥΧΑΚΗΣ Γ - ΑΣΤΡΕΙΝΙΔΗΣ Φ","-","ΓΚΑΓΚΑΟΥΔΑΚΗΣ Σ - ΜΠΟΓΡΗΣ Ε"]
[null,"Α12 Δ","ΣΑΒΒΑΚΗΣ Δ - ΤΣΑΚΙΡΑΚΗΣ Γ"," ",""]
[null,"Α12 Δ",""," ","ΜΑΡΙΝΟΠΟΥΛΟΣ Σ - ΚΥΠΡΙΩΤΗΣ Ε"]
["όχι πριν","Α12 Δ","ΜΑΤΣΑΜΑΚΗΣ Α - ΚΟΝΤΑΡΑΚΗΣ Α"," ",""]
[null,"Α12 Δ","ΚΑΖΙΑΛΕΣ Ε - ΤΣΑΓΛΙΩΤΗΣ Α","-","ΚΩΝΣΤΑΝΤΑΡΑΚΗΣ Α - ΚΑΡΑΧΑΛΙΟΣ Α"]
[null,"Α12 Δ","ΔΕΛΑΚΗΣ Δ - ΜΠΟΥΡΑΣ Ι","-","ΖΕΡΒΟΣ Γ - ΒΟΛΤΥΡΑΚΗΣ Β"]
[null,"Α12 Δ",""," ","ΤΡΙΑΝΤΑΦΥΛΛΟΥ Ν - ΣΙΜΑΤΟΣ Γ"]
[]
[]
[]
["Πρόγραμμα αγώνων",null,null,null,"Round 2","i"]
["ΩΡΑ","Κτγρ.","Αθλητές ζευγάρι α'",null,"Αθλητές ζευγάρι β'"]
["Έναρξη","Α12 Δ","ΚΩΣΤΟΥΡΟΣ - ΤΑΜΙΩΛΑΚΗΣ","-","ΝΟΥΧΑΚΗΣ - ΑΣΤΡΕΙΝΙΔΗΣ"]
[null,"Α12 Δ","ΣΑΒΒΑΚΗΣ - ΤΣΑΚΙΡΑΚΗΣ","-","ΜΑΡΙΝΟΠΟΥΛΟΣ - ΚΥΠΡΙΩΤΗΣ"]
[null,"Α12 Δ","ΜΑΤΣΑΜΑΚΗΣ - ΚΟΝΤΑΡΑΚΗΣ","-","ΚΩΝΣΤΑΝΤΑΡΑΚΗΣ - ΚΑΡΑΧΑΛΙΟΣ"]
[null,"Α12 Δ","ΖΕΡΒΟΣ - ΒΟΛΤΥΡΑΚΗΣ","-","ΤΡΙΑΝΤΑΦΥΛΛΟΥ - ΣΙΜΑΤΟΣ"]

{"sheet":"notes","index":4,"n_rows":0,"n_cols":0,"rows_kept":0,"cut":false,"hidden":false,"merged":[]}

{"sheet":"Rankings","index":5,"n_rows":3408,"n_cols":5,"rows_kept":3408,"cut":false,"hidden":false,"merged":[]}
["Α.Μ.","Ονοματεπώνυμο","Σύλλογος","Βαθμ","Διπλά"]
["12-31488","ΜΑΝΟΠΟΥΛΟΣ ΝΙΚΟΛΑΟΣ","ΦΘΙΩΤΙΚΟΣ Ο.Α.",150,0]
["12-28958","ΦΟΥΖΑΣ ΧΑΡΑΛΑΜΠΟΣ","ΠΕΥΚΗ Γ.ΚΑΛΟΒΕΛΩΝΗΣ",128.5,0]
["12-29179","ΤΑΜΙΩΛΑΚΗΣ ΧΡΥΣΟΒΑΛΑΝΤΗΣ","ΗΡΑΚΛΕΙΟ Ο.Α.& Α.",103.5,0]
["12-29257","ΝΙΚΟΛΟΥΛΗΣ ΧΡΗΣΤΟΣ","Ο.Α.ΝΙΚΑΙΑ ΛΑΡΙΣΑΣ",72,0]
["12-29650","ΜΠΑΛΑΦΑΣ ΠΑΥΛΟΣ-ΛΟΥΙΣ","Α.Σ.Α.ΛΑΡΙΣΑΣ",66.5,0]
["12-32605","ΚΥΠΡΙΩΤΗΣ ΕΥΑΓΓΕΛΟΣ","Ο.Α.ΑΘΗΝΩΝ",65,0]
["12-90112","ΝΤΙΝΤΟ ΑΛΕΞΑΝΔΡΟΣ","Ο.Α.ΓΛΥΦΑΔΑΣ",62.5,0]
["12-32035","ΠΟΥΤΗΣ ΣΤΥΛΙΑΝΟΣ","Ο.Α.ΕΔΕΣΣΑΣ",60.5,0]
["12-29500","ΤΡΙΑΝΤΑΦΥΛΛΟΥ ΝΤΑΝΙΕΛ","Ο.Α.ΑΝΑΦΛΥΣΤΟΣ ΣΑΡΩΝΙΔΑΣ",58,0]
["12-29944","ΚΑΛΛΙΣΤΡΟΣ ΑΛΕΞΙΟΣ","Ο.Α.ΑΙΓΙΑΛΕΙΑΣ",52.5,0]
["12-31878","ΣΤΑΜΟΥΛΟΣ ΦΩΤΙΟΣ","Α.Ο.Α.ΗΛΙΟΥΠΟΛΗΣ",52.5,0]
["12-30766","ΤΕΡΛΕΜΕΣ ΚΩΝΣΤΑΝΤΙΝΟΣ","ΠΑΝΘΡΑΚΙΚΟΣ Ο.Α.ΚΟΜΟΤΗΝΗΣ",52.5,0]
["12-31876","ΚΩΣΤΑΡΙΔΗΣ ΙΑΣΟΝΑΣ-ΚΩΝΣΤΑΝΤΙΝΟΣ","Α.Ο.Α.ΗΛΙΟΥΠΟΛΗΣ",52,0]
["12-27444","ΧΡΙΣΤΑΝΑΣ ΔΗΜΗΤΡΗΣ","Α.Ο.Α.ΑΙΓΑΛΕΩ 92",51.5,0]
["12-30999","ΠΑΦΗΣ ΚΩΝΣΤΑΝΤΙΝΟΣ","ΠΑΝΘΡΑΚΙΚΟΣ Ο.Α.ΚΟΜΟΤΗΝΗΣ",50,0]
["12-31167","ΠΑΡΙΣΣΗΣ ΑΝΑΣΤΑΣΙΟΣ","ΡΟΔΙΑΚΗ ΑΚΑΔ.ΑΝΤΙΣΦ.",48.5,0]
["12-34511","ΚΑΡΑΧΑΛΙΟΣ ΑΓΓΕΛΟΣ","Ο.Α.ΧΑΝΙΩΝ",47,0]
["12-30535","ΚΟΝΤΑΡΑΚΗΣ ΑΝΔΡΕΑΣ","Ο.Α.ΧΑΝΙΩΝ",45,0]
["12-29965","ΒΑΣΙΛΑΚΗΣ ΕΥΣΤΑΘΙΟΣ-ΗΛΙΑΣ","Α.Ο.Α.ΠΑΤΡΩΝ",41.5,0]
["12-31285","ΚΩΣΤΟΥΡΟΣ ΔΗΜΗΤΡΙΟΣ","ΠΕΥΚΗ Γ.ΚΑΛΟΒΕΛΩΝΗΣ",41.5,0]
["12-30524","ΜΑΤΣΑΜΑΚΗΣ ΑΝΤΩΝΙΟΣ","Ο.Α.ΧΑΝΙΩΝ",40,0]
["12-32623","ΖΑΧΙΩΤΗΣ ΦΙΛΙΠΠΟΣ","Γ.Ο.ΠΕΡΙΣΤΕΡΙΟΥ Γ.ΠΑΛΑΣΚΑΣ",38,0]
["12-31791","ΚΑΡΑΜΑΝΗΣ ΟΡΕΣΤΗΣ","Α.Ο.Α.ΧΑΪΔΑΡΙΟΥ",37,0]
["12-32524","ΧΑΡΑΛΑΜΠΙΔΗΣ ΚΩΝΣΤΑΝΤΙΝΟΣ","Α.Ο.Α.ΑΙΓΑΛΕΩ 92",36.5,0]
["12-31088","ΣΠΗΛΙΩΤΟΠΟΥΛΟΣ ΚΩΝΣΤΑΝΤΙΝΟΣ","Ο.Α.ΠΕΤΡΟΥΠΟΛΗΣ",35,0]
["12-29964","ΚΑΡΑΓΙΑΝΝΗΣ ΠΑΝΤΕΛΗΣ","Α.Ε.Τ.ΝΙΚΗ ΠΑΤΡΩΝ",32.5,0]
["12-28367","ΣΕΡΕΜΕΤΑΣ ΚΩΝΣΤΑΝΤΙΝΟΣ","Ο.Α.ΒΙΚΕΛΑΣ ΒΕΡΟΙΑΣ",30.5,0]
["12-30531","ΚΩΝΣΤΑΝΤΑΡΑΚΗΣ ΑΝΔΡΕΑΣ","Ο.Α.ΧΑΝΙΩΝ",30,0]
["12-31658","ΔΗΜΗΤΡΙΟΥ ΛΕΩΝ","Ο.Α.ΑΓΙΑΣ ΠΑΡΑΣΚΕΥΗΣ",29,0]
["12-30940","ΧΙΛΗΣ ΓΕΩΡΓΙΟΣ","Α.Ο.Α.ΣΤΑΥΡΟΥΠΟΛΗΣ ΙΦΙΤΟΣ",29,0]
["12-32620","ΓΚΕΛΗΣ ΚΩΝΣΤΑΝΤΙΝΟΣ","Ο.Α.ΜΑΓΝΗΣΙΑΣ",28.5,0]
["12-31953","ΣΙΜΑΤΟΣ ΓΕΩΡΓΙΟΣ","ΗΡΑΚΛΕΙΟ Ο.Α.& Α.",28.5,0]
["12-33790","ΚΟΥΣΑΡΙΔΗΣ ΔΗΜΗΤΡΙΟΣ","Σ.Α.ΘΕΣΣΑΛΟΝΙΚΗΣ",27,0]
["12-33546","ΜΠΙΝΟΠΟΥΛΟΣ ΔΗΜΗΤΡΗΣ","Ν.Ο.ΘΕΣΣΑΛΟΝΙΚΗΣ",26.5,0]
["12-33933","ΝΑΣΣΗΣ-ΝΤΑΝΙΑΣ ΙΩΑΝΝΗΣ","Ο.Α.ΒΡΙΛΗΣΣΙΩΝ",26.5,0]
["12-30546","ΤΣΑΓΛΙΩΤΗΣ ΑΝΤΩΝΗΣ","Ο.Α.ΡΕΘΥΜΝΟΥ",26.5,0]
["12-31882","ΠΑΠΑΚΩΣΤΟΠΟΥΛΟΣ ΣΤΥΛΙΑΝΟΣ","Α.Ο.ΑΡΓΥΡΟΥΠΟΛΗΣ",26,0]
["12-30389","ΜΗΤΣΟΠΟΥΛΟΣ ΠΕΡΙΚΛΗΣ","Ο.Α.ΩΡΑΙΟΚΑΣΤΡΟΥ Ο ΑΝΤΑΙΟΣ",25.5,0]
["12-32125","ΔΙΑΜΑΝΤΟΠΟΥΛΟΣ ΛΕΩΝΙΔΑΣ","Ο.Α.ΑΙΓΙΑΛΕΙΑΣ",24,0]
["12-32769","ΚΑΠΡΙΝΙΩΤΗΣ ΧΡΙΣΤΟΣ","Ο.Α.ΘΕΣΠΡΩΤΙΑΣ ΤΙΤΑΝΗ",24,0]
["12-29945","ΠΑΠΑΧΑΤΖΗΣ ΟΡΕΣΤΗΣ-ΑΝΤΩΝΙΟΣ","Ο.Α.ΑΙΓΙΑΛΕΙΑΣ",23.5,0]
["12-31584","ΙΑΚΩΒΙΔΗΣ ΜΗΝΑΣ","Ο.Α.ΑΘΗΝΩΝ",22,0]
["12-30135","ΠΑΝΤΑΖΙΔΗΣ ΧΡΗΣΤΟΣ","Ο.Α.ΚΑΛΑΜΑΤΑΣ",21.5,0]
["12-33499","ΓΕΩΡΓΟΠΟΥΛΟΣ ΦΙΛΙΠΠΟΣ","Α.Ο.Α.ΑΤΤΙΚΟΣ ΗΛΙΟΣ",21,0]
["12-28777","ΜΑΡΙΝΟΠΟΥΛΟΣ ΣΠΥΡΟΣ","Ο.Α.ΑΘΗΝΩΝ",21,0]
["12-31363","ΠΑΠΑΔΟΠΟΥΛΟΣ ΔΗΜΗΤΡΙΟΣ","ΠΑΝΘΡΑΚΙΚΟΣ Ο.Α.ΚΟΜΟΤΗΝΗΣ",20.5,0]
["12-31389","ΔΙΓΕΝΑΚΗΣ ΑΛΕΞΑΝΔΡΟΣ","Ο.Α.ΧΑΝΙΩΝ",19,0]
["12-32316","ΒΕΡΡΟΣ ΚΩΝΣΤΑΝΤΙΝΟΣ","Μ.Γ.Σ.ΑΠΟΛΛΩΝ ΚΑΛΑΜΑΡΙΑΣ",18.5,0]
["12-32468","ΣΑΚΕΛΛΑΡΙΔΗΣ ΓΕΩΡΓΙΟΣ","Α.Ο.Α.ΗΛΙΟΥΠΟΛΗΣ",18,0]
["12-34822","ΟΥΣΤΑΜΠΑΣΙΔΗΣ ΝΙΚΟΣ","Α.Ο.Α.ΚΑΤΕΡΙΝΗΣ",17.5,0]
["12-30792","ΠΗΛΙΧΟΣ ΑΝΑΣΤΑΣΙΟΣ","ΖΑΚΥΝΘΙΝΟΣ Α.Ο.Α",17,0]
["12-31595","ΑΝΕΣΙΔΗΣ ΔΗΜΗΤΡΙΟΣ","Α.Ο.Α.ΠΑΤΡΩΝ",16.5,0]
["12-31549","ΛΙΑΤΣΟΣ ΠΑΝΑΓΙΩΤΗΣ","Ο.Α.ΘΕΣΠΡΩΤΙΑΣ ΤΙΤΑΝΗ",16.5,0]
["12-33531","ΣΤΕΦΑΝΙΔΗΣ ΒΑΣΙΛΕΙΟΣ","Ο.Α.ΕΔΕΣΣΑΣ",16.5,0]
["12-31426","ΠΑΠΑΝΙΚΟΣ ΑΛΚΙΒΙΑΔΗΣ","Σ.Α.ΣΕΡΡΩΝ",16,0]
["12-33325","ΤΣΑΤΣΟΥΛΗΣ ΑΘΑΝΑΣΙΟΣ","Ο.Α.ΞΑΝΘΗΣ",15.5,0]
["12-34041","ΖΕΡΒΟΣ ΑΛΕΞΑΝΔΡΟΣ","Ο.Α.ΚΕΡΚΥΡΑΣ",14.5,0]
["12-30526","ΧΑΤΖΗΝΙΚΟΛΑΟΥ ΔΙΟΝΥΣΙΟΣ-ΤΣΑΜΠΙΚΟΣ","Ο.Α.ΧΑΝΙΩΝ",14.5,0]
["12-31331","ΤΖΙΦΑΣ-ΚΡΑΤΗΡΑΣ ΖΗΣΗΣ","Ο.Α.ΜΑΓΝΗΣΙΑΣ",14,0]
["12-33602","ΑΪΒΑΛΙΩΤΗΣ ΡΟΣ-ΑΝΤΩΝΙΟΣ","Ν.Ο.ΘΕΣΣΑΛΟΝΙΚΗΣ",13.5,0]
["12-30537","ΒΟΛΤΥΡΑΚΗΣ ΒΑΣΙΛΗΣ","Ο.Α.ΧΑΝΙΩΝ",13.5,0]
["12-31428","ΚΩΣΤΙΔΗΣ ΗΛΙΑΣ","ΣΕΡΡΑΪΚΟΣ Ο.Α.",13.5,0]
["12-31778","ΝΤΙΒΑΝΙΔΗΣ ΑΝΑΣΤΑΣΙΟΣ","Γ.Α.Σ.ΚΑΡΑΤΕ ΕΡΜΗΣ",13.5,0]
["12-33289","ΒΛΑΧΟΣ ΚΩΝΣΤΑΝΤΙΝΟΣ","Σ.Α.ΣΕΡΡΩΝ",13,0]
["12-31810","ΔΕΛΑΚΗΣ ΔΗΜΗΤΡΗΣ","ΗΡΑΚΛΕΙΟ Ο.Α.& Α.",12.5,0]
["12-32952","ΚΩΝΣΤΑΝΤΙΝΙΔΗΣ ΗΛΙΑΣ","ΖΑΚΥΝΘΙΝΟΣ Α.Ο.",12.5,0]
["12-32393","ΑΛΕΞΙΟΥ ΦΙΛΙΠΠΟΣ","Α.Γ.Ο.ΦΙΛΙΠΠΙΑΔΑΣ",12,0]
["12-30776","ΖΕΡΒΟΣ ΓΕΩΡΓΙΟΣ","Ο.Α.ΧΑΝΙΩΝ",11.5,0]
["12-33963","ΚΟΥΤΣΟΥΠΙΑΣ ΙΩΑΝΝΗΣ","Ο.Α.ΛΙΤΟΧΩΡΟΥ",11.5,0]
["12-31816","ΓΚΑΓΚΑΟΥΔΑΚΗΣ ΣΤΥΛΙΑΝΟΣ","ΗΡΑΚΛΕΙΟ Ο.Α.& Α.",10.5,0]
["12-30851","ΙΒΑΝΟΥΔΗΣ ΔΗΜΗΤΡΙΟΣ","Ο.Α.ΚΟΥΦΑΛΙΩΝ ΘΕΣΣΑΛΟΝΙΚΗΣ",10.5,0]
["12-31991","ΜΗΤΡΟΠΑΠΑΣ ΗΛΙΑΣ","Ο.Α.ΑΘΛΗΤ.ΠΑΙΔΕΙΑ",10,0]
["12-33622","ΜΠΟΥΡΑΣ ΙΩΑΝΝΗΣ","ΗΡΑΚΛΕΙΟ Ο.Α.& Α.",10,0]
["12-30977","ΝΟΥΧΑΚΗΣ ΓΕΩΡΓΙΟΣ","Ο.Α.ΣΟΥΔΑΣ",10,0]
["12-31938","ΣΙΔΗΡΟΠΟΥΛΟΣ ΡΑΦΑΗΛ","ΗΡΑΚΛΕΙΟ Ο.Α.& Α.",10,0]
["12-35032","ΒΛΑΧΟΣ ΝΕΚΤΑΡΙΟΣ","Γ.Ε.ΠΡΕΒΕΖΑΣ",9.5,0]
["12-31454","ΜΠΟΓΡΗΣ ΕΥΑΓΓΕΛΟΣ","ΗΡΑΚΛΕΙΟ Ο.Α.& Α.",9.5,0]
["12-30771","ΔΡΟΣΟΣ ΘΩΜΑΣ","Α.Ο.Α.ΣΤΑΥΡΟΥΠΟΛΗΣ ΙΦΙΤΟΣ",9,0]
["12-33919","ΚΑΒΑΛΛΙΕΡΟΣ ΑΛΕΞΙΟΣ","Ο.Α.ΑΘΛΗΤ.ΠΑΙΔΕΙΑ",9,0]
["12-33134","ΠΑΠΠΑΣ ΓΕΩΡΓΙΟΣ","Α.Σ.Α.ΠΑΜΒΩΤΙΣ ΙΩΑΝΝΙΝΩΝ",9,0]
["12-30376","ΣΒΗΓΚΑΣ ΚΩΝΣΤΑΝΤΙΝΟΣ","Α.Ο.Α.ΗΛΙΟΥΠΟΛΗΣ",9,0]
["12-32659","ΑΣΤΡΕΙΝΙΔΗΣ ΦΙΛΙΠΠΟΣ","Α.Ο.Α.ΠΑΠΑΓΟΥ",8.5,0]
["12-31948","ΣΚΟΥΠΑΣ ΣΩΤΗΡΙΟΣ","Α.Ο.ΣΙΚΥΩΝΟΣ ΚΙΑΤΟΥ",8.5,0]
["12-32782","ΧΑΡΑΛΑΜΠΙΔΗΣ ΜΑΡΙΟΣ","Ο.Α.ΓΟΥΔΙΟΥ",8.5,0]
["12-90147","ΧΟΦΤ ΣΤΥΜΟΝ-ΓΙΟΥΛΙΑΝ","Γ.Ε.ΠΡΕΒΕΖΑΣ",8.5,0]
["12-32098","ΧΡΙΣΤΟΔΟΥΛΟΠΟΥΛΟΣ ΧΡΗΣΤΟΣ-ΠΑΝΑΓΙΩΤΗΣ","Ο.Α.ΑΙΓΙΑΛΕΙΑΣ",8.5,0]
["12-31090","ΚΑΜΠΑΝΟΣ ΕΥΘΥΜΙΟΣ","ΚΕΦΑΛΛΗΝΙΑΚΟΣ Ο.Α.",8,0]
["12-29066","ΚΟΥΣΟΥΝΑΔΗΣ ΘΕΟΔΩΡΟΣ-ΧΑΡΑΛΑΜΠΟΣ","Α.Ο.ΚΑΒΑΛΑΣ ΜΑΚΕΔΟΝΙΚΟΣ",8,0]
["12-32821","ΠΑΠΠΑΣ ΚΩΝΣΤΑΝΤΙΝΟΣ","Ο.Α.ΑΡΤΑΣ",8,0]
["12-34584","ΑΔΑΛΟΓΛΟΥ ΑΧΙΛΛΕΑΣ","Γ.Α.Σ.ΚΑΡΑΤΕ ΕΡΜΗΣ",7.5,0]
["12-26764","ΛΑΜΠΡΟΠΟΥΛΟΣ ΚΛΕΟΜΒΡΟΤΟΣ","Α.Ε.Κ.ΤΡΙΠΟΛΗΣ",7.5,0]
["12-32601","ΜΠΑΛΑΤΣΙΝΟΣ ΓΕΡΑΣΙΜΟΣ","Ο.Α.ΚΕΡΚΥΡΑΣ",7.5,0]
["12-34274","ΣΑΒΒΑΣ ΓΕΩΡΓΙΟΣ","Ο.Α.ΑΡΤΑΣ",7.5,0]
["12-30846","ΤΖΩΡΤΖΟΣ ΜΑΡΙΟΣ","Α.Ο.Α.ΣΤΑΥΡΟΥΠΟΛΗΣ ΙΦΙΤΟΣ",7.5,0]
["12-32714","ΜΠΑΚΝΗΣ ΓΕΩΡΓΙΟΣ","Ο.Α.ΓΟΥΔΙΟΥ",7,0]
["12-32712","ΕΥΑΓΓΕΛΟΥ ΧΑΡΙΛΑΟΣ","Α.Γ.Ο.ΦΙΛΙΠΠΙΑΔΑΣ",6.5,0]
["12-33660","ΚΟΥΡΣΑΡΗΣ ΓΙΩΡΓΟΣ","Α.Α.ΑΙΓΑΛΕΩ",6.5,0]
["12-32088","ΛΑΣΚΑΡΑΤΟΣ ΠΑΥΛΟΣ","ΚΕΦΑΛΛΗΝΙΑΚΟΣ Ο.Α.",6.5,0]
["12-33302","ΜΗΤΤΑΡΗΣ ΝΙΚΟΛΑΟΣ","Α.Σ.Α.ΠΑΜΒΩΤΙΣ ΙΩΑΝΝΙΝΩΝ",6.5,0]
["12-31792","ΣΑΚΟΓΙΑΝΝΗΣ ΒΑΠΤΙΣΤΗΣ","Α.Ο.Α.ΧΑΪΔΑΡΙΟΥ",6.5,0]
["12-33565","ΖΑΧΑΡΟΓΙΩΡΓΑΣ ΙΩΑΝΝΗΣ","Γ.Ο.ΠΕΡΙΣΤΕΡΙΟΥ Γ.ΠΑΛΑΣΚΑΣ",6,0]
["12-32729","ΚΑΣΤΑΜΟΝΙΤΗΣ ΑΛΚΙΝΟΟΣ-ΠΑΝΑΓΙΩΤΗΣ","Ο.Α.ΚΕΡΚΥΡΑΣ",6,0]
["12-31442","ΠΑΤΕΡΑΚΗΣ ΚΩΝΣΤΑΝΤΙΝΟΣ","Α.Ο.ΛΑΤΩ ΑΓ.ΝΙΚΟΛΑΟΥ",6,0]
["12-32917","ΣΛΟΥΜ-ΤΡΑΚΑΣ ΡΑΦΑΕΛ","Ο.Α.ΚΕΡΚΥΡΑΣ",6,0]
["12-34243","ΑΝΔΡΟΥΛΑΚΗΣ ΚΩΝΣΤΑΝΤΙΝΟΣ","Α.Ο.Α.ΧΑΪΔΑΡΙΟΥ",5.5,0]
["12-33842","ΔΗΜΗΤΡΙΟΥ ΑΡΙΣΤΕΙΔΗΣ","Α.Ν.Ο.ΓΛΥΦΑΔΑΣ",5.5,0]
["12-30484","ΚΑΡΑΓΙΑΝΝΙΔΗΣ ΣΤΥΛΙΑΝΟΣ","Ο.Α.ΞΑΝΘΗΣ",5.5,0]
["12-30532","ΜΗΛΙΩΝΗΣ ΚΩΝΣΤΑΝΤΙΝΟΣ","Ο.Α.ΧΑΝΙΩΝ",5.5,0]
["12-34459","ΠΑΠΟΥΤΣΗΣ ΚΩΝΣΤΑΝΤΙΝΟΣ","Α.Γ.Ο.ΦΙΛΙΠΠΙΑΔΑΣ",5.5,0]
["12-34836","ΣΑΒΒΑΚΗΣ ΔΗΜΗΤΡΗΣ","Ο.Α.ΡΕΘΥΜΝΟΥ",5.5,0]
["12-31877","ΣΤΑΜΟΥΛΟΣ ΓΙΑΝΝΗΣ","Α.Ο.Α.ΗΛΙΟΥΠΟΛΗΣ",5.5,0]
["12-30767","ΤΡΙΑΝΤΑΦΥΛΛΙΔΗΣ ΑΒΡΑΑΜ","ΠΑΝΘΡΑΚΙΚΟΣ Ο.Α.ΚΟΜΟΤΗΝΗΣ",5.5,0]
["12-33870","ΧΩΡΙΝΟΣ ΑΛΕΞΑΝΔΡΟΣ","Α.Ν.Ο.ΓΛΥΦΑΔΑΣ",5.5,0]
["12-29321","ΑΝΑΣΤΟΠΟΥΛΟΣ ΝΙΚΟΛΑΟΣ","Α.Ε.Κ.ΤΡΙΠΟΛΗΣ",5,0]
["12-33606","ΓΙΩΤΗΣ ΧΑΡΑΛΑΜΠΟΣ","Γ.Ο.ΠΕΡΙΣΤΕΡΙΟΥ Γ.ΠΑΛΑΣΚΑΣ",5,0]
["12-31554","ΔΕΔΟΥΣΗΣ ΔΗΜΗΤΡΗΣ","Ο.Α.ΜΑΓΝΗΣΙΑΣ",5,0]
["12-31872","ΖΑΦΕΙΡΟΠΟΥΛΟΣ ΓΙΩΡΓΟΣ","Α.Ο.Π.ΦΑΛΗΡΟΥ",5,0]
["12-34824","ΚΟΥΝΤΟΥΡΑΚΗΣ ΙΩΑΝΝΗΣ","Σ.Α.ΘΕΣΣΑΛΟΝΙΚΗΣ",5,0]
["12-31101","ΜΙΧΑΛΟΠΟΥΛΟΣ ΠΑΣΧΑΛΗΣ","Α.Α.ΑΛΜΠΑΤΡΟΣ",5,0]
["12-31796","ΜΠΑΛΑΝΟΣ ΓΕΩΡΓΙΟΣ","Ο.Α.ΙΩΑΝΝΙΝΩΝ",5,0]
["12-30360","ΠΑΠΟΥΝΙΔΗΣ ΟΡΕΣΤΗΣ","Ο.Α.ΩΡΑΙΟΚΑΣΤΡΟΥ Ο ΑΝΤΑΙΟΣ",5,0]
["12-34350","ΠΑΤΙΝΙΩΤΗΣ ΓΕΩΡΓΙΟΣ","Σ.Α.ΡΑΦΗΝΑΣ",5,0]
["12-30918","ΤΡΙΑΝΤΑΦΥΛΛΙΔΗΣ-ΚΟΥΛΟΥΡΙΩΤΗΣ ΕΥΣΤΑΘΙΟΣ","Ε.Σ.Ο.ΕΠΙΚΟΥΡΟΣ ΠΟΛΙΧΝΗΣ",5,0]
["12-32131","ΑΝΑΓΝΩΣΤΑΚΗΣ ΒΑΣΙΛΕΙΟΣ","ΚΕΦΑΛΛΗΝΙΑΚΟΣ Ο.Α.",4.5,0]
["12-33558","ΒΑΣΙΛΕΙΑΔΗΣ ΙΩΑΝΝΗΣ-ΜΑΞΙΜΟΣ","ΠΑΝΘΡΑΚΙΚΟΣ Ο.Α.ΚΟΜΟΤΗΝΗΣ",4.5,0]
["12-31885","ΝΙΚΟΛΟΠΟΥΛΟΣ ΑΛΕΞΑΝΔΡΟΣ","Α.Ο.Π.ΦΑΛΗΡΟΥ",4.5,0]
["12-32101","ΣΠΗΛΙΩΤΟΠΟΥΛΟΣ ΔΗΜΗΤΡΙΟΣ","Ο.Α.ΑΙΓΙΑΛΕΙΑΣ",4.5,0]
["12-34371","ΑΓΓΕΛΗΣ ΜΙΧΑΗΛ","Α.Ο.Α.ΑΙΓΑΛΕΩ 92",4,0]
["12-33701","ΑΝΤΩΝΙΑΔΗΣ ΦΩΤΙΟΣ-ΑΝΔΡΕΑΣ","Α.Ν.Ο.ΓΛΥΦΑΔΑΣ",4,0]
["12-30547","ΖΩΤΟΣ ΧΡΗΣΤΟΣ","Ο.Α.ΓΛΥΦΑΔΑΣ",4,0]
["12-32839","ΚΑΜΠΟΥΡΗΣ ΕΜΜΑΝΟΥΗΛ","ΡΟΔΙΑΚΟΣ Ο.Α.",4,0]
["12-30254","ΜΟΥΡΓΚΟΣ ΧΑΡΑΛΑΜΠΟΣ","Α.Σ.ΑΚΑΔΗΜΙΕΣ ΠΡΩΤΑΘΛΗΤΩΝ ΠΕΥΚΩΝ",4,0]
["12-34758","ΜΟΥΣΑΒΕΡΕΣ ΚΩΝΣΤΑΝΤΙΝΟΣ","Α.Ο.ΒΑΡΗΣ ΑΝΑΓΥΡΟΥΣ",4,0]
["12-34583","ΜΠΑΛΚΟΓΛΟΥ ΚΥΡΙΑΖΗΣ","Ο.Α.ΧΑΝΙΩΝ",4,0]
["12-34886","ΡΟΔΟΠΟΥΛΟΣ ΣΑΒΒΑΣ","Ο.Α.ΚΑΣΤΟΡΙΑΣ ΚΕΛΕΤΡΟΝ",4,0]
["12-31869","ΒΑΣΙΛΟΓΛΟΥ-ΚΑΜΕΝΙΔΗΣ ΙΩΑΝΝΗΣ","Ο.Α.ΑΡΙΔΑΙΑΣ",3.5,0]
["12-32830","ΖΗΚΟΣ ΔΗΜΗΤΡΙΟΣ","Γ.Ε.ΠΡΕΒΕΖΑΣ",3.5,0]
["12-32218","ΜΑΛΙΝΔΡΕΤΟΣ ΜΙΧΑΗΛ","Σ.Α.ΡΑΦΗΝΑΣ",3.5,0]
["12-33362","ΦΑϊΤΣΑΣ ΝΙΚΟΛΑ","ΚΕΡΚΥΡΑΪΚΗ Λ.Τ.",3.5,0]
["12-34543","ΧΑΡΑΛΑΜΠΙΔΗΣ ΘΕΟΦΙΛΟΣ","Α.Ο.Α.ΝΕΑΣ ΠΕΡΑΜΟΥ ΟΙ ΤΙΤΑΝΕΣ",3.5,0]
["12-34529","ΓΚΟΝΟΣ ΑΝΑΣΤΑΣΙΟΣ","Ο.Α.ΙΩΑΝΝΙΝΩΝ",3,0]
["12-29155","ΚΕΛΑΪΔΟΠΟΥΛΟΣ ΑΝΔΡΕΑΣ","Ο.Α.ΜΑΓΝΗΣΙΑΣ",3,0]
["12-33503","ΚΟΒΑΝΙΔΗΣ ΠΕΡΙΚΛΗΣ","ΣΕΡΡΑΪΚΟΣ Ο.Α.",3,0]
["12-29178","ΚΥΡΜΙΖΑΚΗΣ ΕΜΜΑΝΟΥΗΛ","Ο.Α.ΒΕΡΟΙΑΣ",3,0]
["12-34499","ΚΩΝΣΤΑΝΤΙΝΟΥ ΛΑΜΠΡΟΣ","Ο.Α.ΣΟΦΑΔΩΝ ΚΑΡΔΙΤΣΑΣ",3,0]
["12-30407","ΚΩΣΤΑΡΑΣ ΓΕΩΡΓΙΟΣ","Α.Ο.ΤΑΤΟΪΟΥ",3,0]
["12-33916","ΜΗΤΡΟΠΟΥΛΟΣ ΝΙΚΟΛΑΟΣ","Ο.Α.ΑΘΛΗΤ.ΠΑΙΔΕΙΑ",3,0]
["12-32737","ΝΤΑΛΛΗΣ ΕΥΑΓΓΕΛΟΣ","Α.Ο.Α.ΗΛΙΟΥΠΟΛΗΣ",3,0]
["12-32592","ΠΟΛΥΖΟΣ ΔΗΜΟΣΘΕΝΗΣ","Ο.Α.ΜΑΓΝΗΣΙΑΣ",3,0]
["12-29347","ΤΖΩΡΤΖΗΣ ΧΡΗΣΤΟΣ-ΜΙΧΑΗΛ","Ο.Α.ΜΑΓΝΗΣΙΑΣ",3,0]
["12-34307","ΦΟΡΤΟΥΝΑΣ ΑΛΕΞΑΝΔΡΟΣ","Ο.Α.ΑΘΗΝΩΝ",3,0]
["12-31396","ΑΓΓΕΛΟΠΟΥΛΟΣ ΠΑΝΑΓΙΩΤΗΣ","Α.Ο.ΣΙΚΥΩΝΟΣ ΚΙΑΤΟΥ",2.5,0]
["12-34715","ΕΣΕΡΙΔΗΣ ΝΙΚΟΛΑΟΣ","Ο.Α.ΜΑΓΝΗΣΙΑΣ",2.5,0]
["12-34606","ΚΑΡΑΣ ΑΓΓΕΛΟΣ","ΗΡΑΚΛΕΙΟ Ο.Α.& Α.",2.5,0]
["12-34120","ΚΕΦΑΛΟΓΙΑΝΝΗΣ ΒΑΓΓΕΛΗΣ","ΦΙΛΙΑ Τ.Κ.",2.5,0]
["12-33659","ΚΟΥΡΣΑΡΗΣ ΝΙΚΗΤΑΣ","Α.Α.ΑΙΓΑΛΕΩ",2.5,0]
["12-34929","ΚΟΥΤΡΑΚΗΣ ΝΙΚΟΛΑΟΣ","ΗΡΑΚΛΕΙΟ Ο.Α.& Α.",2.5,0]
["12-28614","ΜΠΟΥΡΤΖΟΣ ΠΑΝΑΓΙΩΤΗΣ","Α.Ε.Κ.ΤΡΙΠΟΛΗΣ",2.5,0]
["12-33742","ΠΑΠΑΝΔΡΟΥΔΗΣ ΜΙΛΤΙΑΔΗΣ","Α.Α.ΑΙΓΑΛΕΩ",2.5,0]
["12-33758","ΠΑΠΑΣΠΥΡΟΠΟΥΛΟΣ ΓΕΩΡΓΙΟΣ","Ο.Α.ΡΙΟΥ",2.5,0]
["12-33767","ΠΑΠΠΑΣ ΕΥΑΓΓΕΛΟΣ","Ο.Α.ΡΙΟΥ",2.5,0]
["12-32902","ΣΙΟΥΤΟΓΛΟΥ ΚΩΝΣΤΑΝΤΙΝΟΣ","Σ.Α.ΕΛΑΣΣΟΝΑΣ",2.5,0]
["12-31908","ΣΤΑΝΕΛΛΟΣ ΚΩΝΣΤΑΝΤΙΝΟΣ","Ο.Α.ΚΕΡΚΥΡΑΣ",2.5,0]
["12-32490","ΤΖΟΚΑΣ ΣΠΥΡΙΔΩΝ","Γ.Ε.ΠΡΕΒΕΖΑΣ",2.5,0]
["12-35333","ΤΣΑΚΙΡΑΚΗΣ ΓΙΩΡΓΟΣ","ΗΡΑΚΛΕΙΟ Ο.Α.& Α.",2.5,0]
["12-32680","ΦΩΤΕΙΝΟΠΟΥΛΟΣ ΑΘΑΝΑΣΙΟΣ","Α.Ο.Α.ΗΛΙΟΥΠΟΛΗΣ",2.5,0]
["12-30878","ΑΝΔΡΙΟΠΟΥΛΟΣ ΒΑΣΙΛΕΙΟΣ-ΛΟΥΚΑΣ","Α.Ε.Τ.ΝΙΚΗ ΠΑΤΡΩΝ",2,0]
["12-34608","ΑΡΑΠΗΣ ΕΛΕΥΘΕΡΙΟΣ","Α.Γ.Ο.ΦΙΛΙΠΠΙΑΔΑΣ",2,0]
["12-32567","ΔΑΜΑΣΙΩΤΗΣ ΕΥΑΓΓΕΛΟΣ","Α.Ο.Α.ΦΙΛΟΘΕΗΣ",2,0]
["12-33877","ΕΥΦΡΑΙΜΟΓΛΟΥ-ΜΠΟΤΑΣΗΣ ΛΑΖΑΡΟΣ","Ο.Α.ΑΘΗΝΩΝ",2,0]
["12-33107","ΚΑΛΠΑΤΖΙΔΗΣ ΗΡΑΚΛΗΣ","ΣΕΡΡΑΪΚΟΣ Ο.Α.",2,0]
["12-34494","ΚΟΝΤΗΣ ΑΝΑΣΤΑΣΙΟΣ","Ο.Α.ΓΛΥΦΑΔΑΣ",2,0]
["12-32489","ΚΟΤΤΑΣ ΕΠΑΜΕΙΝΩΝΔΑΣ","Γ.Ε.ΠΡΕΒΕΖΑΣ",2,0]
["12-32803","ΛΟΥΚΑΣ ΣΤΕΡΓΙΟΣ","Ο.Α.ΑΛΕΞΑΝΔΡΟΣ ΒΕΡΟΙΑΣ",2,0]
["12-34646","ΜΑΓΚΟΥΤΑΣ ΓΕΩΡΓΙΟΣ","Ο.Α.ΚΑΙΣΑΡΙΑΝΗΣ",2,0]
["12-35113","ΜΑΝΟΣ ΓΕΩΡΓΙΟΣ","Ο.Α.ΚΕΡΚΥΡΑΣ",2,0]
["12-30605","ΣΑΡΡΗΣ ΕΛΕΥΘΕΡΙΟΣ","Ο.Α.ΜΑΓΝΗΣΙΑΣ",2,0]
["12-31564","ΤΙΜΟΘΕΑΔΗΣ ΙΩΑΝΝΗΣ","Α.Α.ΑΛΜΠΑΤΡΟΣ",2,0]
["12-32804","ΑΝΑΝΙΑΔΗΣ ΜΙΧΑΛΗΣ","Ο.Α.ΑΛΕΞΑΝΔΡΟΣ ΒΕΡΟΙΑΣ",1.5,0]
["12-32221","ΒΑΣΙΛΕΙΟΥ ΚΩΝΣΤΑΝΤΙΝΟΣ","Ν.Ο.Ν.Α.Μ",1.5,0]
["12-32488","ΓΑΪΤΑΝΑΡΟΣ ΓΕΩΡΓΙΟΣ","Γ.Ε.ΠΡΕΒΕΖΑΣ",1.5,0]
["12-32802","ΓΕΩΡΓΟΠΟΥΛΟΣ ΓΙΑΝΝΗΣ","Ο.Α.ΑΛΕΞΑΝΔΡΟΣ ΒΕΡΟΙΑΣ",1.5,0]
["12-30149","ΓΚΕΚΑΣ ΓΕΩΡΓΙΟΣ","Α.Ε.Κ.ΤΡΙΠΟΛΗΣ",1.5,0]
["12-27663","ΓΡΑΠΑΤΣΑΣ ΦΑΝΟΥΡΙΟΣ","Σ.Ο.Α.ΚΑΡΔΙΤΣΑΣ ΦΩΚΙΑΝΟΣ",1.5,0]
["12-32926","ΔΕΜΕΡΛΙΩΤΗΣ ΚΩΝΣΤΑΝΤΙΝΟΣ","Ο.Α.ΣΟΦΑΔΩΝ ΚΑΡΔΙΤΣΑΣ",1.5,0]
["12-32431","ΔΙΑΜΑΝΤΟΠΟΥΛΟΣ ΠΑΥΛΟΣ","Ο.Α.ΑΙΓΙΑΛΕΙΑΣ",1.5,0]
["12-35176","ΖΕΡΒΙΔΗΣ ΑΝΤΩΝΙΟΣ","Σ.Α.ΣΕΡΡΩΝ",1.5,0]
["12-34930","ΚΑΖΑΚΟΣ ΙΑΣΩΝ","Γ.Ο.ΠΕΡΙΣΤΕΡΙΟΥ Γ.ΠΑΛΑΣΚΑΣ",1.5,0]
["12-34453","ΚΑΡΑΓΙΑΝΝΗΣ ΚΩΝ/ΝΟΣ","Α.Γ.Ο.ΦΙΛΙΠΠΙΑΔΑΣ",1.5,0]
["12-32676","ΚΑΡΑΜΑΝΗΣ ΚΩΝΣΤΑΝΤΙΝΟΣ","ΚΕΝΤΡΟ ΑΝΤΙΣΦΑΙΡΙΣΗΣ ΛΙΒΑΔΕΙΑΣ",1.5,0]
["12-32759","ΚΑΡΑΜΑΝΟΣ ΝΙΚΟΛΑΟΣ","Α.Ο.ΑΙΓΙΟΥ ΜΟΡΕΑΣ",1.5,0]
["12-32836","ΚΕΦΑΛΑΣ ΓΙΩΡΓΟΣ","Ο.Α.ΑΡΤΑΣ",1.5,0]
["12-34658","ΚΟΛΟΒΟΣ ΑΝΔΡΕΑΣ","Μ.Α.Σ.ΑΕΤΟΣ ΘΕΣΣΑΛΟΝΙΚΗΣ",1.5,0]
["12-30538","ΚΟΥΜΑΝΔΡΑΚΗΣ ΝΙΚΟΛΑΟΣ","Ο.Α.ΧΑΝΙΩΝ",1.5,0]
["12-32390","ΚΩΣΤΑΣ ΛΑΜΠΡΟΣ","Α.Γ.Ο.ΦΙΛΙΠΠΙΑΔΑΣ",1.5,0]
["12-34275","ΛΕΥΘΕΡΙΩΤΗΣ ΠΑΝΑΓΙΩΤΗΣ","Α.Ο.ΣΙΚΥΩΝΟΣ ΚΙΑΤΟΥ",1.5,0]
["12-34825","ΛΟΓΟΘΕΤΗΣ ΧΑΡΑΛΑΜΠΟΣ","Γ.Ε.ΠΡΕΒΕΖΑΣ",1.5,0]
["12-32792","ΛΥΤΙΝΑΣ ΚΩΝ/ΝΟΣ","Ο.Α.ΠΤΟΛΕΜΑΪΔΑΣ",1.5,0]
["12-33008","ΜΑΓΚΟΥΤΑΣ ΜΑΡΛΟΝ","Α.Ο.ΚΗΦΙΣΙΑΣ",1.5,0]
["12-28665","ΜΑΜΑΗΣ ΙΩΑΝΝΗΣ","Σ.Α.ΓΑΛΑΤΣΙΟΥ",1.5,0]
["12-32901","ΜΠΑΛΑΤΖΑΡΑΣ ΑΠΟΣΤΟΛΟΣ","Ο.Α.ΝΙΚΑΙΑ ΛΑΡΙΣΑΣ",1.5,0]
["12-32819","ΜΠΑΛΑΤΣΟΣ ΑΛΕΞΑΝΔΡΟΣ","Ο.Α.ΑΡΤΑΣ",1.5,0]
["12-34076","ΠΑΝΤΕΛΙΔΗΣ ΚΩΝ/ΝΟΣ","Ο.Α.ΠΤΟΛΕΜΑΪΔΑΣ",1.5,0]
["12-33451","ΠΑΠΑΔΑΤΟΣ ΝΙΚΟΛΑΟΣ","ΚΕΦΑΛΛΗΝΙΑΚΟΣ Ο.Α.",1.5,0]
["12-33472","ΠΑΠΑΝΔΡΟΥΔΗΣ ΜΙΛΤΙΑΔΗΣ","Ο.Α.ΑΛΕΞΑΝΔΡΟΥΠΟΛΗΣ",1.5,0]
["12-32660","ΠΑΠΑΠΑΝΑΓΙΩΤΟΥ ΑΠΟΛΛΩΝ","Α.Ο.Α.ΠΑΠΑΓΟΥ",1.5,0]
["12-33863","ΠΟΛΥΜΕΡΟΠΟΥΛΟΣ ΠΑΝΑΓΙΩΤΗΣ","Α.Ο.Π.ΦΑΛΗΡΟΥ",1.5,0]
["12-34828","ΣΠΥΡΙΔΑΚΗΣ ΘΕΟΔΩΡΟΣ","ΚΕΦΑΛΛΗΝΙΑΚΟΣ Ο.Α.",1.5,0]
["12-31516","ΣΥΡΡΑΚΟΣ ΝΙΚΟΛΑΟΣ","Α.Ο.Π.ΦΑΛΗΡΟΥ",1.5,0]
["12-33780","ΤΣΙΓΓΙΡΟΠΟΥΛΟΣ ΧΡΗΣΤΟΣ","Α.Σ.Α.ΠΑΝΟΡΑΜΑΤΟΣ",1.5,0]
["12-34704","ΧΡΗΣΤΑΚΗΣ ΑΝΑΣΤΑΣΙΟΣ","Α.Ο.ΚΑΒΑΛΑΣ ΜΑΚΕΔΟΝΙΚΟΣ",1.5,0]
["12-32805","ΑΒΡΑΜΙΔΗΣ ΓΙΑΝΝΗΣ","Ο.Α.ΑΛΕΞΑΝΔΡΟΣ ΒΕΡΟΙΑΣ",1,0]
["12-31868","ΒΑΣΙΛΟΓΛΟΥ ΘΕΟΔΩΡΟΣ","Ο.Α.ΑΡΙΔΑΙΑΣ",1,0]
["12-34281","ΓΕΩΡΓΑΚΟΠΟΥΛΟΣ ΑΓΓΕΛΟΣ-ΤΑΞΙΑΡΧΗΣ","Α.Ο.ΜΕΓΑΣ ΑΛΕΞΑΝΔΡΟΣ",1,0]
["12-33188","ΔΙΑΜΑΝΤΟΠΟΥΛΟΣ-ΓΚΑΜΑΛΕΤΣΟΣ ΒΑΣΙΛΕΙΟΣ","Ο.Α.ΙΩΛΚΟΣ ΒΟΛΟΥ",1,0]
["12-31301","ΘΕΟΔΩΡΑΤΟΣ ΔΙΟΝΥΣΙΟΣ","Γ.Σ.ΚΗΦΙΣΙΑΣ",1,0]
["12-33324","ΚΑΛΑΝΤΖΗΣ ΝΙΚΟΛΑΟΣ","Ο.Α.ΘΕΣΠΡΩΤΙΑΣ ΤΙΤΑΝΗ",1,0]
["12-31985","ΚΑΡΑΜΑΝΟΣ ΒΑΣΙΛΕΙΟΣ","Α.Ε.Κ.ΤΡΙΠΟΛΗΣ",1,0]
["12-33563","ΚΑΤΩΠΟΔΗΣ ΚΩΝΣΤΑΝΤΙΝΟΣ","Α.Σ.ΠΕΡΑ",1,0]
["12-31504","ΚΟΥΤΣΟΧΙΩΝΗΣ ΟΔΥΣΣΕΑΣ","ΦΙΛΑΘΛΗΤ.ΣΥΛ.ΛΑΜΙΑΣ",1,0]
["12-35024","ΚΡΩΦΟΡΝΤ ΘΩΜΑΣ-ΛΩΡΕΝΣ","Α.Ο.Α.ΑΤΤΙΚΟΣ ΗΛΙΟΣ",1,0]
["12-35116","ΛΑΦΙΑΤΗΣ ΕΥΣΤΡΑΤΙΟΣ","Ο.Α.ΑΘΗΝΩΝ",1,0]
["12-32432","ΛΙΟΛΙΟΣ ΝΙΚΟΛΑΟΣ","Ο.Α.ΑΙΓΙΑΛΕΙΑΣ",1,0]
["12-30530","ΜΑΥΡΟΜΜΑΤΗΣ ΚΩΝΣΤΑΝΤΙΝΟΣ","Ο.Α.ΧΑΝΙΩΝ",1,0]
["12-34706","ΜΠΙΛΛΙΑΣ ΘΕΟΔΩΡΟΣ","Σ.Α.ΘΕΣΣΑΛΟΝΙΚΗΣ",1,0]
["12-33358","ΞΕΦΤΕΡΗ ΕΛΕΝΗ-ΕΙΡΗΝΗ","Α.Α.ΑΛΜΠΑΤΡΟΣ",1,0]
["12-33393","ΞΥΝΟΣ ΑΘΑΝΑΣΙΟΣ","Ο.Α.ΠΤΟΛΕΜΑΪΔΑΣ",1,0]
["12-35043","ΠΑΝΑΓΗΣ ΕΜΜΑΝΟΥΗΛ","Α.Ο.Α.ΗΛΙΟΥΠΟΛΗΣ",1,0]
["12-34518","ΠΑΠΑΔΟΠΟΥΛΟΣ ΔΗΜΗΤΡΗΣ","Ο.Α.ΡΙΟΥ",1,0]
["12-32931","ΠΕΤΡΑΚΗΣ ΓΙΩΡΓΟΣ","Ο.Α.ΣΟΥΔΑΣ",1,0]
["12-29388","ΣΑΛΓΚΑΜΗΣ ΔΑΝΙΗΛ","Α.Σ.Α.ΛΑΡΙΣΑΣ",1,0]
["12-33309","ΣΔΡΟΛΑΣ ΣΤΑΥΡΟΣ","Ο.Α.ΧΟΛΑΡΓΟΥ",1,0]
["12-33926","ΣΥΜΕΩΝΙΔΗΣ ΙΑΣΩΝ","Α.Ο.Α.ΣΤΑΥΡΟΥΠΟΛΗΣ ΙΦΙΤΟΣ",1,0]
["12-34647","ΦΛΩΡΟΠΟΥΛΟΣ ΧΡΙΣΤΟΦΟΡΟΣ","Α.Ο.Α.ΠΑΠΑΓΟΥ",1,0]
["12-34006","ΧΑΤΖΗΣΑΒΒΑΣ ΧΡΗΣΤΟΣ","Ε.Α.Σ.ΟΛΥΜΠΙΑΔΑ",1,0]
["12-30741","ΧΟΛΕΒΑΣ  ΑΘΑΝΑΣΙΟΣ ","Ο.Α.ΑΙΓΙΑΛΕΙΑΣ",1,0]
["12-34517","ΧΟΥΣΟΣ ΠΑΝΑΓΙΩΤΗΣ","Ο.Α.ΡΙΟΥ",1,0]
["12-30870","ΜΕΡΙΧΩΡΙΤΗΣ ΙΩΑΝΝΗΣ","Α.Ο.Π.ΦΑΛΗΡΟΥ",0.5,0]
["12-32825","ΝΟΜΙΚΟΣ ΠΑΝΤΕΛΗΣ","Ο.Α.ΣΑΛΑΜΙΝΑΣ",0.5,0]
["12-32954","ΣΑΛΠΑΣ ΠΕΤΡΟΣ","Σ.Φ.Α.ΜΕΛΙΣΣΙΩΝ Ο ΦΟΙΒΟΣ",0.5,0]
["12-34708","ΤΣΑΚΜΑΚΙΔΗΣ ΑΠΟΣΤΟΛΟΣ","Σ.Α.ΘΕΣΣΑΛΟΝΙΚΗΣ",0.5,0]
["12-32482","ΒΑΣΙΟΣ ΚΩΝΣΤΑΝΤΙΝΟΣ-ΜΙΧΑΗΛ","Ο.Α.ΒΟΥΛΙΑΓΜΕΝΗΣ ΜΙΚΡΟΙ ΑΣΣΟΙ",0,0]
["12-33605","ΜΙΧΑΛΟΠΟΥΛΟΣ ΑΛΕΞΑΝΔΡΟΣ","ΚΕΡΚΥΡΑΪΚΗ Λ.Τ.",0,0]
["12-34462","ΠΕΤΣΟΥΚΗΣ ΓΕΩΡΓΙΟΣ","Α.Γ.Ο.ΦΙΛΙΠΠΙΑΔΑΣ",0,0]
["12-33864","ΝΑΝΟΥΡΗΣ ΓΕΩΡΓΙΟΣ","Ο.Α.ΚΑΙΣΑΡΙΑΝΗΣ",0,0]
["14-27951","ΣΚΟΡΙΛΑΣ ΑΛΕΞΑΝΔΡΟΣ","ΑΚΑΔ.ΑΝΤΙΣΦ.ΙΩΑΝΝΙΝΩΝ",480,0]
["14-30054","ΣΑΚΕΛΛΑΡΙΔΗΣ ΜΙΧΑΛΗΣ","Ο.Α.ΑΓΙΑΣ ΠΑΡΑΣΚΕΥΗΣ",333,0]
["14-24455","ΤΑΡΑΜΟΝΛΗΣ ΔΗΜΟΣΘΕΝΗΣ","Γ.Α.Σ.ΚΑΡΑΤΕ ΕΡΜΗΣ",275.5,0]
["14-28405","ΚΑΡΔΑΡΗΣ ΑΝΔΡΕΑΣ","Ο.Α.ΑΘΗΝΩΝ",261,0]
["14-26533","ΖΕΡΔΙΛΑΣ ΑΙΤΟΡ","Ο.Α.ΠΕΤΡΟΥΠΟΛΗΣ",237,0]
["14-28426","ΦΩΤΕΙΝΟΠΟΥΛΟΣ ΙΩΑΝΝΗΣ","Α.Ο.Α.ΗΛΙΟΥΠΟΛΗΣ",222,0]
["14-29854","ΚΟΥΤΣΙΚΟΣ ΒΑΣΙΛΕΙΟΣ","ΦΘΙΩΤΙΚΟΣ Ο.Α.",217,0]
["14-27371","ΤΣΙΤΣΙΠΑΣ ΠΕΤΡΟΣ","Ο.Α.ΓΛΥΦΑΔΑΣ",188,0]
["14-29804","ΛΑΠΠΑΣ ΘΕΟΔΟΣΙΟΣ","ΑΚΑΔΗΜΙΑ ΑΝΤΙΣΦ.ΣΕΡΡΩΝ 2008",168,0]
["14-29567","ΘΑΝΟΣ ΑΡΙΣΤΟΤΕΛΗΣ","Α.Ο.Α.ΗΛΙΟΥΠΟΛΗΣ",164,0]
["14-29857","ΚΟΥΤΣΟΥΜΠΑΣ ΔΗΜΗΤΡΙΟΣ","ΦΘΙΩΤΙΚΟΣ Ο.Α.",162.5,0]
["14-31488","ΜΑΝΟΠΟΥΛΟΣ ΝΙΚΟΛΑΟΣ","ΦΘΙΩΤΙΚΟΣ Ο.Α.",160,0]
["14-28083","ΧΡΙΣΤΟΔΟΥΛΟΥ ΒΕΛΙΣΣΑΡΙΟΣ","Α.Ο.Α.ΦΙΛΟΘΕΗΣ",158,0]
["14-27841","ΠΑΠΑΪΩΑΝΝΟΥ ΟΔΥΣΣΕΑΣ","Α.Ο.Α.ΣΤΑΥΡΟΥΠΟΛΗΣ ΙΦΙΤΟΣ",157,0]
["14-29185","ΡΑΠΤΗΣ ΝΙΚΟΛΑΟΣ","Α.Ο.Α.ΣΤΑΥΡΟΥΠΟΛΗΣ ΙΦΙΤΟΣ",154.5,0]
["14-29808","ΡΟΖΟΣ ΝΙΚΟΛΑΟΣ","Ο.Α.ΙΩΑΝΝΙΝΩΝ",146.5,0]
["14-28084","ΙΩΑΝΝΙΔΗΣ ΠΕΤΡΟΣ","Α.Ο.Α.ΦΙΛΟΘΕΗΣ",144,0]
["14-28356","ΕΞΙΖΙΔΗΣ-ΜΑΓΙΕΡ ΤΖΕΪΣΟΝ-ΒΙΛΛΥ","Ο.Α.ΑΛΕΞΑΝΔΡΟΣ ΒΕΡΟΙΑΣ",141,0]
["14-28958","ΦΟΥΖΑΣ ΧΑΡΑΛΑΜΠΟΣ","ΠΕΥΚΗ Γ.ΚΑΛΟΒΕΛΩΝΗΣ",134.5,0]
["14-28465","ΚΟΥΔΟΥΝΑΣ ΜΙΛΤΙΑΔΗΣ","Α.Ο.Α.ΦΙΛΟΘΕΗΣ",131,0]
["14-29888","ΤΡΙΚΚΑΣ-ΨΩΜΑΣ ΝΙΚΟΛΑΟΣ","Α.Σ.ΤΕΝΙΣ ΚΛΑΜΠ ΚΟΖΑΝΗΣ",124,0]
["14-30411","ΔΑΓΚΛΗΣ ΧΡΗΣΤΟΣ-ΠΑΝΑΓΙΩΤΗΣ","Ο.Α.ΦΟΙΒΟΣ ΛΑΡΙΣΑΣ",120,0]
["14-31213","ΦΡΑΓΚΙΣΤΑΣ ΕΥΑΓΓΕΛΟΣ","Α.Ο.ΒΟΥΛΙΑΓΜΕΝΗΣ",117,0]
["14-28575","ΨΑΡΙΑΔΗΣ ΜΙΧΑΛΗΣ","Ο.Α.ΑΙΓΙΑΛΕΙΑΣ",113,0]
["14-29726","ΜΙΣΔΡΑΧΗΣ ΛΕΑΝΔΡΟΣ","Ο.Α.ΦΟΙΒΟΣ ΛΑΡΙΣΑΣ",111,0]
["14-90102","ΤΣΙΚΟΒ ΑΛΕΞΑΝΔΡΟΣ","ΖΑΚΥΝΘΙΝΟΣ Α.Ο.Α",111,0]
["14-29179","ΤΑΜΙΩΛΑΚΗΣ ΧΡΥΣΟΒΑΛΑΝΤΗΣ","ΗΡΑΚΛΕΙΟ Ο.Α.& Α.",109.5,0]
["14-29372","ΚΟΤΖΑΜΑΝΗΣ ΝΙΚΟΛΑΟΣ","ΠΕΥΚΗ Γ.ΚΑΛΟΒΕΛΩΝΗΣ",104,0]
["14-31303","ΚΟΥΤΡΟΥΜΠΗΣ ΝΙΚΟΛΑΟΣ","ΠΕΥΚΗ Γ.ΚΑΛΟΒΕΛΩΝΗΣ",104,0]
["14-31476","ΔΡΑΚΟΣ ΑΘΑΝΑΣΙΟΣ","Ο.Α.ΑΘΗΝΩΝ",101,0]
["14-30044","ΠΕΝΤΟΥΣΗΣ ΠΑΡΙΣ","Ο.Α.ΘΕΣΣΑΛΟΝΙΚΗΣ",100,0]
["14-32270","ΠΙΓΓΟΣ ΓΕΩΡΓΙΟΣ","Ο.Α.ΕΥΟΣΜΟΥ ΘΕΣΣΑΛΟΝΙΚΗΣ",95,0]
["14-31084","ΧΑΛΚΙΔΗΣ ΘΕΟΔΩΡΟΣ","Ο.Α.ΕΥΟΣΜΟΥ ΘΕΣΣΑΛΟΝΙΚΗΣ",95,0]
["14-28879","ΜΠΑΛΤΑΣ ΜΑΞΙΜΟΣ","Σ.Α.ΡΑΦΗΝΑΣ",94,0]
["14-27690","ΣΠΥΡΟΠΟΥΛΟΣ ΑΘΑΝΑΣΙΟΣ","Α.Ο.Α.ΦΙΛΟΘΕΗΣ",94,0]
["14-31989","ΜΠΑΜΠΑΡΟΥΤΣΗΣ ΓΕΩΡΓΙΟΣ","Α.Ο.ΑΤΛΑΝΤΙΣ",92.5,0]
["14-28153","ΤΣΙΒΟΥΡΑΚΗΣ ΑΝΤΩΝΙΟΣ","Ο.Α.ΧΑΝΙΩΝ",91,0]
["14-28866","ΣΤΕΡΓΙΟΥΛΑΣ ΧΡΗΣΤΟΣ-ΜΑΡΙΟΣ","Ο.Α.ΜΑΓΝΗΣΙΑΣ",90,0]
["14-30989","ΓΚΙΘΚΟΠΟΥΛΟΣ ΑΡΙΣΤΟΤΕΛΗΣ","Ο.Α.ΚΑΛΑΜΑΚΙΟΥ",87,0]
["14-30061","ΑΝΑΓΝΩΣΤΟΠΟΥΛΟΣ ΔΗΜΗΤΡΗΣ","Ο.Α.ΚΕΡΑΤΣΙΝΙΟΥ",86.5,0]
["14-30312","ΜΕΝΕΞΕΛΗΣ ΟΔΥΣΣΕΑΣ","Ο.Α.ΑΓΙΑΣ ΠΑΡΑΣΚΕΥΗΣ",78.5,0]
["14-29257","ΝΙΚΟΛΟΥΛΗΣ ΧΡΗΣΤΟΣ","Ο.Α.ΝΙΚΑΙΑ ΛΑΡΙΣΑΣ",77.5,0]
["14-32212","ΡΑΠΤΗΣ ΚΩΝΣΤΑΝΤΙΝΟΣ","Σ.Α.ΡΑΦΗΝΑΣ",76.5,0]
["14-29626","ΒΑΡΕΛΗΣ ΝΙΚΟΛΑΟΣ","Ο.Α.ΚΕΡΚΥΡΑΣ",76,0]
["14-28874","ΒΡΕΤΤΟΣ ΣΤΕΦΑΝΟΣ","Α.Ο.Α.ΦΙΛΟΘΕΗΣ",76,0]
["14-27871","ΠΟΥΛΑΚΗΣ ΜΙΛΤΙΑΔΗΣ","Ο.Α.ΚΑΒΑΛΑΣ ΑΛΕΞΑΝΔΡΟΣ",76,0]
["14-29855","ΤΕΡΤΙΓΚΑΣ ΔΗΜΗΤΡΙΟΣ","ΦΘΙΩΤΙΚΟΣ Ο.Α.",74.5,0]
["14-29399","ΑΡΒΑΝΙΤΗΣ ΑΛΕΞΑΝΔΡΟΣ","Α.Κ.Α.ΜΑΡΑΘΩΝΑ",74,0]
["14-29812","ΣΤΑΥΡΟΥ ΕΛΕΥΘΕΡΙΟΣ-ΕΜΜΑΝΟΥΗΛ","Ο.Α.ΘΕΣΠΡΩΤΙΑΣ ΤΙΤΑΝΗ",74,0]
["14-32605","ΚΥΠΡΙΩΤΗΣ ΕΥΑΓΓΕΛΟΣ","Ο.Α.ΑΘΗΝΩΝ",70.5,0]
["14-28970","ΜΟΡΦΟΝΙΟΣ ΓΕΩΡΓΙΟΣ","Α.Σ.ΠΕΡΑ",70.5,0]
["14-29650","ΜΠΑΛΑΦΑΣ ΠΑΥΛΟΣ-ΛΟΥΙΣ","Α.Σ.Α.ΛΑΡΙΣΑΣ",70.5,0]
["14-90115","ΛΟΥΚΑΣ ΑΛΕΞΑΝΔΡΟΣ-ΠΑΝΑΓΙΩΤΗΣ","Α.Ο.ΒΑΡΗΣ ΑΝΑΓΥΡΟΥΣ",70,0]
["14-28653","ΚΑΡΑΓΙΑΝΝΗΣ ΜΙΧΑΛΗΣ","ΝΑΥΠΛΙΑΚΟΣ Ο.Α.",69,0]
["14-26037","ΠΑΠΑΚΩΝΣΤΑΝΤΙΝΟΥ ΜΑΡΙΟΣ","Α.Ο.Α.ΦΙΛΟΘΕΗΣ",68,0]
["14-30060","ΡΟΥΜΠΗΣ ΑΛΕΞΑΝΔΡΟΣ","Ο.Α.ΧΑΛΚΙΔΑΣ",66.5,0]
["14-31714","ΜΙΧΑΗΛΙΔΗΣ ΕΥΣΤΡΑΤΙΟΣ","Α.Ο.Α.ΣΤΑΥΡΟΥΠΟΛΗΣ ΙΦΙΤΟΣ",64.5,0]
["14-32035","ΠΟΥΤΗΣ ΣΤΥΛΙΑΝΟΣ","Ο.Α.ΕΔΕΣΣΑΣ",64,0]
["14-90112","ΝΤΙΝΤΟ ΑΛΕΞΑΝΔΡΟΣ","Ο.Α.ΓΛΥΦΑΔΑΣ",62.5,0]
["14-31272","ΣΤΑΝΕΛΛΟΣ ΜΙΧΑΗΛ","Α.Ο.ΒΑΡΗΣ ΑΝΑΓΥΡΟΥΣ",62.5,0]
["14-28129","ΠΑΥΛΙΔΗΣ ΘΕΟΔΟΣΙΟΣ","Ο.Α.ΘΕΣΣΑΛΟΝΙΚΗΣ",62,0]
["14-30059","ΡΟΥΣΜΕΝΗΣ ΑΝΑΣΤΑΣΙΟΣ","Ο.Α.ΜΑΓΝΗΣΙΑΣ",60,0]
["14-29500","ΤΡΙΑΝΤΑΦΥΛΛΟΥ ΝΤΑΝΙΕΛ","Ο.Α.ΑΝΑΦΛΥΣΤΟΣ ΣΑΡΩΝΙΔΑΣ",60,0]
["14-28971","ΕΥΤΥΧΙΟΥ ΧΑΡΑΛΑΜΠΟΣ","Ο.Α.ΑΘΗΝΩΝ",59.5,0]
["14-26458","ΤΖΑΝΑΚΗΣ ΚΥΡΙΑΚΟΣ","Ο.Α.ΧΑΝΙΩΝ",59.5,0]
["14-28251","ΛΑΖΟΠΟΥΛΟΣ ΛΑΜΠΡΟΣ","Α.Ο.Α.ΦΙΛΟΘΕΗΣ",59,0]
["14-31553","ΜΠΑΤΣΙΚΑΣ ΜΙΧΑΗΛ","Ο.Α.ΜΑΓΝΗΣΙΑΣ",59,0]
["14-29813","ΤΖΑΝΗΣ ΑΡΙΣΤΕΙΔΗΣ","Ο.Α.ΘΕΣΠΡΩΤΙΑΣ ΤΙΤΑΝΗ",59,0]
["14-31878","ΣΤΑΜΟΥΛΟΣ ΦΩΤΙΟΣ","Α.Ο.Α.ΗΛΙΟΥΠΟΛΗΣ",56.5,0]
["14-29944","ΚΑΛΛΙΣΤΡΟΣ ΑΛΕΞΙΟΣ","Ο.Α.ΑΙΓΙΑΛΕΙΑΣ",56,0]
["14-31876","ΚΩΣΤΑΡΙΔΗΣ ΙΑΣΟΝΑΣ-ΚΩΝΣΤΑΝΤΙΝΟΣ","Α.Ο.Α.ΗΛΙΟΥΠΟΛΗΣ",55.5,0]
["14-30911","ΤΣΑΚΑΛΑΚΗΣ ΝΙΚΟΛΑΟΣ","ΗΡΑΚΛΕΙΟ Ο.Α.& Α.",55.5,0]
["14-28643","ΔΡΑΚΟΣ ΑΝΔΡΕΑΣ","Μ.Α.Σ.ΑΕΤΟΣ ΘΕΣΣΑΛΟΝΙΚΗΣ",55,0]
["14-31990","ΜΠΑΜΠΑΡΟΥΤΣΗΣ ΦΩΤΙΟΣ","Α.Ο.ΑΤΛΑΝΤΙΣ",54.5,0]
["14-30111","ΚΑΡΑΘΑΝΑΣΗΣ ΒΑΣΙΛΕΙΟΣ","Α.Γ.Ο.ΦΙΛΙΠΠΙΑΔΑΣ",54,0]
["14-30766","ΤΕΡΛΕΜΕΣ ΚΩΝΣΤΑΝΤΙΝΟΣ","ΠΑΝΘΡΑΚΙΚΟΣ Ο.Α.ΚΟΜΟΤΗΝΗΣ",54,0]
["14-27444","ΧΡΙΣΤΑΝΑΣ ΔΗΜΗΤΡΗΣ","Α.Ο.Α.ΑΙΓΑΛΕΩ 92",53.5,0]
["14-30193","ΠΑΠΑΔΗΜΗΤΡΙΟΥ ΓΙΑΝΝΗΣ","Ο.Α.ΚΑΛΑΜΑΚΙΟΥ",52.5,0]
["14-31708","ΜΠΙΝΟΠΟΥΛΟΣ ΙΩΑΝΝΗΣ","Ν.Ο.ΘΕΣΣΑΛΟΝΙΚΗΣ",52,0]
["14-29815","ΠΑΠΙΓΓΙΩΤΗΣ ΔΗΜΗΤΡΙΟΣ","Ο.Α.ΘΕΣΠΡΩΤΙΑΣ ΤΙΤΑΝΗ",52,0]
["14-30999","ΠΑΦΗΣ ΚΩΝΣΤΑΝΤΙΝΟΣ","ΠΑΝΘΡΑΚΙΚΟΣ Ο.Α.ΚΟΜΟΤΗΝΗΣ",52,0]
["14-28473","ΧΑΤΖΗΑΠΟΣΤΟΛΟΥ ΑΧΙΛΛΕΑΣ","Α.Σ.ΚΟΛΛΕΓΙΟΥ ΝΤΕΡΗ",52,0]
["14-29760","ΞΥΛΑΣ ΙΩΑΝΝΗΣ","ΠΕΥΚΗ Γ.ΚΑΛΟΒΕΛΩΝΗΣ",50.5,0]
["14-28957","ΚΥΡΙΑΚΟΠΟΥΛΟΣ ΠΕΡΙΚΛΗΣ","Ο.Α.ΙΩΛΚΟΣ ΒΟΛΟΥ",50,0]
["14-32472","ΜΑΝΟΥΣΑΚΗΣ ΔΗΜΗΤΡΙΟΣ-ΠΑΝΑΓΙΩΤΗΣ","Γ.Ο.ΠΕΡΙΣΤΕΡΙΟΥ Γ.ΠΑΛΑΣΚΑΣ",50,0]
["14-31167","ΠΑΡΙΣΣΗΣ ΑΝΑΣΤΑΣΙΟΣ","ΡΟΔΙΑΚΗ ΑΚΑΔ.ΑΝΤΙΣΦ.",50,0]
["14-28603","ΒΟΥΤΣΙΝΟΣ ΣΤΕΦΑΝΟΣ","Ο.Α.ΓΟΥΔΙΟΥ",49.5,0]
["14-25250","ΓΡΗΓΟΡΙΟΥ ΑΝΑΣΤΑΣΙΟΣ","Α.Ε.Κ.ΤΡΙΠΟΛΗΣ",48.5,0]
["14-31408","ΑΝΑΣΤΑΣΙΑΔΗΣ ΦΩΤΙΟΣ","ΡΟΔΙΑΚΟΣ Ο.Α.",48,0]
["14-29660","ΓΚΕΡΕΚΟΣ ΣΠΥΡΙΔΩΝ","Ο.Α.ΚΕΡΚΥΡΑΣ",48,0]
["14-32303","ΚΑΡΑΓΕΩΡΓΑΣ ΑΣΗΜΑΚΗΣ","Α.Ο.Α.ΗΛΙΟΥΠΟΛΗΣ",48,0]
["14-29895","ΣΙΤΑΡΙΔΗΣ ΚΥΡΙΑΚΟΣ","Α.Ο.Α.ΠΑΤΡΩΝ",48,0]
["14-34511","ΚΑΡΑΧΑΛΙΟΣ ΑΓΓΕΛΟΣ","Ο.Α.ΧΑΝΙΩΝ",47,0]
["14-29965","ΒΑΣΙΛΑΚΗΣ ΕΥΣΤΑΘΙΟΣ-ΗΛΙΑΣ","Α.Ο.Α.ΠΑΤΡΩΝ",45,0]
["14-33917","ΚΑΒΑΛΛΙΕΡΟΣ ΚΩΝΣΤΑΝΤΙΝΟΣ","Ο.Α.ΑΘΛΗΤ.ΠΑΙΔΕΙΑ",45,0]
["14-30535","ΚΟΝΤΑΡΑΚΗΣ ΑΝΔΡΕΑΣ","Ο.Α.ΧΑΝΙΩΝ",45,0]
["14-32220","ΣΦΙΚΤΗΣ ΠΑΝΑΓΙΩΤΗΣ","Ο.Α.ΠΕΤΡΟΥΠΟΛΗΣ",45,0]
["14-32140","ΣΑΡΑΝΤΙΝΟΣ ΣΤΡΑΤΗΣ-ΓΡΗΓΟΡΗΣ","Ο.Α.ΛΕΣΒΟΥ",44.5,0]
["14-32761","ΜΙΝΤΑΣ ΝΙΚΟΛΑΟΣ","ΠΕΥΚΗ Γ.ΚΑΛΟΒΕΛΩΝΗΣ",44,0]
["14-28959","ΜΠΕΛΤΖΕΝΙΤΗΣ ΙΩΑΝΝΗΣ","Ο.Α.ΠΕΤΡΟΥΠΟΛΗΣ",44,0]
["14-31285","ΚΩΣΤΟΥΡΟΣ ΔΗΜΗΤΡΙΟΣ","ΠΕΥΚΗ Γ.ΚΑΛΟΒΕΛΩΝΗΣ",43.5,0]
["14-30524","ΜΑΤΣΑΜΑΚΗΣ ΑΝΤΩΝΙΟΣ","Ο.Α.ΧΑΝΙΩΝ",43.5,0]
["14-29603","ΑΡΑΝΙΤΗΣ ΚΩΝΣΤΑΝΤΙΝΟΣ","Α.Ο.Α.ΠΑΠΑΓΟΥ",43,0]
["14-28424","ΓΑΤΟΥΔΗΣ-ΜΑΛΙΝΔΡΕΤΟΣ ΝΙΚΟΛΑΟΣ","Ο.Α.ΧΑΝΙΩΝ",43,0]
["14-28828","ΤΣΙΛΙΜΠΗΣ ΧΡΗΣΤΟΣ","ΡΗΓΑΣ Α.Ο.Α.ΑΡΓΟΛΙΔΑΣ",43,0]
["14-26780","ΖΑΓΟΡΑΙΟΣ ΚΩΝΣΤΑΝΤΙΝΟΣ","Α.Κ.Α.ΜΑΡΑΘΩΝΑ",41.5,0]
["14-29963","ΠΑΠΑΠΑΝΑΓΙΩΤΟΥ ΔΗΜΗΤΡΗΣ-ΑΛΕΞΑΝΔΡΟΣ","Α.Ο.Α.ΠΑΤΡΩΝ",41,0]
["14-32623","ΖΑΧΙΩΤΗΣ ΦΙΛΙΠΠΟΣ","Γ.Ο.ΠΕΡΙΣΤΕΡΙΟΥ Γ.ΠΑΛΑΣΚΑΣ",40,0]
["14-28474","ΧΡΟΝΟΠΟΥΛΟΣ ΔΗΜΗΤΡΙΟΣ","Α.Ο.Α.ΠΑΠΑΓΟΥ",39.5,0]
["14-28154","ΒΑΡΒΕΡΑΚΗΣ ΓΕΩΡΓΙΟΣ","Ο.Α.ΧΑΝΙΩΝ",39,0]
["14-31791","ΚΑΡΑΜΑΝΗΣ ΟΡΕΣΤΗΣ","Α.Ο.Α.ΧΑΪΔΑΡΙΟΥ",39,0]
["14-32524","ΧΑΡΑΛΑΜΠΙΔΗΣ ΚΩΝΣΤΑΝΤΙΝΟΣ","Α.Ο.Α.ΑΙΓΑΛΕΩ 92",38.5,0]
["14-30041","ΞΑΡΧΑΣ ΑΘΑΝΑΣΙΟΣ","Α.Ο.Α.ΗΛΙΟΥΠΟΛΗΣ",37,0]
["14-30946","ΚΟΥΡΤΙΔΗΣ ΙΣΑΑΚ","Α.Ο.Α.ΠΡΩΤΑΘΛ.ΚΑΒΑΛΑΣ",35.5,0]
["14-31088","ΣΠΗΛΙΩΤΟΠΟΥΛΟΣ ΚΩΝΣΤΑΝΤΙΝΟΣ","Ο.Α.ΠΕΤΡΟΥΠΟΛΗΣ",35.5,0]
["14-29276","ΠΑΠΟΥΛΙΑΣ ΣΩΚΡΑΤΗΣ","Σ.Α.ΣΕΡΡΩΝ",34.5,0]
["14-28367","ΣΕΡΕΜΕΤΑΣ ΚΩΝΣΤΑΝΤΙΝΟΣ","Ο.Α.ΒΙΚΕΛΑΣ ΒΕΡΟΙΑΣ",34,0]
["14-29964","ΚΑΡΑΓΙΑΝΝΗΣ ΠΑΝΤΕΛΗΣ","Α.Ε.Τ.ΝΙΚΗ ΠΑΤΡΩΝ",32.5,0]
["14-29814","ΤΣΑΝΤΕΚΙΔΗΣ ΑΧΙΛΛΕΑΣ","Ο.Α.ΘΕΣΠΡΩΤΙΑΣ ΤΙΤΑΝΗ",32,0]
["14-32097","ΤΣΑΡΠΑΛΗΣ ΗΛΙΑΣ","Ο.Α.ΑΙΓΙΑΛΕΙΑΣ",32,0]
["14-30287","ΝΤΟΥΛΗΣ ΜΙΧΑΗΛ","Ο.Α.ΣΑΛΑΜΙΝΑΣ",31.5,0]
["14-31658","ΔΗΜΗΤΡΙΟΥ ΛΕΩΝ","Ο.Α.ΑΓΙΑΣ ΠΑΡΑΣΚΕΥΗΣ",30.5,0]
["14-32620","ΓΚΕΛΗΣ ΚΩΝΣΤΑΝΤΙΝΟΣ","Ο.Α.ΜΑΓΝΗΣΙΑΣ",30,0]
["14-30531","ΚΩΝΣΤΑΝΤΑΡΑΚΗΣ ΑΝΔΡΕΑΣ","Ο.Α.ΧΑΝΙΩΝ",30,0]
["14-31953","ΣΙΜΑΤΟΣ ΓΕΩΡΓΙΟΣ","ΗΡΑΚΛΕΙΟ Ο.Α.& Α.",29,0]
["14-30089","ΦΟΥΝΤΗΣ ΚΩΝΣΤΑΝΤΙΝΟΣ","Α.Ο.Α.ΧΑΪΔΑΡΙΟΥ",29,0]
["14-30940","ΧΙΛΗΣ ΓΕΩΡΓΙΟΣ","Α.Ο.Α.ΣΤΑΥΡΟΥΠΟΛΗΣ ΙΦΙΤΟΣ",29,0]
["14-29658","ΚΩΝΣΤΑΝΤΑΡΑΚΗΣ ΑΝΤΩΝΙΟΣ","Ο.Α.ΧΑΝΙΩΝ",28.5,0]
["14-28486","ΜΠΑΡΜΠΑΡΗΣ ΣΤΥΛΙΑΝΟΣ","Ο.Α.ΠΑΡΟΥ",28.5,0]
["14-31279","ΧΑΡΑΛΑΜΠΙΔΗΣ ΓΕΩΡΓΙΟΣ","Ο.Α.ΠΟΛΥΚΑΣΤΡΟΥ",28.5,0]
["14-29001","ΜΕΛΙΣΣΙΝΟΣ ΔΗΜΗΤΡΙΟΣ","Φ.Ο.Α.ΝΕΑΠΟΛΗΣ",28,0]
["14-33790","ΚΟΥΣΑΡΙΔΗΣ ΔΗΜΗΤΡΙΟΣ","Σ.Α.ΘΕΣΣΑΛΟΝΙΚΗΣ",27,0]
["14-33933","ΝΑΣΣΗΣ-ΝΤΑΝΙΑΣ ΙΩΑΝΝΗΣ","Ο.Α.ΒΡΙΛΗΣΣΙΩΝ",27,0]
["14-33546","ΜΠΙΝΟΠΟΥΛΟΣ ΔΗΜΗΤΡΗΣ","Ν.Ο.ΘΕΣΣΑΛΟΝΙΚΗΣ",26.5,0]
["14-29256","ΠΑΠΑΓΕΩΡΓΙΟΥ ΣΤΕΦΑΝΟΣ-ΑΧΙΛΛΕΑΣ","Ο.Α.ΝΙΚΑΙΑ ΛΑΡΙΣΑΣ",26.5,0]
["14-30546","ΤΣΑΓΛΙΩΤΗΣ ΑΝΤΩΝΗΣ","Ο.Α.ΡΕΘΥΜΝΟΥ",26.5,0]
["14-31882","ΠΑΠΑΚΩΣΤΟΠΟΥΛΟΣ ΣΤΥΛΙΑΝΟΣ","Α.Ο.ΑΡΓΥΡΟΥΠΟΛΗΣ",26,0]
["14-30443","ΤΣΙΑΛΟΣ ΛΕΩΝΙΔΑΣ","Ο.Α.ΡΕΘΥΜΝΟΥ",26,0]
["14-90105","ΑΛΕΞΑΚΗΣ ΠΕΤΡΟΣ","Ο.Α.ΧΑΝΙΩΝ",25.5,0]
["14-32125","ΔΙΑΜΑΝΤΟΠΟΥΛΟΣ ΛΕΩΝΙΔΑΣ","Ο.Α.ΑΙΓΙΑΛΕΙΑΣ",25.5,0]
["14-30389","ΜΗΤΣΟΠΟΥΛΟΣ ΠΕΡΙΚΛΗΣ","Ο.Α.ΩΡΑΙΟΚΑΣΤΡΟΥ Ο ΑΝΤΑΙΟΣ",25.5,0]
["14-30365","ΕΛΕΥΘΕΡΙΑΔΗΣ ΑΝΕΣΤΗΣ","Α.Σ.Α.ΠΑΝΟΡΑΜΑΤΟΣ",25,0]
["14-29952","ΚΑΝΕΛΛΟΠΟΥΛΟΣ ΠΕΤΡΟΣ","Α.Ε.Κ.ΤΡΙΠΟΛΗΣ",25,0]
["14-32051","ΚΥΡΛΑΣ ΣΤΑΥΡΟΣ","Γ.Ε.ΠΡΕΒΕΖΑΣ",25,0]
["14-28873","ΒΡΕΤΤΟΣ ΓΙΩΡΓΟΣ","Α.Ο.Α.ΦΙΛΟΘΕΗΣ",24.5,0]
["14-32769","ΚΑΠΡΙΝΙΩΤΗΣ ΧΡΙΣΤΟΣ","Ο.Α.ΘΕΣΠΡΩΤΙΑΣ ΤΙΤΑΝΗ",24,0]
["14-29945","ΠΑΠΑΧΑΤΖΗΣ ΟΡΕΣΤΗΣ-ΑΝΤΩΝΙΟΣ","Ο.Α.ΑΙΓΙΑΛΕΙΑΣ",23.5,0]
["14-30739","ΑΡΒΑΝΙΤΗΣ ΓΕΩΡΓΙΟΣ","Ο.Α.ΑΙΓΙΑΛΕΙΑΣ",23,0]
["14-28329","ΠΛΙΟΓΚΑΣ ΗΛΙΑΣ","Ο.Α.ΝΕΣΤΩΡΑΣ ΓΙΑΝΝΙΤΣΩΝ",23,0]
["14-32654","ΔΡΑΚΟΠΟΥΛΟΣ ΠΕΤΡΟΣ-ΑΠΟΣΤΟΛΟΣ","Α.Ο.Α.ΗΛΙΟΥΠΟΛΗΣ",22.5,0]
["14-31584","ΙΑΚΩΒΙΔΗΣ ΜΗΝΑΣ","Ο.Α.ΑΘΗΝΩΝ",22.5,0]
["14-30123","ΚΑΜΑΡΑΣ ΡΑΦΑΗΛ-ΚΩΝΣΤΑΝΤΙΝΟΣ","Α.Ο.Α.ΠΑΠΑΓΟΥ",22.5,0]
["14-28777","ΜΑΡΙΝΟΠΟΥΛΟΣ ΣΠΥΡΟΣ","Ο.Α.ΑΘΗΝΩΝ",22.5,0]
["14-32226","ΚΟΣΜΙΔΗΣ ΓΕΩΡΓΙΟΣ","Ε.Σ.Ο.ΕΠΙΚΟΥΡΟΣ ΠΟΛΙΧΝΗΣ",22,0]
["14-28662","ΠΑΛΗΚΙΔΗΣ ΑΛΕΞΑΝΔΡΟΣ","Α.Ο.ΚΑΒΑΛΑΣ ΜΑΚΕΔΟΝΙΚΟΣ",22,0]
["14-30135","ΠΑΝΤΑΖΙΔΗΣ ΧΡΗΣΤΟΣ","Ο.Α.ΚΑΛΑΜΑΤΑΣ",21.5,0]
["14-29763","ΠΑΠΥΡΑΚΗΣ ΚΩΣΤΑΣ","ΗΡΑΚΛΕΙΟ Ο.Α.& Α.",21.5,0]
["14-29254","ΡΟΥΣΣΟΣ ΜΩΥΣ","Ο.Α.ΝΙΚΑΙΑ ΛΑΡΙΣΑΣ",21.5,0]
["14-33499","ΓΕΩΡΓΟΠΟΥΛΟΣ ΦΙΛΙΠΠΟΣ","Α.Ο.Α.ΑΤΤΙΚΟΣ ΗΛΙΟΣ",21,0]
["14-30710","ΚΑΖΙΑΛΕΣ ΕΥΑΓΓΕΛΟΣ","Ο.Α.ΡΕΘΥΜΝΟΥ",21,0]
["14-28794","ΚΙΟΥΡΤΗΣ ΔΗΜΗΤΡΙΟΣ","Ο.Α.ΚΑΒΑΛΑΣ ΑΛΕΞΑΝΔΡΟΣ",21,0]
["14-31207","ΣΦΕΝΔΟΥΡΑΚΗΣ ΜΑΡΙΟΣ","Ο.Α.ΣΗΤΕΙΑΣ",21,0]
["14-29828","ΚΑΖΑΝΤΖΗΣ ΓΕΡΑΣΙΜΟΣ","Ο.Α.ΑΘΗΝΩΝ",20.5,0]
["14-32211","ΚΟΝΤΟΓΙΩΡΓΑΚΗΣ ΕΜΜΑΝΟΥΗΛ","Ο.Α.ΣΗΤΕΙΑΣ",20.5,0]
["14-31363","ΠΑΠΑΔΟΠΟΥΛΟΣ ΔΗΜΗΤΡΙΟΣ","ΠΑΝΘΡΑΚΙΚΟΣ Ο.Α.ΚΟΜΟΤΗΝΗΣ",20.5,0]
["14-29042","ΚΑΛΟΓΕΡΟΠΟΥΛΟΣ ΘΕΟΔΩΡΟΣ","Σ.Α.ΡΑΦΗΝΑΣ",19.5,0]
["14-30272","ΤΖΕΛΗΣ ΑΝΔΡΕΑ-ΜΑΡΙΟΣ","ΑΚΑΔ.ΑΝΤΙΣΦ.ΙΩΑΝΝΙΝΩΝ",19.5,0]
["14-28604","ΤΣΑΓΚΑΝΟΣ ΓΕΩΡΓΙΟΣ","Ο.Α.ΧΟΛΑΡΓΟΥ",19.5,0]
["14-30790","ΔΗΜΗΤΡΙΑΔΗΣ ΓΙΩΡΓΟΣ","Ο.Α.ΒΡΙΛΗΣΣΙΩΝ",19,0]
["14-31389","ΔΙΓΕΝΑΚΗΣ ΑΛΕΞΑΝΔΡΟΣ","Ο.Α.ΧΑΝΙΩΝ",19,0]
["14-32773","ΚΩΛΕΤΣΗΣ ΛΑΜΠΡΟΣ","ΑΚΑΔ.ΑΝΤΙΣΦ.ΙΩΑΝΝΙΝΩΝ",19,0]
["14-32316","ΒΕΡΡΟΣ ΚΩΝΣΤΑΝΤΙΝΟΣ","Μ.Γ.Σ.ΑΠΟΛΛΩΝ ΚΑΛΑΜΑΡΙΑΣ",18.5,0]
["14-33040","ΜΟΤΣΙΑΣ ΚΩΝΣΤΑΝΤΙΝΟΣ","Ν.Ο.Ν.Α.Μ",18,0]
["14-32468","ΣΑΚΕΛΛΑΡΙΔΗΣ ΓΕΩΡΓΙΟΣ","Α.Ο.Α.ΗΛΙΟΥΠΟΛΗΣ",18,0]
["14-32100","ΣΠΗΛΙΩΤΟΠΟΥΛΟΣ ΠΑΝΑΓΙΩΤΗΣ","Ο.Α.ΑΙΓΙΑΛΕΙΑΣ",18,0]
["14-32045","ΧΟΥΜΗΣ ΔΗΜΗΤΡΗΣ","Α.Ο.Α.ΦΙΛΟΘΕΗΣ",18,0]
["14-34822","ΟΥΣΤΑΜΠΑΣΙΔΗΣ ΝΙΚΟΣ","Α.Ο.Α.ΚΑΤΕΡΙΝΗΣ",17.5,0]
["14-29859","ΡΩΪΜΠΑΣ ΑΛΕΞΑΝΔΡΟΣ","ΦΘΙΩΤΙΚΟΣ Ο.Α.",17.5,0]
["14-30080","ΤΣΙΩΤΑΣ ΣΩΤΗΡΙΟΣ-ΑΛΕΞΑΝΔΡΟΣ","Γ.Ε.ΠΡΕΒΕΖΑΣ",17,0]
["14-31595","ΑΝΕΣΙΔΗΣ ΔΗΜΗΤΡΙΟΣ","Α.Ο.Α.ΠΑΤΡΩΝ",16.5,0]
["14-30778","ΖΕΡΒΟΥΔΑΚΗΣ ΒΙΚΤΩΡΑΣ","Ο.Α.ΣΟΥΔΑΣ",16.5,0]
["14-31549","ΛΙΑΤΣΟΣ ΠΑΝΑΓΙΩΤΗΣ","Ο.Α.ΘΕΣΠΡΩΤΙΑΣ ΤΙΤΑΝΗ",16.5,0]
["14-31426","ΠΑΠΑΝΙΚΟΣ ΑΛΚΙΒΙΑΔΗΣ","Σ.Α.ΣΕΡΡΩΝ",16.5,0]
["14-33531","ΣΤΕΦΑΝΙΔΗΣ ΒΑΣΙΛΕΙΟΣ","Ο.Α.ΕΔΕΣΣΑΣ",16.5,0]
["14-30056","ΧΑΤΖΗΓΙΑΝΝΗΣ ΣΤΑΥΡΟΣ","Α.Ο.ΑΡΓΥΡΟΥΠΟΛΗΣ",16.5,0]
["14-31775","ΔΙΑΜΑΝΤΙΔΗΣ ΔΙΑΜΑΝΤΗΣ","Α.Ο.Α.ΑΤΤΙΚΟΣ ΗΛΙΟΣ",16,0]
["14-29300","ΚΟΥΡΗΣ ΠΑΝΑΓΙΩΤΗΣ","Ο.Α.ΓΛΥΦΑΔΑΣ",16,0]
["14-30486","ΜΩΡΑΪΤΙΝΗΣ ΦΟΙΒΟΣ","Α.Ο.Α.ΑΤΤΙΚΟΣ ΗΛΙΟΣ",16,0]
["14-30792","ΠΗΛΙΧΟΣ ΑΝΑΣΤΑΣΙΟΣ","ΖΑΚΥΝΘΙΝΟΣ Α.Ο.Α",16,0]
["14-31811","ΠΙΣΣΑΣ ΝΙΚΟΛΑΟΣ","ΗΡΑΚΛΕΙΟ Ο.Α.& Α.",15.5,0]
["14-33325","ΤΣΑΤΣΟΥΛΗΣ ΑΘΑΝΑΣΙΟΣ","Ο.Α.ΞΑΝΘΗΣ",15.5,0]
["14-30988","ΥΦΑΝΤΗΣ ΧΑΡΑΛΑΜΠΟΣ","Α.Ο.Α.ΠΑΠΑΓΟΥ",15.5,0]
["14-32165","ΓΙΑΤΣΟΣ ΠΟΛΥΜΕΡΟΣ-ΠΑΝΑΓΙΩΤΗΣ","Ο.Α.ΑΙΓΙΑΛΕΙΑΣ",15,0]
["14-31813","ΖΑΧΑΡΑΚΗΣ ΜΙΧΑΗΛ","ΗΡΑΚΛΕΙΟ Ο.Α.& Α.",15,0]
["14-29896","ΜΙΧΑΛΟΠΟΥΛΟΣ ΝΙΚΟΛΑΟΣ","Α.Ο.Α.ΠΑΤΡΩΝ",15,0]
["14-34041","ΖΕΡΒΟΣ ΑΛΕΞΑΝΔΡΟΣ","Ο.Α.ΚΕΡΚΥΡΑΣ",14.5,0]
["14-32877","ΚΟΥΣΤΕΝΗΣ ΚΩΝΣΤΑΝΤΙΝΟΣ","Α.Ε.Κ.ΤΡΙΠΟΛΗΣ",14.5,0]
["14-32898","ΜΠΕΣΜΠΑΛΤΑ ΑΛΕΞΑΝΔΡΟΣ","Α.Ο.ΚΑΛΛΙΤΕΧΝΟΥΠΟΛΗΣ",14.5,0]
["14-30526","ΧΑΤΖΗΝΙΚΟΛΑΟΥ ΔΙΟΝΥΣΙΟΣ-ΤΣΑΜΠΙΚΟΣ","Ο.Α.ΧΑΝΙΩΝ",14.5,0]
["14-32389","ΒΕΡΓΟΣ ΒΑΣΙΛΕΙΟΣ","Α.Γ.Ο.ΦΙΛΙΠΠΙΑΔΑΣ",14,0]
["14-29933","ΚΟΥΦΟΠΟΥΛΟΣ ΕΜΜΑΝΟΥΗΛ","Α.Κ.Α.ΜΑΡΑΘΩΝΑ",14,0]
["14-29811","ΜΠΙΣΑΡΑ-ΜΑΪΛΙΑΝΗΣ ΑΝΤΑΜ","Ο.Α.ΝΕΣΤΩΡΑΣ ΓΙΑΝΝΙΤΣΩΝ",14,0]
["14-33339","ΠΑΣΧΑΛΙΔΗΣ ΜΑΡΙΟΣ","Α.Ο.Α.ΝΕΑΣ ΠΕΡΑΜΟΥ ΟΙ ΤΙΤΑΝΕΣ",14,0]
["14-31331","ΤΖΙΦΑΣ-ΚΡΑΤΗΡΑΣ ΖΗΣΗΣ","Ο.Α.ΜΑΓΝΗΣΙΑΣ",14,0]
["14-32341","ΧΑΛΒΑΤΖΗΣ ΕΥΑΓΓΕΛΟΣ","Ε.Σ.Ο.ΕΠΙΚΟΥΡΟΣ ΠΟΛΙΧΝΗΣ",14,0]
["14-33602","ΑΪΒΑΛΙΩΤΗΣ ΡΟΣ-ΑΝΤΩΝΙΟΣ","Ν.Ο.ΘΕΣΣΑΛΟΝΙΚΗΣ",13.5,0]
["14-30537","ΒΟΛΤΥΡΑΚΗΣ ΒΑΣΙΛΗΣ","Ο.Α.ΧΑΝΙΩΝ",13.5,0]
["14-31428","ΚΩΣΤΙΔΗΣ ΗΛΙΑΣ","ΣΕΡΡΑΪΚΟΣ Ο.Α.",13.5,0]
["14-31778","ΝΤΙΒΑΝΙΔΗΣ ΑΝΑΣΤΑΣΙΟΣ","Γ.Α.Σ.ΚΑΡΑΤΕ ΕΡΜΗΣ",13.5,0]
["14-29686","ΠΑΝΤΕΛΙΟΣ ΝΙΚΟΛΑΟΣ","Ο.Α.ΚΕΡΚΥΡΑΣ",13.5,0]
["14-29673","ΑΛΕΞΙΟΥ ΓΕΩΡΓΙΟΣ","Α.Γ.Ο.ΦΙΛΙΠΠΙΑΔΑΣ",13,0]
["14-33289","ΒΛΑΧΟΣ ΚΩΝΣΤΑΝΤΙΝΟΣ","Σ.Α.ΣΕΡΡΩΝ",13,0]
["14-31810","ΔΕΛΑΚΗΣ ΔΗΜΗΤΡΗΣ","ΗΡΑΚΛΕΙΟ Ο.Α.& Α.",12.5,0]
["14-32952","ΚΩΝΣΤΑΝΤΙΝΙΔΗΣ ΗΛΙΑΣ","ΖΑΚΥΝΘΙΝΟΣ Α.Ο.",12.5,0]
["14-32393","ΑΛΕΞΙΟΥ ΦΙΛΙΠΠΟΣ","Α.Γ.Ο.ΦΙΛΙΠΠΙΑΔΑΣ",12,0]
["14-29587","ΜΠΙΛΗΣ ΣΤΑΥΡΟΣ","Α.Ο.ΒΑΡΗΣ ΑΝΑΓΥΡΟΥΣ",12,0]
["14-30776","ΖΕΡΒΟΣ ΓΕΩΡΓΙΟΣ","Ο.Α.ΧΑΝΙΩΝ",11.5,0]
["14-28224","ΚΑΠΝΙΑΣ ΕΥΑΓΓΕΛΟΣ","Ο.Α.ΚΕΡΑΤΣΙΝΙΟΥ",11.5,0]
["14-33963","ΚΟΥΤΣΟΥΠΙΑΣ ΙΩΑΝΝΗΣ","Ο.Α.ΛΙΤΟΧΩΡΟΥ",11.5,0]
["14-31743","ΚΑΝΤΖΑΒΕΛΟΣ ΜΙΧΑΗΛ","Α.Ε.Κ.ΤΡΙΠΟΛΗΣ",11,0]
["14-32709","ΚΑΡΑΓΙΑΝΝΗΣ ΑΘΑΝΑΣΙΟΣ","Ο.Α.ΧΕΡΣΟΝΗΣΟΥ",11,0]
["14-31816","ΓΚΑΓΚΑΟΥΔΑΚΗΣ ΣΤΥΛΙΑΝΟΣ","ΗΡΑΚΛΕΙΟ Ο.Α.& Α.",10.5,0]
["14-30851","ΙΒΑΝΟΥΔΗΣ ΔΗΜΗΤΡΙΟΣ","Ο.Α.ΚΟΥΦΑΛΙΩΝ ΘΕΣΣΑΛΟΝΙΚΗΣ",10.5,0]
["14-33134","ΠΑΠΠΑΣ ΓΕΩΡΓΙΟΣ","Α.Σ.Α.ΠΑΜΒΩΤΙΣ ΙΩΑΝΝΙΝΩΝ",10.5,0]
["14-28252","ΒΡΑΝΑΣ ΙΩΑΝΝΗΣ","Α.Ο.Α.ΦΙΛΟΘΕΗΣ",10,0]
["14-31991","ΜΗΤΡΟΠΑΠΑΣ ΗΛΙΑΣ","Ο.Α.ΑΘΛΗΤ.ΠΑΙΔΕΙΑ",10,0]
["14-33904","ΜΟΥΤΖΟΓΛΟΥ` ΝΙΚΟΣ","Α.Α.ΑΙΓΑΛΕΩ",10,0]
["14-33622","ΜΠΟΥΡΑΣ ΙΩΑΝΝΗΣ","ΗΡΑΚΛΕΙΟ Ο.Α.& Α.",10,0]
["14-30977","ΝΟΥΧΑΚΗΣ ΓΕΩΡΓΙΟΣ","Ο.Α.ΣΟΥΔΑΣ",10,0]
["14-31938","ΣΙΔΗΡΟΠΟΥΛΟΣ ΡΑΦΑΗΛ","ΗΡΑΚΛΕΙΟ Ο.Α.& Α.",10,0]
["14-35032","ΒΛΑΧΟΣ ΝΕΚΤΑΡΙΟΣ","Γ.Ε.ΠΡΕΒΕΖΑΣ",9.5,0]
["14-32589","ΔΟΞΙΑΔΗΣ ΓΕΩΡΓΙΟΣ","ΠΕΥΚΗ Γ.ΚΑΛΟΒΕΛΩΝΗΣ",9.5,0]
["14-34256","ΘΗΛΥΖΑΣ ΓΙΩΡΓΟΣ","Ο.Α.ΑΘΗΝΩΝ",9.5,0]
["14-34382","ΜΑΚΡΥΔΗΜΑΣ ΒΑΣΙΛΕΙΟΣ","ΑΚΑΔ.ΑΝΤΙΣΦ.ΙΩΑΝΝΙΝΩΝ",9.5,0]
["14-31454","ΜΠΟΓΡΗΣ ΕΥΑΓΓΕΛΟΣ","ΗΡΑΚΛΕΙΟ Ο.Α.& Α.",9.5,0]
["14-30376","ΣΒΗΓΚΑΣ ΚΩΝΣΤΑΝΤΙΝΟΣ","Α.Ο.Α.ΗΛΙΟΥΠΟΛΗΣ",9.5,0]
["14-30890","ΑΦΟΡΔΑΚΟΣ ΒΑΓΓΕΛΗΣ","Α.Ο.ΛΑΤΩ ΑΓ.ΝΙΚΟΛΑΟΥ",9,0]
["14-30771","ΔΡΟΣΟΣ ΘΩΜΑΣ","Α.Ο.Α.ΣΤΑΥΡΟΥΠΟΛΗΣ ΙΦΙΤΟΣ",9,0]
["14-33919","ΚΑΒΑΛΛΙΕΡΟΣ ΑΛΕΞΙΟΣ","Ο.Α.ΑΘΛΗΤ.ΠΑΙΔΕΙΑ",9,0]
["14-30434","ΚΑΣΑΠΗΣ ΣΤΥΛΙΑΝΟΣ","Ο.Α.ΞΑΝΘΗΣ",9,0]
["14-34648","ΟΙΚΟΝΟΜΟΥ ΝΙΚΟΛΑΟΣ","Α.Π.Ο.ΣΑΝΝΥ ΣΠΟΡΤΣ ΚΛΑΜΠ",9,0]
["14-29218","ΠΛΑΤΗΣ ΕΛΕΥΘΕΡΙΟΣ","Ο.Α.ΞΑΝΘΗΣ",9,0]
["14-29217","ΠΛΑΤΗΣ ΚΩΝΣΤΑΝΤΙΝΟΣ","Ο.Α.ΞΑΝΘΗΣ",9,0]
["14-30276","ΣΔΡΑΚΑΣ ΧΡΗΣΤΟΣ","Ο.Α.ΣΠΑΡΤΗΣ",9,0]
["14-31085","ΤΡΟΥΠΤΣΙΔΗΣ ΣΩΚΡΑΤΗΣ","Ο.Α.ΚΕΡΚΥΡΑΣ",9,0]
["14-32659","ΑΣΤΡΕΙΝΙΔΗΣ ΦΙΛΙΠΠΟΣ","Α.Ο.Α.ΠΑΠΑΓΟΥ",8.5,0]
["14-29084","ΠΑΠΑΔΕΑΣ ΠΑΝΑΓΙΩΤΗΣ","Ο.Α.ΚΕΡΑΤΣΙΝΙΟΥ",8.5,0]
["14-31948","ΣΚΟΥΠΑΣ ΣΩΤΗΡΙΟΣ","Α.Ο.ΣΙΚΥΩΝΟΣ ΚΙΑΤΟΥ",8.5,0]
["14-32782","ΧΑΡΑΛΑΜΠΙΔΗΣ ΜΑΡΙΟΣ","Ο.Α.ΓΟΥΔΙΟΥ",8.5,0]
["14-90147","ΧΟΦΤ ΣΤΥΜΟΝ-ΓΙΟΥΛΙΑΝ","Γ.Ε.ΠΡΕΒΕΖΑΣ",8.5,0]
["14-32098","ΧΡΙΣΤΟΔΟΥΛΟΠΟΥΛΟΣ ΧΡΗΣΤΟΣ-ΠΑΝΑΓΙΩΤΗΣ","Ο.Α.ΑΙΓΙΑΛΕΙΑΣ",8.5,0]
["14-33449","ΖΑΠΑΝΤΗΣ ΒΑΣΙΛΕΙΟΣ","ΚΕΦΑΛΛΗΝΙΑΚΟΣ Ο.Α.",8,0]
["14-33290","ΘΟΥΛΙΩΤΗΣ ΜΙΧΑΛΗΣ","Σ.Α.ΣΕΡΡΩΝ",8,0]
["14-31090","ΚΑΜΠΑΝΟΣ ΕΥΘΥΜΙΟΣ","ΚΕΦΑΛΛΗΝΙΑΚΟΣ Ο.Α.",8,0]
["14-29066","ΚΟΥΣΟΥΝΑΔΗΣ ΘΕΟΔΩΡΟΣ-ΧΑΡΑΛΑΜΠΟΣ","Α.Ο.ΚΑΒΑΛΑΣ ΜΑΚΕΔΟΝΙΚΟΣ",8,0]
["14-32821","ΠΑΠΠΑΣ ΚΩΝΣΤΑΝΤΙΝΟΣ","Ο.Α.ΑΡΤΑΣ",8,0]
["14-30691","ΤΣΟΠΑΝΕΛΗΣ ΑΡΙΣΤΕΙΔΗΣ","Α.Ο.Α.ΠΑΠΑΓΟΥ",8,0]
["14-34584","ΑΔΑΛΟΓΛΟΥ ΑΧΙΛΛΕΑΣ","Γ.Α.Σ.ΚΑΡΑΤΕ ΕΡΜΗΣ",7.5,0]
["14-34841","ΒΡΕΚΟΣ ΔΗΜΗΤΡΗΣ","Γ.Ο.ΠΕΡΙΣΤΕΡΙΟΥ Γ.ΠΑΛΑΣΚΑΣ",7.5,0]
["14-33796","ΘΕΟΧΑΡΗΣ ΒΑΣΙΛΕΙΟΣ","Α.Ο.Α.ΠΑΠΑΓΟΥ",7.5,0]
["14-33196","ΙΩΑΝΝΙΔΗΣ ΓΕΡΑΣΙΜΟΣ","Α.Σ.Α.ΠΑΜΒΩΤΙΣ ΙΩΑΝΝΙΝΩΝ",7.5,0]
["14-26764","ΛΑΜΠΡΟΠΟΥΛΟΣ ΚΛΕΟΜΒΡΟΤΟΣ","Α.Ε.Κ.ΤΡΙΠΟΛΗΣ",7.5,0]
["14-32601","ΜΠΑΛΑΤΣΙΝΟΣ ΓΕΡΑΣΙΜΟΣ","Ο.Α.ΚΕΡΚΥΡΑΣ",7.5,0]
["14-34274","ΣΑΒΒΑΣ ΓΕΩΡΓΙΟΣ","Ο.Α.ΑΡΤΑΣ",7.5,0]
["14-30868","ΣΑΝΤΑΣ ΧΡΗΣΤΟΣ","Α.Ο.Π.ΦΑΛΗΡΟΥ",7.5,0]
["14-30846","ΤΖΩΡΤΖΟΣ ΜΑΡΙΟΣ","Α.Ο.Α.ΣΤΑΥΡΟΥΠΟΛΗΣ ΙΦΙΤΟΣ",7.5,0]
["14-32920","ΖΕΡΒΟΓΙΑΝΝΗΣ ΝΙΚΟΛΑΟΣ","Ε.Σ.Ο.ΕΠΙΚΟΥΡΟΣ ΠΟΛΙΧΝΗΣ",7,0]
["14-34548","ΚΟΥΚΟΥΒΕΛΟΣ ΑΝΤΩΝΙΟΣ","Α.Σ.ΑΚΡΟΠΟΛΙΣ",7,0]
["14-32088","ΛΑΣΚΑΡΑΤΟΣ ΠΑΥΛΟΣ","ΚΕΦΑΛΛΗΝΙΑΚΟΣ Ο.Α.",7,0]
["14-32714","ΜΠΑΚΝΗΣ ΓΕΩΡΓΙΟΣ","Ο.Α.ΓΟΥΔΙΟΥ",7,0]
["14-29513","ΣΚΑΡΤΣΙΛΑΣ ΑΝΤΩΝΙΟΣ","Α.Ο.ΑΙΓΙΟΥ ΜΟΡΕΑΣ",7,0]
["14-29829","ΤΖΕΝΕΤΟΠΟΥΛΟΣ ΜΑΤΕΟ","ΠΕΥΚΗ Γ.ΚΑΛΟΒΕΛΩΝΗΣ",7,0]
["14-29636","ΤΖΩΡΤΖΗΣ ΔΗΜΗΤΡΙΟΣ","ΑΚΑΔ.ΑΝΤΙΣΦ.ΙΩΑΝΝΙΝΩΝ",7,0]
["14-33606","ΓΙΩΤΗΣ ΧΑΡΑΛΑΜΠΟΣ","Γ.Ο.ΠΕΡΙΣΤΕΡΙΟΥ Γ.ΠΑΛΑΣΚΑΣ",6.5,0]
["14-32712","ΕΥΑΓΓΕΛΟΥ ΧΑΡΙΛΑΟΣ","Α.Γ.Ο.ΦΙΛΙΠΠΙΑΔΑΣ",6.5,0]
["14-31872","ΖΑΦΕΙΡΟΠΟΥΛΟΣ ΓΙΩΡΓΟΣ","Α.Ο.Π.ΦΑΛΗΡΟΥ",6.5,0]
["14-33918","ΚΑΒΑΛΛΙΕΡΟΣ ΝΙΚΟΛΑΟΣ","Ο.Α.ΑΘΛΗΤ.ΠΑΙΔΕΙΑ",6.5,0]
["14-33660","ΚΟΥΡΣΑΡΗΣ ΓΙΩΡΓΟΣ","Α.Α.ΑΙΓΑΛΕΩ",6.5,0]
["14-33302","ΜΗΤΤΑΡΗΣ ΝΙΚΟΛΑΟΣ","Α.Σ.Α.ΠΑΜΒΩΤΙΣ ΙΩΑΝΝΙΝΩΝ",6.5,0]
["14-31792","ΣΑΚΟΓΙΑΝΝΗΣ ΒΑΠΤΙΣΤΗΣ","Α.Ο.Α.ΧΑΪΔΑΡΙΟΥ",6.5,0]
["14-31327","ΤΟΚΜΑΚΗΣ ΗΛΙΑΣ","Ο.Α.ΣΥΡΟΥ",6.5,0]
["14-33565","ZAXΑΡΟΓΙΩΡΓΑΣ ΙΩΑΝΝΗΣ","Γ.Ο.ΠΕΡΙΣΤΕΡΙΟΥ Γ.ΠΑΛΑΣΚΑΣ",6,0]
["14-33523","ΒΟΥΖΙΚΗΣ ΠΑΥΛΟΣ","Ο.Α.ΚΙΛΚΙΣ",6,0]
["14-32729","ΚΑΣΤΑΜΟΝΙΤΗΣ ΑΛΚΙΝΟΟΣ-ΠΑΝΑΓΙΩΤΗΣ","Ο.Α.ΚΕΡΚΥΡΑΣ",6,0]
["14-30155","ΛΑΜΠΡΟΠΟΥΛΟΣ ΠΑΝΑΓΙΩΤΗΣ","Α.Ε.Κ.ΤΡΙΠΟΛΗΣ",6,0]
["14-30958","ΜΟΥΖΟΥΚΟΣ ΙΩΑΝΝΗΣ","Α.Ο.Α.ΧΑΪΔΑΡΙΟΥ",6,0]
["14-30140","ΜΥΛΩΝΑΣ ΚΩΝΣΤΑΝΤΙΝΟΣ-ΜΑΡΚΟΣ","Ε.Σ.Ο.ΕΠΙΚΟΥΡΟΣ ΠΟΛΙΧΝΗΣ",6,0]
["14-31442","ΠΑΤΕΡΑΚΗΣ ΚΩΝΣΤΑΝΤΙΝΟΣ","Α.Ο.ΛΑΤΩ ΑΓ.ΝΙΚΟΛΑΟΥ",6,0]
["14-32917","ΣΛΟΥΜ-ΤΡΑΚΑΣ ΡΑΦΑΕΛ","Ο.Α.ΚΕΡΚΥΡΑΣ",6,0]
["14-33469","ΤΡΙΑΝΤΑΦΥΛΛΗΣ ΔΑΝΙΗΛ","Ο.Α.ΒΡΙΛΗΣΣΙΩΝ",6,0]
["14-33870","ΧΩΡΙΝΟΣ ΑΛΕΞΑΝΔΡΟΣ","Α.Ν.Ο.ΓΛΥΦΑΔΑΣ",6,0]
["14-29605","ΑΛΕΞΑΝΔΡΗΣ ΝΙΚΗΦΟΡΟΣ","Α.Ο.Π.ΦΑΛΗΡΟΥ",5.5,0]
["14-34243","ΑΝΔΡΟΥΛΑΚΗΣ ΚΩΝΣΤΑΝΤΙΝΟΣ","Α.Ο.Α.ΧΑΪΔΑΡΙΟΥ",5.5,0]
["14-31581","ΑΠΟΣΤΟΛΙΔΗΣ ΠΕΡΙΚΛΗΣ","Α.Ο.Α.ΠΡΩΤΑΘΛ.ΚΑΒΑΛΑΣ",5.5,0]
["14-33842","ΔΗΜΗΤΡΙΟΥ ΑΡΙΣΤΕΙΔΗΣ","Α.Ν.Ο.ΓΛΥΦΑΔΑΣ",5.5,0]
["14-30547","ΖΩΤΟΣ ΧΡΗΣΤΟΣ","Ο.Α.ΓΛΥΦΑΔΑΣ",5.5,0]
["14-30484","ΚΑΡΑΓΙΑΝΝΙΔΗΣ ΣΤΥΛΙΑΝΟΣ","Ο.Α.ΞΑΝΘΗΣ",5.5,0]
["14-30181","ΚΑΡΠΟΔΙΝΗΣ ΑΛΕΞΑΝΔΡΟΣ","Ο.Α.ΧΑΛΚΙΔΑΣ",5.5,0]
["14-30532","ΜΗΛΙΩΝΗΣ ΚΩΝΣΤΑΝΤΙΝΟΣ","Ο.Α.ΧΑΝΙΩΝ",5.5,0]
["14-33300","ΠΑΝΤΖΟΣ ΙΩΑΝΝΗΣ","Α.Σ.Α.ΠΑΜΒΩΤΙΣ ΙΩΑΝΝΙΝΩΝ",5.5,0]
["14-34459","ΠΑΠΟΥΤΣΗΣ ΚΩΝΣΤΑΝΤΙΝΟΣ","Α.Γ.Ο.ΦΙΛΙΠΠΙΑΔΑΣ",5.5,0]
["14-34836","ΣΑΒΒΑΚΗΣ ΔΗΜΗΤΡΗΣ","Ο.Α.ΡΕΘΥΜΝΟΥ",5.5,0]
["14-31877","ΣΤΑΜΟΥΛΟΣ ΓΙΑΝΝΗΣ","Α.Ο.Α.ΗΛΙΟΥΠΟΛΗΣ",5.5,0]
["14-30767","ΤΡΙΑΝΤΑΦΥΛΛΙΔΗΣ ΑΒΡΑΑΜ","ΠΑΝΘΡΑΚΙΚΟΣ Ο.Α.ΚΟΜΟΤΗΝΗΣ",5.5,0]
["14-29321","ΑΝΑΣΤΟΠΟΥΛΟΣ ΝΙΚΟΛΑΟΣ","Α.Ε.Κ.ΤΡΙΠΟΛΗΣ",5,0]
["14-31248","ΒΑΜΒΑΚΑΣ ΒΑΣΙΛΕΙΟΣ","Ο.Α.ΤΟΥΜΠΑΣ",5,0]
["14-31875","ΒΙΤΑΛΗΣ ΠΕΤΡΟΣ","Α.Ο.Α.ΗΛΙΟΥΠΟΛΗΣ",5,0]
["14-34265","ΓΚΟΡΟΓΙΑΣ ΔΗΜΗΤΡΙΟΣ","Α.Σ.Α.ΑΓΡΙΝΙΟΥ",5,0]
["14-31554","ΔΕΔΟΥΣΗΣ ΔΗΜΗΤΡΗΣ","Ο.Α.ΜΑΓΝΗΣΙΑΣ",5,0]
["14-34541","ΔΡΟΣΟΣ ΓΕΩΡΓΙΟΣ-ΠΕΤΡΟΣ","Ο.Α.ΠΑΡΟΥ",5,0]
["14-33990","ΖΑΦΕΙΡΙΟΥ ΙΩΑΝΝΗΣ","Ο.Α.ΤΟΥΜΠΑΣ",5,0]
["14-34824","ΚΟΥΝΤΟΥΡΑΚΗΣ ΙΩΑΝΝΗΣ","Σ.Α.ΘΕΣΣΑΛΟΝΙΚΗΣ",5,0]
["14-33969","ΛΑΜΠΡΗΣ ΙΩΑΝΝΗΣ","Σ.Α.ΓΑΛΑΤΣΙΟΥ",5,0]
["14-31101","ΜΙΧΑΛΟΠΟΥΛΟΣ ΠΑΣΧΑΛΗΣ","Α.Α.ΑΛΜΠΑΤΡΟΣ",5,0]
["14-31796","ΜΠΑΛΑΝΟΣ ΓΕΩΡΓΙΟΣ","Ο.Α.ΙΩΑΝΝΙΝΩΝ",5,0]
["14-26819","ΠΑΠΑΔΟΠΟΥΛΟΣ ΜΑΞΙΜΟΣ","Μ.Γ.Σ.ΑΠΟΛΛΩΝ ΚΑΛΑΜΑΡΙΑΣ",5,0]
["14-32203","ΠΑΠΙΟΠΟΥΛΟΣ ΝΙΚΟΣ-ΔΗΜΗΤΡΗΣ","Ο.Α.ΣΥΡΟΥ",5,0]
["14-30360","ΠΑΠΟΥΝΙΔΗΣ ΟΡΕΣΤΗΣ","Ο.Α.ΩΡΑΙΟΚΑΣΤΡΟΥ Ο ΑΝΤΑΙΟΣ",5,0]
["14-34350","ΠΑΤΙΝΙΩΤΗΣ ΓΕΩΡΓΙΟΣ","Σ.Α.ΡΑΦΗΝΑΣ",5,0]
["14-29366","ΠΑΥΛΟΠΟΥΛΟΣ ΔΙΟΝΥΣΙΟΣ","Ο.Α.ΚΑΛΑΜΑΤΑΣ",5,0]
["14-28836","ΤΖΙΝΗΣ ΝΙΚΟΛΑΟΣ","ΡΗΓΑΣ Α.Ο.Α.ΑΡΓΟΛΙΔΑΣ",5,0]
["14-30918","ΤΡΙΑΝΤΑΦΥΛΛΙΔΗΣ-ΚΟΥΛΟΥΡΙΩΤΗΣ ΕΥΣΤΑΘΙΟΣ","Ε.Σ.Ο.ΕΠΙΚΟΥΡΟΣ ΠΟΛΙΧΝΗΣ",5,0]
["14-28119","ΦΙΛΙΠΠΟΥ ΣΤΑΜΑΤΗΣ","Ο.Α.ΑΝΑΦΛΥΣΤΟΣ ΣΑΡΩΝΙΔΑΣ",5,0]
["14-32131","ΑΝΑΓΝΩΣΤΑΚΗΣ ΒΑΣΙΛΕΙΟΣ","ΚΕΦΑΛΛΗΝΙΑΚΟΣ Ο.Α.",4.5,0]
["14-33558","ΒΑΣΙΛΕΙΑΔΗΣ ΙΩΑΝΝΗΣ-ΜΑΞΙΜΟΣ","ΠΑΝΘΡΑΚΙΚΟΣ Ο.Α.ΚΟΜΟΤΗΝΗΣ",4.5,0]
["14-29387","ΓΡΑΜΜΑΤΙΚΟΥΛΗΣ ΓΕΩΡΓΙΟΣ","Ο.Α.ΝΙΚΑΙΑ ΛΑΡΙΣΑΣ",4.5,0]
["14-32606","ΚΑΛΔΗΣ ΑΝΔΡΕΑΣ","Α.Σ.ΠΕΡΑ",4.5,0]
["14-30604","ΜΠΟΥΤΑΣ ΒΑΣΙΛΕΙΟΣ","Ο.Α.ΜΑΓΝΗΣΙΑΣ",4.5,0]
["14-31885","ΝΙΚΟΛΟΠΟΥΛΟΣ ΑΛΕΞΑΝΔΡΟΣ","Α.Ο.Π.ΦΑΛΗΡΟΥ",4.5,0]
["14-28939","ΝΤΑΟΠΟΥΛΟΣ ΚΩΝΣΤΑΝΤΙΝΟΣ","Ο.Α.ΙΩΛΚΟΣ ΒΟΛΟΥ",4.5,0]
["14-32101","ΣΠΗΛΙΩΤΟΠΟΥΛΟΣ ΔΗΜΗΤΡΙΟΣ","Ο.Α.ΑΙΓΙΑΛΕΙΑΣ",4.5,0]
["14-27667","ΤΟΥΡΝΑΤΖΗΣ ΑΘΑΝΑΣΙΟΣ","Ο.Α.ΚΕΡΑΤΣΙΝΙΟΥ",4.5,0]
["14-34371","ΑΓΓΕΛΗΣ ΜΙΧΑΗΛ","Α.Ο.Α.ΑΙΓΑΛΕΩ 92",4,0]
["14-33701","ΑΝΤΩΝΙΑΔΗΣ ΦΩΤΙΟΣ-ΑΝΔΡΕΑΣ","Α.Ν.Ο.ΓΛΥΦΑΔΑΣ",4,0]
["14-33746","ΑΝΤΩΝΟΠΟΥΛΟΣ ΚΩΝΣΤΑΝΤΙΝΟΣ","Α.Σ.ΑΚΑΔΗΜΙΕΣ ΠΡΩΤΑΘΛΗΤΩΝ ΠΕΥΚΩΝ",4,0]
["14-34589","ΒΑΡΕΛΑΣ ΚΩΝΣΤΑΝΤΙΝΟΣ","Α.Α.ΑΙΓΑΛΕΩ",4,0]
["14-34167","ΒΕΛΙΟΣ ΔΗΜΗΤΡΗΣ","Α.Γ.Ο.ΦΙΛΙΠΠΙΑΔΑΣ",4,0]
["14-28417","ΖΕΡΒΟΣ ΙΩΑΝΝΗΣ","Ο.Α.ΒΙΚΕΛΑΣ ΒΕΡΟΙΑΣ",4,0]
["14-32839","ΚΑΜΠΟΥΡΗΣ ΕΜΜΑΝΟΥΗΛ","ΡΟΔΙΑΚΟΣ Ο.Α.",4,0]
["14-34262","ΚΙΣΤΗΣ ΓΕΩΡΓΙΟΣ","ΑΚΑΔ.ΑΝΤΙΣΦ.ΙΩΑΝΝΙΝΩΝ",4,0]
["14-32218","ΜΑΛΙΝΔΡΕΤΟΣ ΜΙΧΑΗΛ","Σ.Α.ΡΑΦΗΝΑΣ",4,0]
["14-30254","ΜΟΥΡΓΚΟΣ ΧΑΡΑΛΑΜΠΟΣ","Α.Σ.ΑΚΑΔΗΜΙΕΣ ΠΡΩΤΑΘΛΗΤΩΝ ΠΕΥΚΩΝ",4,0]
["14-34758","ΜΟΥΣΑΒΕΡΕΣ ΚΩΝΣΤΑΝΤΙΝΟΣ","Α.Ο.ΒΑΡΗΣ ΑΝΑΓΥΡΟΥΣ",4,0]
["14-34583","ΜΠΑΛΚΟΓΛΟΥ ΚΥΡΙΑΖΗΣ","Ο.Α.ΧΑΝΙΩΝ",4,0]
["14-34702","ΝΙΚΟΛΕΤΟΣ ΚΩΝΣΤΑΝΤΙΝΟΣ","Σ.Α.ΡΑΦΗΝΑΣ",4,0]
["14-29182","ΠΑΠΑΔΑΚΗΣ ΑΛΕΞΑΝΔΡΟΣ","Φ.Ο.Α.ΝΕΑΠΟΛΗΣ",4,0]
["14-33867","ΠΑΠΑΝΙΚΟΛΑΟΥ ΑΘΑΝΑΣΙΟΣ","Α.Σ.ΜΑΧΗΤΕΣ ΠΕΥΚΩΝ",4,0]
["14-29600","ΠΑΠΠΑΣ ΜΑΡΙΟΣ","Α.Γ.Ο.ΝΑΥΠΑΚΤΟΥ",4,0]
["14-34886","ΡΟΔΟΠΟΥΛΟΣ ΣΑΒΒΑΣ","Ο.Α.ΚΑΣΤΟΡΙΑΣ ΚΕΛΕΤΡΟΝ",4,0]
["14-33889","ΣΑΡΤΣΙΔΗΣ ΜΗΝΑΣ","Ο.Α.ΚΑΣΤΟΡΙΑΣ ΚΕΛΕΤΡΟΝ",4,0]
["14-31321","ΣΙΔΗΡΟΠΟΥΛΟΣ ΠΑΝΑΓΙΩΤΗΣ","Γ.Α.Σ.ΚΑΡΑΤΕ ΕΡΜΗΣ",4,0]
["14-32573","ΤΕΛΙΟΥΣΗΣ ΓΙΩΡΓΟΣ","Α.Σ.ΑΚΑΔΗΜΙΕΣ ΠΡΩΤΑΘΛΗΤΩΝ ΠΕΥΚΩΝ",4,0]
["14-29314","ΤΣΙΡΟΓΙΑΝΝΗΣ ΑΡΙΣΤΟΓΕΝΗΣ","Ο.Α.ΓΟΥΔΙΟΥ",4,0]
["14-31869","ΒΑΣΙΛΟΓΛΟΥ-ΚΑΜΕΝΙΔΗΣ ΙΩΑΝΝΗΣ","Ο.Α.ΑΡΙΔΑΙΑΣ",3.5,0]
["14-32830","ΖΗΚΟΣ ΔΗΜΗΤΡΙΟΣ","Γ.Ε.ΠΡΕΒΕΖΑΣ",3.5,0]
["14-27900","ΘΕΟΔΩΡΑΚΕΑΣ ΕΥΑΓΓΕΛΟΣ","Ο.Α.ΞΑΝΘΗΣ",3.5,0]
["14-31008","ΘΩΜΑΣ ΡΑΦΑΗΛ","Α.Σ.ΠΕΡΑ",3.5,0]
["14-27480","ΚΑΡΑΚΑΣΗΣ ΒΑΣΙΛΗΣ","Ο.Α.ΞΑΝΘΗΣ",3.5,0]
["14-29720","ΚΛΑΔΗΣ ΔΗΜΗΤΡΙΟΣ","Ο.Α.ΚΑΙΣΑΡΙΑΝΗΣ",3.5,0]
["14-30407","ΚΩΣΤΑΡΑΣ ΓΕΩΡΓΙΟΣ","Α.Ο.ΤΑΤΟΪΟΥ",3.5,0]
["14-33362","ΦΑϊΤΣΑΣ ΝΙΚΟΛΑ","ΚΕΡΚΥΡΑΪΚΗ Λ.Τ.",3.5,0]
["14-34543","ΧΑΡΑΛΑΜΠΙΔΗΣ ΘΕΟΦΙΛΟΣ","Α.Ο.Α.ΝΕΑΣ ΠΕΡΑΜΟΥ ΟΙ ΤΙΤΑΝΕΣ",3.5,0]
["14-29661","ΑΓΑΘΟΣ ΙΩΑΝΝΗΣ","Ο.Α.ΚΕΡΚΥΡΑΣ",3,0]
["14-29659","ΑΛΕΤΡΑΣ ΚΩΝΣΤΑΝΤΙΝΟΣ","Ο.Α.ΚΕΡΚΥΡΑΣ",3,0]
["14-34294","ΓΑΡΕΦΗΣ ΠΑΥΛΟΣ","Σ.Α.ΘΕΣΣΑΛΟΝΙΚΗΣ",3,0]
["14-33921","ΓΑΣΠΑΡΗΣ ΙΩΑΝΝΗΣ","Α.Ο.Α.ΗΛΙΟΥΠΟΛΗΣ",3,0]
["14-34529","ΓΚΟΝΟΣ ΑΝΑΣΤΑΣΙΟΣ","Ο.Α.ΙΩΑΝΝΙΝΩΝ",3,0]
["14-30266","ΓΡΗΓΟΡΑΚΗΣ ΚΙΜΩΝ","Α.Κ.Α.ΜΑΡΑΘΩΝΑ",3,0]
["14-27780","ΚΑΡΒΕΛΑΣ ΑΠΟΣΤΟΛΟΣ","Α.Σ.ΟΛΥΜΠΙΑΚΟΥ ΧΩΡΙΟΥ Ο ΦΟΙΒΟΣ",3,0]
["14-32264","ΚΑΡΥΔΗΣ ΦΩΤΗΣ","ΗΡΑΚΛΕΙΟ Ο.Α.& Α.",3,0]
["14-29155","ΚΕΛΑΪΔΟΠΟΥΛΟΣ ΑΝΔΡΕΑΣ","Ο.Α.ΜΑΓΝΗΣΙΑΣ",3,0]
["14-33503","ΚΟΒΑΝΙΔΗΣ ΠΕΡΙΚΛΗΣ","ΣΕΡΡΑΪΚΟΣ Ο.Α.",3,0]
["14-32092","ΚΟΝΤΑΚΤΣΗΣ ΛΑΖΑΡΟΣ","ΦΙΛΑΘΛΗΤ.ΣΥΛ.ΛΑΜΙΑΣ",3,0]
["14-34881","ΚΟΥΤΕΛΕΚΟΣ ΚΩΝΣΤΑΝΤΙΝΟΣ","ΑΙΟΛΟΣ Α.Λ.ΙΛΙΟΥ",3,0]
["14-29178","ΚΥΡΜΙΖΑΚΗΣ ΕΜΜΑΝΟΥΗΛ","Ο.Α.ΒΕΡΟΙΑΣ",3,0]
["14-34499","ΚΩΝΣΤΑΝΤΙΝΟΥ ΛΑΜΠΡΟΣ","Ο.Α.ΣΟΦΑΔΩΝ ΚΑΡΔΙΤΣΑΣ",3,0]
["14-34392","ΜΑΛΛΑΣ ΑΝΤΩΝΙΟΣ","Ο.Α.ΛΙΤΟΧΩΡΟΥ",3,0]
["14-33916","ΜΗΤΡΟΠΟΥΛΟΣ ΝΙΚΟΛΑΟΣ","Ο.Α.ΑΘΛΗΤ.ΠΑΙΔΕΙΑ",3,0]
["14-32737","ΝΤΑΛΛΗΣ ΕΥΑΓΓΕΛΟΣ","Α.Ο.Α.ΗΛΙΟΥΠΟΛΗΣ",3,0]
["14-31677","ΞΕΝΙΔΗΣ ΑΝΤΩΝΙΟΣ","Ο.Α.ΑΡΙΔΑΙΑΣ",3,0]
["14-32862","ΠΑΠΑΓΕΩΡΓΙΟΥ ΑΧΙΛΛΕΑΣ","Ο.Α.ΒΟΛΟΥ",3,0]
["14-33758","ΠΑΠΑΣΠΥΡΟΠΟΥΛΟΣ ΓΕΩΡΓΙΟΣ","Ο.Α.ΡΙΟΥ",3,0]
["14-29378","ΠΟΛΙΤΗΣ ΧΡΙΣΤΟΣ","Α.Ο.Α.ΧΑΪΔΑΡΙΟΥ",3,0]
["14-32592","ΠΟΛΥΖΟΣ ΔΗΜΟΣΘΕΝΗΣ","Ο.Α.ΜΑΓΝΗΣΙΑΣ",3,0]
["14-32948","ΠΡΑΤΙΚΑΚΗΣ ΕΜΜΑΝΟΥΗΛ","Ο.Α.ΞΑΝΘΗΣ",3,0]
["14-34320","ΡΑΜΑΝΤΑΝΗΣ ΝΙΚΟΛΑΟΣ","Ο.Α.ΣΟΦΑΔΩΝ ΚΑΡΔΙΤΣΑΣ",3,0]
["14-26456","ΣΠΑΝΟΥΔΑΚΗΣ ΠΑΥΛΟΣ-ΓΕΩΡΓΙΟΣ","Ο.Α.ΧΑΝΙΩΝ",3,0]
["14-34703","ΣΤΕΦΑΝΙΔΗΣ ΑΝΤΩΝΗΣ","Σ.Α.ΘΕΣΣΑΛΟΝΙΚΗΣ",3,0]
["14-33797","ΤΕΝΤΕΣΚΙ ΑΝΑΣΤΑΣΙΟΣ","Ο.Α.ΧΟΛΑΡΓΟΥ",3,0]
["14-29347","ΤΖΩΡΤΖΗΣ ΧΡΗΣΤΟΣ-ΜΙΧΑΗΛ","Ο.Α.ΜΑΓΝΗΣΙΑΣ",3,0]
["14-25400","ΤΣΟΓΚΑΣ ΔΙΟΝΥΣΗΣ","Μ.Γ.Σ.ΑΠΟΛΛΩΝ ΚΑΛΑΜΑΡΙΑΣ",3,0]
["14-34307","ΦΟΡΤΟΥΝΑΣ ΑΛΕΞΑΝΔΡΟΣ","Ο.Α.ΑΘΗΝΩΝ",3,0]
["14-28749","ΦΟΥΡΜΟΥΖΗΣ ΑΝΤΩΝΗΣ","Α.Ο.ΑΡΓΥΡΟΥΠΟΛΗΣ",3,0]
["14-29701","ΧΑΛΙΑΜΑΛΙΑΣ ΕΠΑΜΕΙΝΩΝΔΑΣ","Σ.Ο.Α.ΚΑΡΔΙΤΣΑΣ ΦΩΚΙΑΝΟΣ",3,0]
["14-27002","ΧΑΡΟΒΑΣ ΑΝΤΩΝΙΟΣ","Σ.Ο.Α.ΚΑΡΔΙΤΣΑΣ ΦΩΚΙΑΝΟΣ",3,0]
["14-31396","ΑΓΓΕΛΟΠΟΥΛΟΣ ΠΑΝΑΓΙΩΤΗΣ","Α.Ο.ΣΙΚΥΩΝΟΣ ΚΙΑΤΟΥ",2.5,0]
["14-34285","ΒΡΑΪΛΑΣ ΜΑΡΚΟΣ","Ο.Α.ΠΑΝΟΡΑΜΑΤΟΣ",2.5,0]
["14-30405","ΓΚΙΩΝΗΣ ΔΗΜΗΤΡΗΣ","Ο.Α.ΚΑΙΣΑΡΙΑΝΗΣ",2.5,0]
["14-34410","ΔΗΜΗΤΡΟΠΟΥΛΟΣ ΠΑΝΑΓΙΩΤΗΣ","Ο.Α.ΑΙΓΙΑΛΕΙΑΣ",2.5,0]
["14-34715","ΕΣΕΡΙΔΗΣ ΝΙΚΟΛΑΟΣ","Ο.Α.ΜΑΓΝΗΣΙΑΣ",2.5,0]
["14-34606","ΚΑΡΑΣ ΑΓΓΕΛΟΣ","ΗΡΑΚΛΕΙΟ Ο.Α.& Α.",2.5,0]
["14-34120","ΚΕΦΑΛΟΓΙΑΝΝΗΣ ΒΑΓΓΕΛΗΣ","ΦΙΛΙΑ Τ.Κ.",2.5,0]
["14-33659","ΚΟΥΡΣΑΡΗΣ ΝΙΚΗΤΑΣ","Α.Α.ΑΙΓΑΛΕΩ",2.5,0]
["14-34929","ΚΟΥΤΡΑΚΗΣ ΝΙΚΟΛΑΟΣ","ΗΡΑΚΛΕΙΟ Ο.Α.& Α.",2.5,0]
["14-34222","ΚΡΟΜΜΥΔΑΚΗΣ ΣΤΕΛΙΟΣ","Ο.Α.ΣΟΥΔΑΣ",2.5,0]
["14-32503","ΜΑΚΡΗΣ ΔΗΜΗΤΡΙΟΣ-ΜΕΛΕΤΙΟΣ","Α.Ο.Α.ΧΑΪΔΑΡΙΟΥ",2.5,0]
["14-33742","ΠΑΠΑΝΔΡΟΥΔΗΣ ΜΙΛΤΙΑΔΗΣ","Α.Α.ΑΙΓΑΛΕΩ",2.5,0]
["14-33767","ΠΑΠΠΑΣ ΕΥΑΓΓΕΛΟΣ","Ο.Α.ΡΙΟΥ",2.5,0]
["14-29733","ΠΕΤΡΙΔΗΣ ΓΕΩΡΓΙΟΣ","ΑΙΟΛΟΣ Α.Λ.ΙΛΙΟΥ",2.5,0]
["14-32902","ΣΙΟΥΤΟΓΛΟΥ ΚΩΝΣΤΑΝΤΙΝΟΣ","Σ.Α.ΕΛΑΣΣΟΝΑΣ",2.5,0]
["14-31908","ΣΤΑΝΕΛΛΟΣ ΚΩΝΣΤΑΝΤΙΝΟΣ","Ο.Α.ΚΕΡΚΥΡΑΣ",2.5,0]
["14-29735","ΤΑΛΙΟΥΡΗΣ ΓΕΩΡΓΙΟΣ","ΑΙΟΛΟΣ Α.Λ.ΙΛΙΟΥ",2.5,0]
["14-32501","ΤΖΙΕΡΑΣ ΙΑΣΟΝΑΣ","Α.Ο.ΒΑΡΗΣ ΑΝΑΓΥΡΟΥΣ",2.5,0]
["14-32490","ΤΖΟΚΑΣ ΣΠΥΡΙΔΩΝ","Γ.Ε.ΠΡΕΒΕΖΑΣ",2.5,0]
["14-33597","ΤΡΙΑΡΙΔΗΣ ΔΗΜΗΤΡΙΟΣ","Ο.Α.ΚΙΛΚΙΣ",2.5,0]
["14-35333","ΤΣΑΚΙΡΑΚΗΣ ΓΙΩΡΓΟΣ","ΗΡΑΚΛΕΙΟ Ο.Α.& Α.",2.5,0]
["14-30180","ΦΡΑΓΓΙΑΣ ΓΕΩΡΓΙΟΣ","Ο.Α.ΧΑΛΚΙΔΑΣ",2.5,0]
["14-32680","ΦΩΤΕΙΝΟΠΟΥΛΟΣ ΑΘΑΝΑΣΙΟΣ","Α.Ο.Α.ΗΛΙΟΥΠΟΛΗΣ",2.5,0]
["14-32349","ΑΛΕΚΤΟΡΙΔΗΣ ΟΡΕΣΤΗΣ","Φ.Ο.Α.ΝΕΑΠΟΛΗΣ",2,0]
["14-30878","ΑΝΔΡΙΟΠΟΥΛΟΣ ΒΑΣΙΛΕΙΟΣ-ΛΟΥΚΑΣ","Α.Ε.Τ.ΝΙΚΗ ΠΑΤΡΩΝ",2,0]
["14-34608","ΑΡΑΠΗΣ ΕΛΕΥΘΕΡΙΟΣ","Α.Γ.Ο.ΦΙΛΙΠΠΙΑΔΑΣ",2,0]
["14-32905","ΓΚΕΣΟΥΛΗΣ ΑΡΙΣΤΟΤΕΛΗΣ","Ο.Α.ΙΩΑΝΝΙΝΩΝ",2,0]
["14-32567","ΔΑΜΑΣΙΩΤΗΣ ΕΥΑΓΓΕΛΟΣ","Α.Ο.Α.ΦΙΛΟΘΕΗΣ",2,0]
["14-33508","ΕΥΑΓΓΕΛΙΔΗΣ ΕΥΑΓΓΕΛΟΣ","Α.Π.Ο.ΣΑΝΝΥ ΣΠΟΡΤΣ ΚΛΑΜΠ",2,0]
["14-33877","ΕΥΦΡΑΙΜΟΓΛΟΥ-ΜΠΟΤΑΣΗΣ ΛΑΖΑΡΟΣ","Ο.Α.ΑΘΗΝΩΝ",2,0]
["14-34500","ΖΟΡΜΠΑΣ ΑΣΤΕΡΗΣ","Ν.Ο.Ν.Α.Μ",2,0]
["14-34471","ΘΑΝΗΣ ΣΠΥΡΟΣ","Α.Γ.Ο.ΦΙΛΙΠΠΙΑΔΑΣ",2,0]
["14-34484","ΚΑΛΑΡΑΣ ΠΑΝΤΕΛΗΣ","Α.Ο.ΣΙΚΥΩΝΟΣ ΚΙΑΤΟΥ",2,0]
["14-33107","ΚΑΛΠΑΤΖΙΔΗΣ ΗΡΑΚΛΗΣ","ΣΕΡΡΑΪΚΟΣ Ο.Α.",2,0]
["14-33802","ΚΑΡΑΓΙΑΝΝΟΥΔΗΣ ΝΙΚΗΤΑΣ","Α.Σ.Α.ΠΑΝΟΡΑΜΑΤΟΣ",2,0]
["14-32676","ΚΑΡΑΜΑΝΗΣ ΚΩΝΣΤΑΝΤΙΝΟΣ","ΚΕΝΤΡΟ ΑΝΤΙΣΦΑΙΡΙΣΗΣ ΛΙΒΑΔΕΙΑΣ",2,0]
["14-32838","ΚΑΤΣΟΥΛΑΚΗΣ ΕΜΜΑΝΟΥΗΛ","Ο.Α.ΧΑΝΙΩΝ",2,0]
["14-33895","ΚΟΓΚΑΛΙΔΗΣ ΔΗΜΗΤΡΙΟΣ","Α.Ο.Α.ΠΟΣΕΙΔΩΝ ΘΕΣΣΑΛΟΝΙΚΗΣ",2,0]
["14-34494","ΚΟΝΤΗΣ ΑΝΑΣΤΑΣΙΟΣ","Ο.Α.ΓΛΥΦΑΔΑΣ",2,0]
["14-32489","ΚΟΤΤΑΣ ΕΠΑΜΕΙΝΩΝΔΑΣ","Γ.Ε.ΠΡΕΒΕΖΑΣ",2,0]
["14-34675","ΚΩΤΣΑΝΤΑΣ ΑΝΤΩΝΗΣ","Ο.Α.ΧΑΛΚΙΔΑΣ",2,0]
["14-32803","ΛΟΥΚΑΣ ΣΤΕΡΓΙΟΣ","Ο.Α.ΑΛΕΞΑΝΔΡΟΣ ΒΕΡΟΙΑΣ",2,0]
["14-29424","ΜΑΓΕΙΡΑΣ ΑΘΑΝΑΣΙΟΣ","Α.Σ.ΑΚΡΟΠΟΛΙΣ",2,0]
["14-34646","ΜΑΓΚΟΥΤΑΣ ΓΕΩΡΓΙΟΣ","Ο.Α.ΚΑΙΣΑΡΙΑΝΗΣ",2,0]
["14-35113","ΜΑΝΟΣ ΓΕΩΡΓΙΟΣ","Ο.Α.ΚΕΡΚΥΡΑΣ",2,0]
["14-32495","ΜΠΟΥΤΙΚΟΣ ΧΡΗΣΤΟΣ","Γ.Ε.ΠΡΕΒΕΖΑΣ",2,0]
["14-34264","ΠΛΑΤΑΝΙΑΣ ΓΕΩΡΓΙΟΣ","Α.Σ.Α.ΑΓΡΙΝΙΟΥ",2,0]
["14-34639","ΠΟΥΛΚΑ ΜΑΡΙΑ-ΕΛΕΝΗ","Α.Ο.Α.ΣΤΑΥΡΟΥΠΟΛΗΣ ΙΦΙΤΟΣ",2,0]
["14-34369","ΠΡΑΤΙΚΑΚΗΣ ΧΡΗΣΤΟΣ","Σ.Α.ΓΑΛΑΤΣΙΟΥ",2,0]
["14-32133","ΡΗΓΟΥΤΣΟΣ ΑΝΤΩΝΗΣ","Ο.Α.ΣΥΡΟΥ",2,0]
["14-32820","ΡΙΖΟΣ ΑΝΑΣΤΑΣΙΟΣ","Ο.Α.ΑΡΤΑΣ",2,0]
["14-30605","ΣΑΡΡΗΣ ΕΛΕΥΘΕΡΙΟΣ","Ο.Α.ΜΑΓΝΗΣΙΑΣ",2,0]
["14-31564","ΤΙΜΟΘΕΑΔΗΣ ΙΩΑΝΝΗΣ","Α.Α.ΑΛΜΠΑΤΡΟΣ",2,0]
["14-24815","ΤΣΑΚΙΡΗΣ ΙΩΑΝΝΗΣ","Ο.Α.ΛΕΣΒΟΥ",2,0]
["14-34888","ΤΣΙΧΡΙΝΤΖΗΣ ΚΩΝΣΤΑΝΤΙΝΟΣ","Α.Σ.ΑΚΡΟΠΟΛΙΣ",2,0]
["14-32704","ΤΣΙΧΡΙΤΖΗΣ ΣΩΚΡΑΤΗΣ-ΦΙΛΙΠΠΟΣ","Α.Σ.Α.ΑΓΡΙΝΙΟΥ",2,0]
["14-29824","ΧΑΤΖΗΗΛΙΑΔΗΣ  ΓΕΩΡΓΙΟΣ","Σ.Α.ΣΕΡΡΩΝ",2,0]
["14-32191","ΧΑΧΑΔΑΚΗΣ ΣΤΥΛΙΑΝΟΣ","Ο.Α.ΣΥΡΟΥ",2,0]
["14-32804","ΑΝΑΝΙΑΔΗΣ ΜΙΧΑΛΗΣ","Ο.Α.ΑΛΕΞΑΝΔΡΟΣ ΒΕΡΟΙΑΣ",1.5,0]
["14-32221","ΒΑΣΙΛΕΙΟΥ ΚΩΝΣΤΑΝΤΙΝΟΣ","Ν.Ο.Ν.Α.Μ",1.5,0]
["14-32488","ΓΑΪΤΑΝΑΡΟΣ ΓΕΩΡΓΙΟΣ","Γ.Ε.ΠΡΕΒΕΖΑΣ",1.5,0]
["14-32802","ΓΕΩΡΓΟΠΟΥΛΟΣ ΓΙΑΝΝΗΣ","Ο.Α.ΑΛΕΞΑΝΔΡΟΣ ΒΕΡΟΙΑΣ",1.5,0]
["14-30388","ΓΙΑΝΝΟΥΛΑΚΗΣ ΛΑΜΠΡΟΣ","Φ.Ο.Α.ΝΕΑΠΟΛΗΣ",1.5,0]
["14-30149","ΓΚΕΚΑΣ ΓΕΩΡΓΙΟΣ","Α.Ε.Κ.ΤΡΙΠΟΛΗΣ",1.5,0]
["14-27663","ΓΡΑΠΑΤΣΑΣ ΦΑΝΟΥΡΙΟΣ","Σ.Ο.Α.ΚΑΡΔΙΤΣΑΣ ΦΩΚΙΑΝΟΣ",1.5,0]
["14-32926","ΔΕΜΕΡΛΙΩΤΗΣ ΚΩΝΣΤΑΝΤΙΝΟΣ","Ο.Α.ΣΟΦΑΔΩΝ ΚΑΡΔΙΤΣΑΣ",1.5,0]
["14-32431","ΔΙΑΜΑΝΤΟΠΟΥΛΟΣ ΠΑΥΛΟΣ","Ο.Α.ΑΙΓΙΑΛΕΙΑΣ",1.5,0]
["14-35176","ΖΕΡΒΙΔΗΣ ΑΝΤΩΝΙΟΣ","Σ.Α.ΣΕΡΡΩΝ",1.5,0]
["14-31540","ΘΕΟΤΟΚΑΤΟΣ ΓΕΡΑΣΙΜΟΣ","ΚΕΦΑΛΛΗΝΙΑΚΟΣ Ο.Α.",1.5,0]
["14-34593","ΙΩΑΝΝΙΔΗΣ ΜΙΧΑΗΛ","Ε.Α.Σ.ΟΛΥΜΠΙΑΔΑ",1.5,0]
["14-34930","ΚΑΖΑΚΟΣ ΙΑΣΩΝ","Γ.Ο.ΠΕΡΙΣΤΕΡΙΟΥ Γ.ΠΑΛΑΣΚΑΣ",1.5,0]
["14-32968","ΚΑΛΕΝΔΕΡΗΣ ΑΓΓΕΛΟΣ","Ο.Α.ΘΕΣΠΡΩΤΙΑΣ ΤΙΤΑΝΗ",1.5,0]
["14-30286","ΚΑΠΑΡΑΛΙΩΤΗΣ ΜΑΡΙΟΣ","Ο.Α.ΣΑΛΑΜΙΝΑΣ",1.5,0]
["14-34453","ΚΑΡΑΓΙΑΝΝΗΣ ΚΩΝ/ΝΟΣ","Α.Γ.Ο.ΦΙΛΙΠΠΙΑΔΑΣ",1.5,0]
["14-32759","ΚΑΡΑΜΑΝΟΣ ΝΙΚΟΛΑΟΣ","Α.Ο.ΑΙΓΙΟΥ ΜΟΡΕΑΣ",1.5,0]
["14-33705","ΚΑΡΑΜΑΟΥΝΑΣ ΑΡΙΣΤΟΤΕΛΗΣ","ΡΗΓΑΣ Α.Ο.Α.ΑΡΓΟΛΙΔΑΣ",1.5,0]
["14-32836","ΚΕΦΑΛΑΣ ΓΙΩΡΓΟΣ","Ο.Α.ΑΡΤΑΣ",1.5,0]
["14-34658","ΚΟΛΟΒΟΣ ΑΝΔΡΕΑΣ","Μ.Α.Σ.ΑΕΤΟΣ ΘΕΣΣΑΛΟΝΙΚΗΣ",1.5,0]
["14-30538","ΚΟΥΜΑΝΔΡΑΚΗΣ ΝΙΚΟΛΑΟΣ","Ο.Α.ΧΑΝΙΩΝ",1.5,0]
["14-32390","ΚΩΣΤΑΣ ΛΑΜΠΡΟΣ","Α.Γ.Ο.ΦΙΛΙΠΠΙΑΔΑΣ",1.5,0]
["14-34275","ΛΕΥΘΕΡΙΩΤΗΣ ΠΑΝΑΓΙΩΤΗΣ","Α.Ο.ΣΙΚΥΩΝΟΣ ΚΙΑΤΟΥ",1.5,0]
["14-34825","ΛΟΓΟΘΕΤΗΣ ΧΑΡΑΛΑΜΠΟΣ","Γ.Ε.ΠΡΕΒΕΖΑΣ",1.5,0]
["14-32792","ΛΥΤΙΝΑΣ ΚΩΝ/ΝΟΣ","Ο.Α.ΠΤΟΛΕΜΑΪΔΑΣ",1.5,0]
["14-33008","ΜΑΓΚΟΥΤΑΣ ΜΑΡΛΟΝ","Α.Ο.ΚΗΦΙΣΙΑΣ",1.5,0]
["14-28665","ΜΑΜΑΗΣ ΙΩΑΝΝΗΣ","Σ.Α.ΓΑΛΑΤΣΙΟΥ",1.5,0]
["14-33625","ΜΕΓΑΛΙΟΣ ΓΕΩΡΓΙΟΣ","Ο.Α.ΚΑΙΣΑΡΙΑΝΗΣ",1.5,0]
["14-33881","ΜΕΝΤΖΕΛΟΠΟΥΛΟΣ ΦΟΙΒΟΣ","Σ.Α.ΓΑΛΑΤΣΙΟΥ",1.5,0]
["14-32901","ΜΠΑΛΑΤΖΑΡΑΣ ΑΠΟΣΤΟΛΟΣ","Ο.Α.ΝΙΚΑΙΑ ΛΑΡΙΣΑΣ",1.5,0]
["14-32819","ΜΠΑΛΑΤΣΟΣ ΑΛΕΞΑΝΔΡΟΣ","Ο.Α.ΑΡΤΑΣ",1.5,0]
["14-28614","ΜΠΟΥΡΤΖΟΣ ΠΑΝΑΓΙΩΤΗΣ","Α.Ε.Κ.ΤΡΙΠΟΛΗΣ",1.5,0]
["14-35149","ΠΑΝΑΚΑ ΝΕΦΕΛΗ","Ο.Α.ΘΕΣΣΑΛΟΝΙΚΗΣ",1.5,0]
["14-34076","ΠΑΝΤΕΛΙΔΗΣ ΚΩΝ/ΝΟΣ","Ο.Α.ΠΤΟΛΕΜΑΪΔΑΣ",1.5,0]
["14-33451","ΠΑΠΑΔΑΤΟΣ ΝΙΚΟΛΑΟΣ","ΚΕΦΑΛΛΗΝΙΑΚΟΣ Ο.Α.",1.5,0]
["14-33973","ΠΑΠΑΚΩΝΣΤΑΝΤΙΝΟΥ  ΣΠΥΡΟΣ","Α.Ο.ΚΑΒΑΛΑΣ ΜΑΚΕΔΟΝΙΚΟΣ",1.5,0]
["14-33472","ΠΑΠΑΝΔΡΟΥΔΗΣ ΜΙΛΤΙΑΔΗΣ","Ο.Α.ΑΛΕΞΑΝΔΡΟΥΠΟΛΗΣ",1.5,0]
["14-32660","ΠΑΠΑΠΑΝΑΓΙΩΤΟΥ ΑΠΟΛΛΩΝ","Α.Ο.Α.ΠΑΠΑΓΟΥ",1.5,0]
["14-32715","ΠΑΤΡΑΣ ΑΛΚΙΒΙΑΔΗΣ","Α.Ο.Α.ΠΑΠΑΓΟΥ",1.5,0]
["14-33863","ΠΟΛΥΜΕΡΟΠΟΥΛΟΣ ΠΑΝΑΓΙΩΤΗΣ","Α.Ο.Π.ΦΑΛΗΡΟΥ",1.5,0]
["14-34632","ΣΙΓΑΝΟΣ ΕΜΜΑΝΟΥΗΛ","Ο.Α.ΑΓΙΑΣ ΠΑΡΑΣΚΕΥΗΣ",1.5,0]
["14-34828","ΣΠΥΡΙΔΑΚΗΣ ΘΕΟΔΩΡΟΣ","ΚΕΦΑΛΛΗΝΙΑΚΟΣ Ο.Α.",1.5,0]
["14-33927","ΣΥΜΕΩΝΙΔΗΣ ΑΛΕΞΑΝΔΡΟΣ","Α.Ο.Α.ΣΤΑΥΡΟΥΠΟΛΗΣ ΙΦΙΤΟΣ",1.5,0]
["14-31516","ΣΥΡΡΑΚΟΣ ΝΙΚΟΛΑΟΣ","Α.Ο.Π.ΦΑΛΗΡΟΥ",1.5,0]
["14-34560","ΤΣΙΑΤΟΥΡΑΣ ΑΝΤΩΝΗΣ","Γ.Σ.ΛΙΒΥΚΟΣ ΙΕΡΑΠΕΤΡΑΣ",1.5,0]
["14-33780","ΤΣΙΓΓΙΡΟΠΟΥΛΟΣ ΧΡΗΣΤΟΣ","Α.Σ.Α.ΠΑΝΟΡΑΜΑΤΟΣ",1.5,0]
["14-31295","ΧΑΤΖΗΣΤΑΥΡΟΥ ΧΑΡΑΛΑΜΠΟΣ","Ο.Α.ΓΙΑΝΝΙΤΣΩΝ",1.5,0]
["14-34704","ΧΡΗΣΤΑΚΗΣ ΑΝΑΣΤΑΣΙΟΣ","Α.Ο.ΚΑΒΑΛΑΣ ΜΑΚΕΔΟΝΙΚΟΣ",1.5,0]
["14-32805","ΑΒΡΑΜΙΔΗΣ ΓΙΑΝΝΗΣ","Ο.Α.ΑΛΕΞΑΝΔΡΟΣ ΒΕΡΟΙΑΣ",1,0]
["14-35224","ΑΓΓΕΛΟΠΟΥΛΟΣ ΧΡΗΣΤΟΣ","Α.Ο.Α.ΧΑΪΔΑΡΙΟΥ",1,0]
["14-34660","ΑΝΑΣΤΑΣΑΚΗΣ ΝΙΚΗΦΟΡΟΣ","ΠΑΝΕΛΛΗΝΙΟΣ Γ.Σ.",1,0]
["14-32700","ΑΝΤΩΝΑΚΟΣ ΧΑΡΑΛΑΜΠΟΣ","Ο.Α.ΚΕΡΑΤΣΙΝΙΟΥ",1,0]
["14-31868","ΒΑΣΙΛΟΓΛΟΥ ΘΕΟΔΩΡΟΣ","Ο.Α.ΑΡΙΔΑΙΑΣ",1,0]
["14-34281","ΓΕΩΡΓΑΚΟΠΟΥΛΟΣ ΑΓΓΕΛΟΣ-ΤΑΞΙΑΡΧΗΣ","Α.Ο.ΜΕΓΑΣ ΑΛΕΞΑΝΔΡΟΣ",1,0]
["14-32372","ΓΡΗΓΟΡΙΑΔΗΣ ΓΕΩΡΓΙΟΣ","Ο.Α.ΚΑΙΣΑΡΙΑΝΗΣ",1,0]
["14-33188","ΔΙΑΜΑΝΤΟΠΟΥΛΟΣ-ΓΚΑΜΑΛΕΤΣΟΣ ΒΑΣΙΛΕΙΟΣ","Ο.Α.ΙΩΛΚΟΣ ΒΟΛΟΥ",1,0]
["14-31301","ΘΕΟΔΩΡΑΤΟΣ ΔΙΟΝΥΣΙΟΣ","Γ.Σ.ΚΗΦΙΣΙΑΣ",1,0]
["14-34378","ΙΑΤΡΟΥ ΛΕΩΝΙΔΑΣ","Α.Σ.Α.ΠΑΜΒΩΤΙΣ ΙΩΑΝΝΙΝΩΝ",1,0]
["14-33324","ΚΑΛΑΝΤΖΗΣ ΝΙΚΟΛΑΟΣ","Ο.Α.ΘΕΣΠΡΩΤΙΑΣ ΤΙΤΑΝΗ",1,0]
["14-31985","ΚΑΡΑΜΑΝΟΣ ΒΑΣΙΛΕΙΟΣ","Α.Ε.Κ.ΤΡΙΠΟΛΗΣ",1,0]
["14-29480","ΚΑΡΑΠΑΣ ΚΛΕΩΝ","Α.Σ.ΑΚΡΟΠΟΛΙΣ",1,0]
["14-33563","ΚΑΤΩΠΟΔΗΣ ΚΩΝΣΤΑΝΤΙΝΟΣ","Α.Σ.ΠΕΡΑ",1,0]
["14-30872","ΚΑΦΙΡΗΣ ΑΓΓΕΛΟΣ","Α.Ο.Π.ΦΑΛΗΡΟΥ",1,0]
["14-31257","ΚΟΗΣ ΑΝΔΡΕΑΣ","Ο.Α.ΣΥΡΟΥ",1,0]
["14-35160","ΚΟΛΙΟΠΟΥΛΟΣ ΣΠΥΡΙΔΩΝ","Α.Ο.Α.ΑΤΤΙΚΟΣ ΗΛΙΟΣ",1,0]
["14-30205","ΚΟΝΟΠΙΣΗΣ ΒΑΣΙΛΕΙΟΣ","ΡΗΓΑΣ Α.Ο.Α.ΑΡΓΟΛΙΔΑΣ",1,0]
["14-33401","ΚΟΥΤΑΛΑΚΗΣ ΝΙΚΟΛΑΟΣ-ΑΡΗΣ","Α.Ο.Α.ΑΤΤΙΚΟΣ ΗΛΙΟΣ",1,0]
["14-31504","ΚΟΥΤΣΟΧΙΩΝΗΣ ΟΔΥΣΣΕΑΣ","ΦΙΛΑΘΛΗΤ.ΣΥΛ.ΛΑΜΙΑΣ",1,0]
["14-35024","ΚΡΩΦΟΡΝΤ ΘΩΜΑΣ-ΛΩΡΕΝΣ","Α.Ο.Α.ΑΤΤΙΚΟΣ ΗΛΙΟΣ",1,0]
["14-30750","ΛΑΪΝΑΣ ΓΕΩΡΓΙΟΣ-ΝΙΚΟΛΑΟΣ","Α.Ε.Τ.ΝΙΚΗ ΠΑΤΡΩΝ",1,0]
["14-35116","ΛΑΦΙΑΤΗΣ ΕΥΣΤΡΑΤΙΟΣ","Ο.Α.ΑΘΗΝΩΝ",1,0]
["14-32432","ΛΙΟΛΙΟΣ ΝΙΚΟΛΑΟΣ","Ο.Α.ΑΙΓΙΑΛΕΙΑΣ",1,0]
["14-29819","ΛΟΥΡΔΑΣ ΝΙΚΟΛΑΟΣ","Α.Ο.ΑΡΓΥΡΟΥΠΟΛΗΣ",1,0]
["14-35231","ΜΑΪΧΟΣ ΑΛΕΞΑΝΔΡΟΣ","Α.Ο.Α.ΧΑΪΔΑΡΙΟΥ",1,0]
["14-30530","ΜΑΥΡΟΜΜΑΤΗΣ ΚΩΝΣΤΑΝΤΙΝΟΣ","Ο.Α.ΧΑΝΙΩΝ",1,0]
["14-33318","ΜΟΥΡΣΕΛΑΣ ΑΘΑΝΑΣΙΟΣ","Ο.Α.ΠΕΙΡΑΙΑ",1,0]
["14-33160","ΜΠΑΡΚΑΣ ΙΑΣΟΝΑΣ","Ο.Α.ΙΩΑΝΝΙΝΩΝ",1,0]
["14-34706","ΜΠΙΛΛΙΑΣ ΘΕΟΔΩΡΟΣ","Σ.Α.ΘΕΣΣΑΛΟΝΙΚΗΣ",1,0]
["14-34915","ΜΠΟΖΟΝΕΛΟΣ ΠΑΝΟΣ-ΗΛΙΑΣ","Α.Ο.ΓΛΥΦΑΔΑΣ ΦΙΛΙΑ 2000",1,0]
["14-33930","ΝΑΣΙΑΚΟΣ ΔΗΜΗΤΡΗΣ","Α.Π.Ο.ΣΑΝΝΥ ΣΠΟΡΤΣ ΚΛΑΜΠ",1,0]
["14-33358","ΞΕΦΤΕΡΗ ΕΛΕΝΗ-ΕΙΡΗΝΗ","Α.Α.ΑΛΜΠΑΤΡΟΣ",1,0]
["14-33393","ΞΥΝΟΣ ΑΘΑΝΑΣΙΟΣ","Ο.Α.ΠΤΟΛΕΜΑΪΔΑΣ",1,0]
["14-33849","ΟΞΥΖΟΓΛΟΥ ΑΝΤΩΝΗΣ","Α.Κ.Α.ΜΑΡΑΘΩΝΑ",1,0]
["14-35043","ΠΑΝΑΓΗΣ ΕΜΜΑΝΟΥΗΛ","Α.Ο.Α.ΗΛΙΟΥΠΟΛΗΣ",1,0]
["14-34518","ΠΑΠΑΔΟΠΟΥΛΟΣ ΔΗΜΗΤΡΗΣ","Ο.Α.ΡΙΟΥ",1,0]
["14-34518","ΠΑΠΑΔΟΠΟΥΛΟΣ ΔΗΜΗΤΡΗΣ","Ο.Α.ΡΙΟΥ",1,0]
["14-34138","ΠΑΠΑΔΟΠΟΥΛΟΣ ΘΕΟΔΩΡΟΣ","Ο.Α.ΚΟΥΦΑΛΙΩΝ ΘΕΣΣΑΛΟΝΙΚΗΣ",1,0]
["14-33370","ΠΑΠΑΚΩΝΣΤΑΝΤΙΝΟΥ ΜΑΡΙΟΣ-ΧΡΗΣΤΟΣ","ΛΑΡΙΣΑΪΚΟΣ Ο.Α.",1,0]
["14-30917","ΠΑΥΛΙΔΗΣ ΚΩΝΣΤΑΝΤΙΝΟΣ","Ο.Α.ΤΟΥΜΠΑΣ",1,0]
["14-32931","ΠΕΤΡΑΚΗΣ ΓΙΩΡΓΟΣ","Ο.Α.ΣΟΥΔΑΣ",1,0]
["14-32186","ΡΗΓΟΥΤΣΟΣ ΣΕΒΑΣΤΙΑΝΟΣ","Ο.Α.ΣΥΡΟΥ",1,0]
["14-34040","ΣΑΒΑΛΙΟ ΜΑΡΙΟ","Ο.Α.ΚΕΡΚΥΡΑΣ",1,0]
["14-29388","ΣΑΛΓΚΑΜΗΣ ΔΑΝΙΗΛ","Α.Σ.Α.ΛΑΡΙΣΑΣ",1,0]
["14-30277","ΣΔΡΑΚΑΣ ΚΩΝΣΤΑΝΤΙΝΟΣ","Ο.Α.ΣΠΑΡΤΗΣ",1,0]
["14-33309","ΣΔΡΟΛΑΣ ΣΤΑΥΡΟΣ","Ο.Α.ΧΟΛΑΡΓΟΥ",1,0]
["14-34695","ΣΙΑΝΗΣ ΘΑΝΑΣΗΣ","ΠΑΝΕΛΛΗΝΙΟΣ Γ.Σ.",1,0]
["14-34168","ΣΙΔΕΡΙΔΗΣ ΔΗΜΗΤΡΙΟΣ-ΞΕΝΟΦΩΝ","Α.Ο.ΑΤΡΟΜΗΤΟΣ ΤΡΙΑΔΙΟΥ",1,0]
["14-34263","ΣΤΙΓΚΑΣ ΑΝΔΡΕΑΣ","Α.Σ.Α.ΑΓΡΙΝΙΟΥ",1,0]
["14-33926","ΣΥΜΕΩΝΙΔΗΣ ΙΑΣΩΝ","Α.Ο.Α.ΣΤΑΥΡΟΥΠΟΛΗΣ ΙΦΙΤΟΣ",1,0]
["14-35155","ΤΖΩΡΤΖΗΣ ΚΥΡΙΑΚΟΣ","Α.Ο.ΒΑΡΗΣ ΑΝΑΓΥΡΟΥΣ",1,0]
["14-34218","ΤΡΑΚΑΣ ΧΡΗΣΤΟΣ","Α.Ο.ΚΑΛΛΙΤΕΧΝΟΥΠΟΛΗΣ",1,0]
["14-90135","ΤΡΝΙΝΙΤΣ ΝΙΚΟΛΑ","Ο.Α.ΧΕΡΣΟΝΗΣΟΥ",1,0]
["14-32084","ΤΣΑΛΑΣ ΓΙΑΝΝΗΣ","Ο.Α.ΑΓΙΩΝ ΑΝΑΡΓΥΡΩΝ",1,0]
["14-30153","ΤΣΙΑΜΑΣ ΑΘΑΝΑΣΙΟΣ","Α.Ε.Κ.ΤΡΙΠΟΛΗΣ",1,0]
["14-30152","ΤΣΙΑΜΑΣ ΝΙΚΟΣ","Α.Ε.Κ.ΤΡΙΠΟΛΗΣ",1,0]
["14-34647","ΦΛΩΡΟΠΟΥΛΟΣ ΧΡΙΣΤΟΦΟΡΟΣ","Α.Ο.Α.ΠΑΠΑΓΟΥ",1,0]
["14-30445","ΦΡΑΪΔΑΚΗΣ ΜΑΝΟΛΗΣ","Ο.Α.ΡΕΘΥΜΝΟΥ",1,0]
["14-34006","ΧΑΤΖΗΣΑΒΒΑΣ ΧΡΗΣΤΟΣ","Ε.Α.Σ.ΟΛΥΜΠΙΑΔΑ",1,0]
["14-30741","ΧΟΛΕΒΑΣ  ΑΘΑΝΑΣΙΟΣ ","Ο.Α.ΑΙΓΙΑΛΕΙΑΣ",1,0]
["14-34517","ΧΟΥΣΟΣ ΠΑΝΑΓΙΩΤΗΣ","Ο.Α.ΡΙΟΥ",1,0]
["14-30819","ΑΛΕΞΙΟΥ ΑΓΓΕΛΟΣ","Α.Ε.Τ.ΝΙΚΗ ΠΑΤΡΩΝ",0.5,0]
["14-34318","ΓΛΕΝΤΗΣ ΔΗΜΗΤΡΗΣ","Ο.Α.ΑΓΙΑΣ ΠΑΡΑΣΚΕΥΗΣ",0.5,0]
["14-29484","ΙΩΑΝΝΙΔΟΥ ΣΤΕΛΛΑ","Ο.Α.ΚΙΛΚΙΣ",0.5,0]
["14-30500","ΚΑΡΑΓΙΑΝΝΗΣ ΠΑΝΑΓΙΩΤΗΣ","Σ.Φ.Α.ΜΕΛΙΣΣΙΩΝ Ο ΦΟΙΒΟΣ",0.5,0]
["14-28652","ΚΟΡΚΟΜΤΖΕΛΟΣ ΒΑΣΙΛΕΙΟΣ","Α.Ο.Α.ΗΛΙΟΥΠΟΛΗΣ",0.5,0]
["14-34972","ΛΟΥΚΟΠΟΥΛΟΣ ΓΕΩΡΓΙΟΣ","Ο.Α.ΑΙΓΙΑΛΕΙΑΣ",0.5,0]
["14-30870","ΜΕΡΙΧΩΡΙΤΗΣ ΙΩΑΝΝΗΣ","Α.Ο.Π.ΦΑΛΗΡΟΥ",0.5,0]
["14-32825","ΝΟΜΙΚΟΣ ΠΑΝΤΕΛΗΣ","Ο.Α.ΣΑΛΑΜΙΝΑΣ",0.5,0]
["14-34971","ΠΑΠΑΓΙΑΝΑΚΟΠΟΥΛΟΣ ΝΙΚΟΛΑΟΣ","Ο.Α.ΑΙΓΙΑΛΕΙΑΣ",0.5,0]
["14-32954","ΣΑΛΠΑΣ ΠΕΤΡΟΣ","Σ.Φ.Α.ΜΕΛΙΣΣΙΩΝ Ο ΦΟΙΒΟΣ",0.5,0]
["14-32739","ΣΤΑΥΡΟΠΟΥΛΟΣ ΓΕΩΡΓΙΟΣ","Α.Ο.Α.ΗΛΙΟΥΠΟΛΗΣ",0.5,0]
["14-34711","ΤΡΙΑΝΤΑΦΥΛΛΙΔΟΥ ΜΑΡΙΑ","Ο.Α.ΚΙΛΚΙΣ",0.5,0]
["14-28363","ΤΡΟΧΟΠΟΥΛΟΣ ΓΕΩΡΓΙΟΣ","Ο.Α.ΒΙΚΕΛΑΣ ΒΕΡΟΙΑΣ",0.5,0]
["14-28364","ΤΡΟΧΟΠΟΥΛΟΣ ΙΣΑΑΚ-ΕΛΙΣΣΑΙΟΣ","Ο.Α.ΒΙΚΕΛΑΣ ΒΕΡΟΙΑΣ",0.5,0]
["14-34708","ΤΣΑΚΜΑΚΙΔΗΣ ΑΠΟΣΤΟΛΟΣ","Σ.Α.ΘΕΣΣΑΛΟΝΙΚΗΣ",0.5,0]
["14-32482","ΒΑΣΙΟΣ ΚΩΝΣΤΑΝΤΙΝΟΣ-ΜΙΧΑΗΛ","Ο.Α.ΒΟΥΛΙΑΓΜΕΝΗΣ ΜΙΚΡΟΙ ΑΣΣΟΙ",0,0]
["14-32487","ΓΑΪΤΑΝΑΡΟΣ ΤΗΛΕΜΑΧΟΣ","Γ.Ε.ΠΡΕΒΕΖΑΣ",0,0]
["14-30921","ΓΑΚΙΔΗΣ ΧΡΗΣΤΟΣ-ΣΩΤΗΡΙΟΣ","Ο.Π.ΘΕΣΣΑΛΟΝΙΚΗΣ ΜΑΚΕΔΟΝΙΑ 92",0,0]
["14-30603","ΔΕΛΗΣΤΑΘΗΣ ΚΩΝΣΤΑΝΤΙΝΟΣ","Ο.Α.ΜΑΓΝΗΣΙΑΣ",0,0]
["14-31462","ΜΑΡΓΙΩΛΑΣ ΣΤΕΡΓΙΟΣ","Γ.Σ.ΕΛΕΥΘΕΡΙΟΥ ΚΟΡΔ.ΑΡΓΟΝΑΥΤΕΣ",0,0]
["14-33605","ΜΙΧΑΛΟΠΟΥΛΟΣ ΑΛΕΞΑΝΔΡΟΣ","ΚΕΡΚΥΡΑΪΚΗ Λ.Τ.",0,0]
["14-28555","ΜΠΑΡΔΟΥΛΗΣ ΑΠΟΣΤΟΛΟΣ","Ο.Α.ΞΥΛΟΚΑΣΤΡΟΥ ΣΥΘΑΣ",0,0]
["14-33460","ΠΑΓΓΕΣ ΒΑΣΙΛΕΙΟΣ","Γ.Ε.ΠΡΕΒΕΖΑΣ",0,0]
["14-32467","ΠΑΠΑΔΗΜΗΤΡΙΟΥ ΕΡΜΗΣ","Α.Ο.Α.ΗΛΙΟΥΠΟΛΗΣ",0,0]
["14-34462","ΠΕΤΣΟΥΚΗΣ ΓΕΩΡΓΙΟΣ","Α.Γ.Ο.ΦΙΛΙΠΠΙΑΔΑΣ",0,0]
["14-34498","ΧΡΙΣΤΟΔΟΥΛΟΠΟΥΛΟΣ ΔΗΜΟΣΘΕΝΗΣ","Α.Α.ΑΙΓΑΛΕΩ",0,0]
["14-34487","ΜΟΥΣΤΑΚΗΣ ΙΑΣΩΝ","Α.Ο.Α.ΠΑΤΡΩΝ",0,0]
["14-32743","ΚΑΝΕΛΛΟΠΟΥΛΟΣ ΔΗΜΗΤΡΗΣ","Ο.Α.ΓΛΥΦΑΔΑΣ",0,0]
["14-34099","ΜΑΪΣΤΡΟΣ ΚΩΝΣΤΑΝΤΙΝΟΣ","Ο.Α.ΧΟΛΑΡΓΟΥ",0,0]
["14-30800","ΜΑΡΙΝΟΣ ΝΙΚΟΛΑΟΣ","Ο.Α.ΠΕΤΡΟΥΠΟΛΗΣ",0,0]
["14-33864","ΝΑΝΟΥΡΗΣ ΓΕΩΡΓΙΟΣ","Ο.Α.ΚΑΙΣΑΡΙΑΝΗΣ",0,0]
["14-31433","ΡΗΓΑΣ ΑΘΑΝΑΣΙΟΣ","Ο.Α.ΒΡΙΛΗΣΣΙΩΝ",0,0]
["14-30066","ΣΕΚΛΕΙΖΙΩΤΗΣ ΒΑΣΙΛΗΣ","Ο.Α.ΚΕΡΑΤΣΙΝΙΟΥ",0,0]
["14-29586","ΣΙΟΥΛΗΣ ΒΑΣΙΛΗΣ","Α.Ο.ΜΕΓΑΣ ΑΛΕΞΑΝΔΡΟΣ",0,0]
["14-33716","ΤΡΙΑΝΤΑΦΥΛΛΙΔΗΣ ΑΚΗΣ-ΝΙΚΟΛΑΟΣ","Α.Σ.ΠΕΡΑ",0,0]
["14-26409","ΚΟΥΜΠΑΡΟΣ ΙΩΑΝΝΗΣ","Α.Ο.Α.ΠΡΩΤΑΘΛ.ΚΑΒΑΛΑΣ",0,0]
["14-30874","ΛΙΑΚΑΤΣΙΔΑΣ ΙΩΑΝΝΗΣ","Α.Ο.Π.ΦΑΛΗΡΟΥ",0,0]
["14-31644","ΜΠΕΛΛΟΣ ΝΙΚΟΛΑΣ","Α.Σ.ΠΕΡΑ",0,0]
["16-25438","ΤΣΙΤΣΙΠΑΣ ΣΤΕΦΑΝΟΣ","Ο.Α.ΓΛΥΦΑΔΑΣ",1270,0]
["16-23775","ΑΝΤΩΝΟΠΟΥΛΟΣ ΧΡΗΣΤΟΣ","Ο.Α.ΚΕΡΑΤΣΙΝΙΟΥ",1180,0]
["16-24845","ΗΛΙΟΠΟΥΛΟΣ ΒΑΣΙΛΗΣ","Α.Ο.Α.ΦΙΛΟΘΕΗΣ",1030,0]
["16-23517","ΤΣΙΡΑΝΙΔΗΣ ΕΥΣΤΑΘΙΟΣ","Ο.Α.ΚΑΣΤΟΡΙΑΣ ΚΕΛΕΤΡΟΝ",870,0]
["16-25875","ΛΑΖΑΡΙΔΗΣ ΚΩΝΣΤΑΝΤΙΝΟΣ","Ο.Α.ΕΥΟΣΜΟΥ ΘΕΣΣΑΛΟΝΙΚΗΣ",654,0]
["16-26317","ΚΩΣΤΑΡΑΣ ΠΑΝΑΓΙΩΤΗΣ","Ο.Α.ΠΕΤΡΟΥΠΟΛΗΣ",646,0]
["16-24547","ΜΑΝΕΚΑΣ ΑΘΑΝΑΣΙΟΣ","Ο.Α.ΙΩΑΝΝΙΝΩΝ",570,0]
["16-27951","ΣΚΟΡΙΛΑΣ ΑΛΕΞΑΝΔΡΟΣ","ΑΚΑΔ.ΑΝΤΙΣΦ.ΙΩΑΝΝΙΝΩΝ",520,0]
["16-25297","ΚΑΠΙΡΗΣ ΣΤΑΜΑΤΗΣ","Α.Ο.Α.ΗΛΙΟΥΠΟΛΗΣ",506,0]
["16-26297","ΑΓΙΟΥΣ ΓΕΩΡΓΙΟΣ","ΚΕΡΚΥΡΑΪΚΗ Λ.Τ.",505,0]
["16-23040","ΚΑΤΣΑΛΗΣ ΚΩΝΣΤΑΝΤΙΝΟΣ","Ο.Α.ΛΙΤΟΧΩΡΟΥ",470,0]
["16-30186","ΠΙΤΣΙΝΗΣ ΔΗΜΗΤΡΙΟΣ","Ο.Α.ΚΕΡΑΤΣΙΝΙΟΥ",440,0]
["16-27180","ΣΤΑΥΡΑΚΑΣ ΜΙΝΩΣ-ΚΙΜΩΝ","Α.Ο.ΚΗΦΙΣΙΑΣ",390,0]
["16-26190","ΑΝΔΡΩΝΗΣ ΙΩΑΝΝΗΣ","Ο.Α.ΑΓΙΑΣ ΠΑΡΑΣΚΕΥΗΣ",344,0]
["16-22876","ΓΕΡΟΥΚΗΣ ΒΑΣΙΛΕΙΟΣ","Ο.Α.ΝΙΚΑΙΑ ΛΑΡΙΣΑΣ",344,0]
["16-26459","ΝΑΟΥΜ ΣΠΥΡΙΔΩΝ","Ο.Α.ΧΑΝΙΩΝ",333,0]
["16-22866","ΚΟΝΤΟΠΟΥΛΟΣ ΘΕΟΦΑΝΗΣ","Ο.Α.ΚΕΡΑΤΣΙΝΙΟΥ",314,0]
["16-28405","ΚΑΡΔΑΡΗΣ ΑΝΔΡΕΑΣ","Ο.Α.ΑΘΗΝΩΝ",261,0]
["16-26389","ΒΑΡΔΑΚΗΣ ΒΑΣΙΛΕΙΟΣ","ΑΚΑΔ.ΑΝΤΙΣΦ.ΙΩΑΝΝΙΝΩΝ",254,0]
["16-26457","ΑΡΕΤΑΚΗΣ ΙΩΑΝΝΗΣ","Ο.Α.ΧΑΝΙΩΝ",247,0]
["16-29817","ΝΙΑΡΧΟΣ ΝΙΚΗΤΑΣ","Ο.Α.ΑΘΛΗΤ.ΠΑΙΔΕΙΑ",246,0]
["16-26533","ΖΕΡΔΙΛΑΣ ΑΙΤΟΡ","Ο.Α.ΠΕΤΡΟΥΠΟΛΗΣ",237,0]
["16-24168","ΜΙΧΑΗΛΟΣ ΣΤΕΦΑΝΟΣ","ΗΡΑΚΛΕΙΟ Ο.Α.& Α.",236,0]
["16-27879","ΚΙΣΣΑΣ ΧΡΗΣΤΟΣ-ΕΥΑΓΓΕΛΟΣ","Α.Ο.ΣΙΚΥΩΝΟΣ ΚΙΑΤΟΥ",234,0]
["16-27398","ΚΟΤΣΑΡΙΝΗΣ ΒΑΣΙΛΕΙΟΣ","Α.Γ.Ο.ΦΙΛΙΠΠΙΑΔΑΣ",232,0]
["16-25296","ΣΠΑΘΗΣ ΜΑΡΙΝΟΣ","Ο.Α.ΑΘΗΝΩΝ",230,0]
["16-28144","ΚΑΛΑΜΠΑΚΑΣ ΑΝΑΣΤΑΣΙΟΣ","Ο.Α.ΦΟΙΒΟΣ ΛΑΡΙΣΑΣ",226,0]
["16-28426","ΦΩΤΕΙΝΟΠΟΥΛΟΣ ΙΩΑΝΝΗΣ","Α.Ο.Α.ΗΛΙΟΥΠΟΛΗΣ",222,0]
["16-27583","ΠΑΧΑΚΗΣ ΝΙΚΟΛΑΟΣ-ΑΝΔΡΕΑΣ","Ο.Α.ΑΘΗΝΩΝ",219,0]
["16-25351","ΔΙΑΜΑΝΤΟΠΟΥΛΟΣ ΓΙΩΡΓΟΣ","Ο.Α.ΑΘΗΝΩΝ",214,0]
["16-27656","ΝΑΣΙΟΠΟΥΛΟΣ ΓΕΩΡΓΙΟΣ","Ο.Α.ΑΘΗΝΩΝ",214,0]
["16-29274","ΣΗΜΑΙΟΦΟΡΙΔΗΣ ΧΑΡΑΛΑΜΠΟΣ","ΠΕΥΚΗ Γ.ΚΑΛΟΒΕΛΩΝΗΣ",212,0]
["16-23091","ΝΙΚΟΛΟΥΛΗΣ ΚΩΝΣΤΑΝΤΙΝΟΣ","Ο.Α.ΝΙΚΑΙΑ ΛΑΡΙΣΑΣ",198,0]
["16-24511","ΙΩΑΝΝΙΔΗΣ ΝΙΚΟΛΑΟΣ","Α.Ο.Α.ΦΙΛΟΘΕΗΣ",192,0]
["16-27371","ΤΣΙΤΣΙΠΑΣ ΠΕΤΡΟΣ","Ο.Α.ΓΛΥΦΑΔΑΣ",188,0]
["16-28357","ΕΞΙΖΙΔΗΣ-ΜΑΓΙΕΡ ΤΕΪΛΟΡ","Ο.Α.ΑΛΕΞΑΝΔΡΟΣ ΒΕΡΟΙΑΣ",181,0]
["16-24171","ΚΕΛΑΪΔΗΣ ΚΑΡΛΟΣ","Ο.Α.ΓΛΥΦΑΔΑΣ",168,0]
["16-23093","ΚΑΛΔΕΡΩΝ ΖΑΚ","Ο.Α.ΝΙΚΑΙΑ ΛΑΡΙΣΑΣ",162,0]
["16-28083","ΧΡΙΣΤΟΔΟΥΛΟΥ ΒΕΛΙΣΣΑΡΙΟΣ","Α.Ο.Α.ΦΙΛΟΘΕΗΣ",158,0]
["16-27841","ΠΑΠΑΪΩΑΝΝΟΥ ΟΔΥΣΣΕΑΣ","Α.Ο.Α.ΣΤΑΥΡΟΥΠΟΛΗΣ ΙΦΙΤΟΣ",157,0]
["16-26836","ΦΟΥΖΑΣ ΑΝΑΣΤΑΣΙΟΣ","ΠΕΥΚΗ Γ.ΚΑΛΟΒΕΛΩΝΗΣ",157,0]
["16-28020","ΛΥΜΠΕΡΗΣ ΑΛΕΞΑΝΔΡΟΣ","Α.Ο.Α.ΦΙΛΟΘΕΗΣ",156,0]
["16-25502","ΣΩΤΗΡΟΠΟΥΛΟΣ ΔΗΜΗΤΡΙΟΣ","Ο.Α.ΜΑΓΝΗΣΙΑΣ",153,0]
["16-22842","ΤΣΑΡΚΝΙΑΣ ΣΤΕΡΓΙΟΣ","Ο.Α.ΑΡΙΔΑΙΑΣ",151,0]
["16-23491","ΤΣΑΡΚΝΙΑΣ ΝΙΚΟΛΑΟΣ","Ο.Α.ΑΡΙΔΑΙΑΣ",146,0]
["16-28084","ΙΩΑΝΝΙΔΗΣ ΠΕΤΡΟΣ","Α.Ο.Α.ΦΙΛΟΘΕΗΣ",144,0]
["16-28356","ΕΞΙΖΙΔΗΣ-ΜΑΓΙΕΡ ΤΖΕΪΣΟΝ-ΒΙΛΛΥ","Ο.Α.ΑΛΕΞΑΝΔΡΟΣ ΒΕΡΟΙΑΣ",141,0]
["16-29711","ΜΠΙΛΛΗΣ ΑΘΑΝΑΣΙΟΣ","ΠΕΥΚΗ Γ.ΚΑΛΟΒΕΛΩΝΗΣ",141,0]
["16-25295","ΣΒΗΓΚΑΣ ΠΑΝΑΓΙΩΤΗΣ","Α.Ο.Α.ΗΛΙΟΥΠΟΛΗΣ",140,0]
["16-26427","ΦΡΙΣΗΡΑΣ ΣΤΕΦΑΝΟΣ","Ο.Α.ΑΘΛΗΤ.ΠΑΙΔΕΙΑ",139,0]
["16-28337","ΚΑΪΜΑΡΑΣ ΧΡΗΣΤΟΣ","Α.Κ.Α.ΜΑΡΑΘΩΝΑ",136,0]
["16-28465","ΚΟΥΔΟΥΝΑΣ ΜΙΛΤΙΑΔΗΣ","Α.Ο.Α.ΦΙΛΟΘΕΗΣ",131,0]
["16-28689","ΚΑΛΛΙΤΣΗΣ ΚΩΝΣΤΑΝΤΙΝΟΣ","Ο.Α.ΑΓΙΑΣ ΠΑΡΑΣΚΕΥΗΣ",129,0]
["16-22656","ΤΖΩΡΤΖΟΣ ΣΤΑΥΡΟΣ","Α.Ο.Α.ΣΤΑΥΡΟΥΠΟΛΗΣ ΙΦΙΤΟΣ",125,0]
["16-29888","ΤΡΙΚΚΑΣ-ΨΩΜΑΣ ΝΙΚΟΛΑΟΣ","Α.Σ.ΤΕΝΙΣ ΚΛΑΜΠ ΚΟΖΑΝΗΣ",124,0]
["16-30411","ΔΑΓΚΛΗΣ ΧΡΗΣΤΟΣ-ΠΑΝΑΓΙΩΤΗΣ","Ο.Α.ΦΟΙΒΟΣ ΛΑΡΙΣΑΣ",120,0]
["16-26338","ΚΥΡΙΑΚΑΚΗΣ-ΜΕΣΣΑΡΙΤΑΚΗΣ ΓΕΩΡΓΙΟΣ","ΗΡΑΚΛΕΙΟ Ο.Α.& Α.",119,0]
["16-31213","ΦΡΑΓΚΙΣΤΑΣ ΕΥΑΓΓΕΛΟΣ","Α.Ο.ΒΟΥΛΙΑΓΜΕΝΗΣ",117,0]
["16-28285","ΠΗΛΙΟΥΝΗΣ ΜΙΧΑΗΛ","Ο.Α.ΑΘΗΝΩΝ",114,0]
["16-26507","ΜΑΓΚΛΑΡΑΣ ΕΥΑΓΓΕΛΟΣ","Α.Γ.Ο.ΦΙΛΙΠΠΙΑΔΑΣ",113,0]
["16-28575","ΨΑΡΙΑΔΗΣ ΜΙΧΑΛΗΣ","Ο.Α.ΑΙΓΙΑΛΕΙΑΣ",113,0]
["16-29726","ΜΙΣΔΡΑΧΗΣ ΛΕΑΝΔΡΟΣ","Ο.Α.ΦΟΙΒΟΣ ΛΑΡΙΣΑΣ",111,0]
["16-90102","ΤΣΙΚΟΒ ΑΛΕΞΑΝΔΡΟΣ","ΖΑΚΥΝΘΙΝΟΣ Α.Ο.Α",111,0]
["16-29789","ΤΣΟΜΛΕΚΤΣΟΓΛΟΥ ΝΙΚΟΛΑΟΣ","Α.Ο.Α.ΦΙΛΟΘΕΗΣ",109,0]
["16-24506","ΖΙΩΓΑΣ ΑΛΕΞΑΝΔΡΟΣ","Ο.Α.ΑΡΤΑΣ",106,0]
["16-25046","ΣΑΡΑΜΑΝΤΙΤΣ ΠΑΥΛΟΣ","Ο.Α.ΕΥΟΣΜΟΥ ΘΕΣΣΑΛΟΝΙΚΗΣ",106,0]
["16-29372","ΚΟΤΖΑΜΑΝΗΣ ΝΙΚΟΛΑΟΣ","ΠΕΥΚΗ Γ.ΚΑΛΟΒΕΛΩΝΗΣ",104,0]
["16-31303","ΚΟΥΤΡΟΥΜΠΗΣ ΝΙΚΟΛΑΟΣ","ΠΕΥΚΗ Γ.ΚΑΛΟΒΕΛΩΝΗΣ",104,0]
["16-25238","ΤΖΕΛΑΤΗΣ ΣΤΕΦΑΝΟΣ","Α.Κ.Α.ΜΑΡΑΘΩΝΑ",104,0]
["16-28588","ΑΓΓΕΛΟΠΟΥΛΟΣ ΜΙΛΤΙΑΔΗΣ","ΠΕΥΚΗ Γ.ΚΑΛΟΒΕΛΩΝΗΣ",103,0]
["16-24340","ΧΟΝΔΡΟΣ ΙΑΣΩΝ-ΣΤΥΛΙΑΝΟΣ","Ο.Α.ΚΕΡΑΤΣΙΝΙΟΥ",101,0]
["16-30044","ΠΕΝΤΟΥΣΗΣ ΠΑΡΙΣ","Ο.Α.ΘΕΣΣΑΛΟΝΙΚΗΣ",100,0]
["16-24115","ΝΤΑΝΤΙΝΗΣ ΑΓΓΕΛΟΣ","Ο.Α.ΡΙΟΥ",96,0]
["16-30018","ΣΠΗΛΙΩΤΟΠΟΥΛΟΣ ΑΓΓΕΛΟΣ","Ο.Α.ΠΕΤΡΟΥΠΟΛΗΣ",96,0]
["16-32270","ΠΙΓΓΟΣ ΓΕΩΡΓΙΟΣ","Ο.Α.ΕΥΟΣΜΟΥ ΘΕΣΣΑΛΟΝΙΚΗΣ",95,0]
["16-31084","ΧΑΛΚΙΔΗΣ ΘΕΟΔΩΡΟΣ","Ο.Α.ΕΥΟΣΜΟΥ ΘΕΣΣΑΛΟΝΙΚΗΣ",95,0]
["16-27690","ΣΠΥΡΟΠΟΥΛΟΣ ΑΘΑΝΑΣΙΟΣ","Α.Ο.Α.ΦΙΛΟΘΕΗΣ",94,0]
["16-29258","ΜΠΑΛΤΑΓΙΑΝΝΗΣ ΝΙΚΟΛΑΟΣ","Ο.Α.ΝΙΚΑΙΑ ΛΑΡΙΣΑΣ",92,0]
["16-28153","ΤΣΙΒΟΥΡΑΚΗΣ ΑΝΤΩΝΙΟΣ","Ο.Α.ΧΑΝΙΩΝ",91,0]
["16-28866","ΣΤΕΡΓΙΟΥΛΑΣ ΧΡΗΣΤΟΣ-ΜΑΡΙΟΣ","Ο.Α.ΜΑΓΝΗΣΙΑΣ",90,0]
["16-29577","ΚΟΣΜΑΣ ΑΡΙΣΤΕΙΔΗΣ","Α.Σ.Α.ΠΑΝΟΡΑΜΑΤΟΣ",88,0]
["16-26859","ΣΙΟΝΤΗΣ ΒΑΣΙΛΕΙΟΣ","ΑΚΑΔ.ΑΝΤΙΣΦ.ΙΩΑΝΝΙΝΩΝ",85,0]
["16-32250","ΖΟΥΓΛΗΣ ΗΡΑΚΛΗΣ","ΝΑΥΠΛΙΑΚΟΣ Ο.Α.",82,0]
["16-26385","ΒΟΥΛΓΑΡΑΚΗΣ ΕΛΕΥΘΕΡΙΟΣ","Ο.Α.ΣΟΥΔΑΣ",80,0]
["16-33604","ΤΖΩΡΤΖΗΣ ΚΩΝΣΤΑΝΤΙΝΟΣ","Α.Ο.Α.ΧΑΪΔΑΡΙΟΥ",79,0]
["16-29626","ΒΑΡΕΛΗΣ ΝΙΚΟΛΑΟΣ","Ο.Α.ΚΕΡΚΥΡΑΣ",76,0]
["16-28874","ΒΡΕΤΤΟΣ ΣΤΕΦΑΝΟΣ","Α.Ο.Α.ΦΙΛΟΘΕΗΣ",76,0]
["16-28512","ΚΑΡΑΜΗΤΡΟΥΣΗΣ ΑΝΤΩΝΙΟΣ","Α.Ο.Α.ΠΟΣΕΙΔΩΝ ΘΕΣΣΑΛΟΝΙΚΗΣ",76,0]
["16-27871","ΠΟΥΛΑΚΗΣ ΜΙΛΤΙΑΔΗΣ","Ο.Α.ΚΑΒΑΛΑΣ ΑΛΕΞΑΝΔΡΟΣ",76,0]
["16-29812","ΣΤΑΥΡΟΥ ΕΛΕΥΘΕΡΙΟΣ-ΕΜΜΑΝΟΥΗΛ","Ο.Α.ΘΕΣΠΡΩΤΙΑΣ ΤΙΤΑΝΗ",74,0]
["16-26547","ΚΟΚΟΤΣΑΚΗΣ ΑΛΚΙΝΟΟΣ","Α.Ο.Α.ΗΛΙΟΥΠΟΛΗΣ",73,0]
["16-25395","ΧΑΡΙΤΩΝΙΔΗΣ ΧΑΡΙΤΩΝ","Α.Ο.ΑΡΓΥΡΟΥΠΟΛΗΣ",70,0]
["16-28653","ΚΑΡΑΓΙΑΝΝΗΣ ΜΙΧΑΛΗΣ","ΝΑΥΠΛΙΑΚΟΣ Ο.Α.",69,0]
["16-26037","ΠΑΠΑΚΩΝΣΤΑΝΤΙΝΟΥ ΜΑΡΙΟΣ","Α.Ο.Α.ΦΙΛΟΘΕΗΣ",68,0]
["16-29651","ΝΙΚΟΛΑΚΑΚΗΣ ΙΩΑΝΝΗΣ","ΗΡΑΚΛΕΙΟ Ο.Α.& Α.",67,0]
["16-26893","ΤΑΞΙΑΡΧΟΥ ΠΟΛΥΧΡΟΝΙΟΣ","ΦΘΙΩΤΙΚΟΣ Ο.Α.",67,0]
["16-28259","ΝΙΚΟΛΑΚΟΠΟΥΛΟΣ ΒΑΣΙΛΕΙΟΣ","Σ.Α.ΣΕΡΡΩΝ",61,0]
["16-25408","ΠΑΠΑΦΙΛΙΠΠΟΥ ΔΑΜΙΑΝΟΣ","Ο.Α.ΚΑΣΤΟΡΙΑΣ ΚΕΛΕΤΡΟΝ",60,0]
["16-28251","ΛΑΖΟΠΟΥΛΟΣ ΛΑΜΠΡΟΣ","Α.Ο.Α.ΦΙΛΟΘΕΗΣ",59,0]
["16-29813","ΤΖΑΝΗΣ ΑΡΙΣΤΕΙΔΗΣ","Ο.Α.ΘΕΣΠΡΩΤΙΑΣ ΤΙΤΑΝΗ",59,0]
["16-26505","ΖΑΝΙΚΑΣ ΠΑΥΛΟΣ","Α.Γ.Ο.ΦΙΛΙΠΠΙΑΔΑΣ",57,0]
["16-26191","ΚΑΖΑΝΑΣ ΙΩΑΝΝΗΣ","Ο.Α.ΓΛΥΦΑΔΑΣ",55,0]
["16-32148","ΓΑΛΑΤΙΑΝΟΣ ΗΛΙΑΣ","Α.Ο.ΚΑΛΛΙΤΕΧΝΟΥΠΟΛΗΣ",54,0]
["16-30611","ΚΑΡΕΛΑΣ ΠΑΝΑΓΙΩΤΗΣ","Ο.Α.ΚΑΛΑΜΑΤΑΣ",53,0]
["16-31708","ΜΠΙΝΟΠΟΥΛΟΣ ΙΩΑΝΝΗΣ","Ν.Ο.ΘΕΣΣΑΛΟΝΙΚΗΣ",52,0]
["16-29815","ΠΑΠΙΓΓΙΩΤΗΣ ΔΗΜΗΤΡΙΟΣ","Ο.Α.ΘΕΣΠΡΩΤΙΑΣ ΤΙΤΑΝΗ",52,0]
["16-28473","ΧΑΤΖΗΑΠΟΣΤΟΛΟΥ ΑΧΙΛΛΕΑΣ","Α.Σ.ΚΟΛΛΕΓΙΟΥ ΝΤΕΡΗ",52,0]
["16-27668","ΤΑΜΠΑΚΗΣ ΘΕΟΧΑΡΗΣ","Ο.Α.ΚΕΡΑΤΣΙΝΙΟΥ",51,0]
["16-28957","ΚΥΡΙΑΚΟΠΟΥΛΟΣ ΠΕΡΙΚΛΗΣ","Ο.Α.ΙΩΛΚΟΣ ΒΟΛΟΥ",50,0]
["16-32472","ΜΑΝΟΥΣΑΚΗΣ ΔΗΜΗΤΡΙΟΣ-ΠΑΝΑΓΙΩΤΗΣ","Γ.Ο.ΠΕΡΙΣΤΕΡΙΟΥ Γ.ΠΑΛΑΣΚΑΣ",50,0]
["16-24772","ΜΑΡΚΟΓΙΑΝΝΑΚΗΣ ΚΩΝΣΤΑΝΤΙΝΟΣ","Ο.Α.ΡΕΘΥΜΝΟΥ",50,0]
["16-26230","ΜΑΝΟΥΣΑΚΗΣ ΚΥΡΙΑΚΟΣ","ΗΡΑΚΛΕΙΟ Ο.Α.& Α.",49,0]
["16-31408","ΑΝΑΣΤΑΣΙΑΔΗΣ ΦΩΤΙΟΣ","ΡΟΔΙΑΚΟΣ Ο.Α.",48,0]
["16-29660","ΓΚΕΡΕΚΟΣ ΣΠΥΡΙΔΩΝ","Ο.Α.ΚΕΡΚΥΡΑΣ",48,0]
["16-26705","ΚΟΥΤΣΟΥΛΗΣ ΜΑΡΙΟΣ","Α.Ο.ΑΡΓΥΡΟΥΠΟΛΗΣ",48,0]
["16-24329","ΤΖΙΑΣΤΟΥΔΗΣ ΧΡΗΣΤΟΣ","Ο.Α.ΦΟΙΒΟΣ ΛΑΡΙΣΑΣ",48,0]
["16-32894","ΑΣΛΑΝΙΔΗΣ ΓΕΩΡΓΙΟΣ","Ο.Α.ΚΟΥΦΑΛΙΩΝ ΘΕΣΣΑΛΟΝΙΚΗΣ",46,0]
["16-26976","ΜΥΛΩΝΑΣ ΑΠΟΣΤΟΛΟΣ","Α.Ο.Α.ΦΙΛΟΘΕΗΣ",46,0]
["16-29502","ΠΑΤΕΡΑΣ ΔΙΑΜΑΝΤΗΣ","Α.Ο.ΤΑΤΟΪΟΥ",46,0]
["16-33515","ΣΚΑΜΑΓΚΑΣ ΔΗΜΗΤΡΗΣ","Α.Ο.Α.ΚΑΤΕΡΙΝΗΣ",46,0]
["16-33917","ΚΑΒΑΛΛΙΕΡΟΣ ΚΩΝΣΤΑΝΤΙΝΟΣ","Ο.Α.ΑΘΛΗΤ.ΠΑΙΔΕΙΑ",45,0]
["16-32220","ΣΦΙΚΤΗΣ ΠΑΝΑΓΙΩΤΗΣ","Ο.Α.ΠΕΤΡΟΥΠΟΛΗΣ",45,0]
["16-29444","ΓΚΙΖΑΣ ΘΩΜΑΣ","Γ.Ε.ΠΡΕΒΕΖΑΣ",44,0]
["16-31171","ΔΗΜΗΤΡΑΚΗΣ ΙΩΑΝΝΗΣ","ΡΟΔΙΑΚΗ ΑΚΑΔ.ΑΝΤΙΣΦ.",44,0]
["16-30944","ΚΟΝΤΟΓΙΩΡΓΑΚΗΣ ΙΩΑΝΝΗΣ","Ο.Α.ΣΗΤΕΙΑΣ",44,0]
["16-32761","ΜΙΝΤΑΣ ΝΙΚΟΛΑΟΣ","ΠΕΥΚΗ Γ.ΚΑΛΟΒΕΛΩΝΗΣ",44,0]
["16-28959","ΜΠΕΛΤΖΕΝΙΤΗΣ ΙΩΑΝΝΗΣ","Ο.Α.ΠΕΤΡΟΥΠΟΛΗΣ",44,0]
["16-34260","ΝΟΥΣΗΣ ΚΩΝΣΤΑΝΤΙΝΟΣ","ΑΚΑΔ.ΑΝΤΙΣΦ.ΙΩΑΝΝΙΝΩΝ",44,0]
["16-28424","ΓΑΤΟΥΔΗΣ-ΜΑΛΙΝΔΡΕΤΟΣ ΝΙΚΟΛΑΟΣ","Ο.Α.ΧΑΝΙΩΝ",43,0]
["16-31335","ΛΑΖΑΡΙΔΗΣ ΓΕΩΡΓΙΟΣ-ΑΛΕΞΑΝΔΡΟΣ","Φ.Ο.Α.ΝΕΑΠΟΛΗΣ",43,0]
["16-27959","ΚΩΛΕΤΣΗΣ ΛΑΖΑΡΟΣ","ΑΚΑΔ.ΑΝΤΙΣΦ.ΙΩΑΝΝΙΝΩΝ",42,0]
["16-26780","ΖΑΓΟΡΑΙΟΣ ΚΩΝΣΤΑΝΤΙΝΟΣ","Α.Κ.Α.ΜΑΡΑΘΩΝΑ",41.5,0]
["16-26075","ΒΙΝΙΕΡΑΤΟΣ ΕΛΕΥΘΕΡΙΟΣ","Ο.Α.ΠΕΤΡΟΥΠΟΛΗΣ",40,0]
["16-30492","ΚΑΤΣΑΛΟΒ ΙΩΑΝΝΗΣ","Σ.Α.ΔΡΑΜΑΣ",40,0]
["16-32543","ΤΖΗΓΚΑΣ ΧΡΗΣΤΟΣ","Ο.Α.ΕΔΕΣΣΑΣ",40,0]
["16-28474","ΧΡΟΝΟΠΟΥΛΟΣ ΔΗΜΗΤΡΙΟΣ","Α.Ο.Α.ΠΑΠΑΓΟΥ",39.5,0]
["16-28154","ΒΑΡΒΕΡΑΚΗΣ ΓΕΩΡΓΙΟΣ","Ο.Α.ΧΑΝΙΩΝ",39,0]
["16-27392","ΜΟΙΡΑΝΑΙΟΣ ΝΙΚΟΛΑΟΣ","Ο.Α.ΚΕΡΑΤΣΙΝΙΟΥ",38,0]
["16-25492","ΜΠΟΥΡΤΖΑΛΑΣ ΗΛΙΑΣ-ΜΑΡΙΟΣ","ΦΘΙΩΤΙΚΟΣ Ο.Α.",38,0]
["16-28013","ΣΠΕΝΤΖΟΣ ΧΡΗΣΤΟΣ","Α.Κ.Α.ΜΑΡΑΘΩΝΑ",38,0]
["16-32768","ΠΑΠΑΔΟΠΟΥΛΟΣ ΠΑΝΑΓΙΩΤΗΣ","Ο.Α.ΑΘΗΝΩΝ",37,0]
["16-28243","ΚΡΑΣΟΥΔΑΚΗΣ ΙΩΑΝΝΗΣ-ΓΕΩΡΓΙΟΣ","Ο.Α.ΧΑΝΙΩΝ",36.5,0]
["16-33516","ΚΡΗΤΟΣ ΚΩΝΣΤΑΝΤΙΝΟΣ","Α.Ο.Α.ΚΑΤΕΡΙΝΗΣ",36,0]
["16-29276","ΠΑΠΟΥΛΙΑΣ ΣΩΚΡΑΤΗΣ","Σ.Α.ΣΕΡΡΩΝ",34.5,0]
["16-26172","ΣΤΑΥΡΟΥΛΑΚΗΣ ΓΕΩΡΓΙΟΣ","ΗΡΑΚΛΕΙΟ Ο.Α.& Α.",34,0]
["16-29884","ΤΣΙΓΚΕΝΗΣ ΓΕΩΡΓΙΟΣ","Α.Ο.Α.ΧΑΪΔΑΡΙΟΥ",34,0]
["16-28546","ΑΝΔΡΙΟΠΟΥΛΟΣ ΚΩΝΣΤΑΝΤΙΝΟΣ","Α.Ο.Α.ΠΑΤΡΩΝ",33,0]
["16-26478","ΚΗΠΟΥΡΟΣ ΣΤΑΥΡΟΣ","Ο.Α.ΧΑΝΙΩΝ",33,0]
["16-28192","ΑΛΕΞΑΝΔΡΙΔΗΣ ΧΑΡΑΛΑΜΠΟΣ","Σ.Α.ΣΕΡΡΩΝ",32.5,0]
["16-27236","ΚΑΤΣΑΓΚΟΛΗΣ ΑΣΤΕΡΙΟΣ","Γ.Σ.ΛΙΒΥΚΟΣ ΙΕΡΑΠΕΤΡΑΣ",32,0]
["16-29450","ΚΟΖΥΡΑΚΗΣ ΦΩΤΙΟΣ","Α.Σ.Ε.ΘΗΣΕΑΣ ΑΓΙΟΥ ΔΗΜΗΤΡΙΟΥ",32,0]
["16-29125","ΝΙΚΟΛΑΪΔΗΣ ΝΙΚΟΛΑΟΣ","Ο.Α.ΛΙΤΟΧΩΡΟΥ",32,0]
["16-29664","ΣΑΧΠΑΤΖΙΔΗΣ ΓΕΩΡΓΙΟΣ","Ο.Α.ΝΕΣΤΩΡΑΣ ΓΙΑΝΝΙΤΣΩΝ",32,0]
["16-29814","ΤΣΑΝΤΕΚΙΔΗΣ ΑΧΙΛΛΕΑΣ","Ο.Α.ΘΕΣΠΡΩΤΙΑΣ ΤΙΤΑΝΗ",32,0]
["16-32097","ΤΣΑΡΠΑΛΗΣ ΗΛΙΑΣ","Ο.Α.ΑΙΓΙΑΛΕΙΑΣ",32,0]
["16-27220","ΛΙΑΤΣΟΣ ΔΗΜΗΤΡΙΟΣ","Ο.Α.ΘΕΣΠΡΩΤΙΑΣ ΤΙΤΑΝΗ",31,0]
["16-22989","ΛΑΜΠΡΟΠΟΥΛΟΣ ΠΑΝΑΓΙΩΤΗΣ","Α.Ε.Κ.ΤΡΙΠΟΛΗΣ",30,0]
["16-28486","ΜΠΑΡΜΠΑΡΗΣ ΣΤΥΛΙΑΝΟΣ","Ο.Α.ΠΑΡΟΥ",28.5,0]
["16-24765","ΛΑΖΑΡΙΔΗΣ ΚΥΡΙΑΚΟΣ","Ο.Α.ΘΕΣΣΑΛΟΝΙΚΗΣ",28,0]
["16-29001","ΜΕΛΙΣΣΙΝΟΣ ΔΗΜΗΤΡΙΟΣ","Φ.Ο.Α.ΝΕΑΠΟΛΗΣ",28,0]
["16-29582","ΤΖΙΜΟΓΙΑΝΝΗΣ ΑΛΕΞΑΝΔΡΟΣ-ΔΗΜΗΤΡΙΟΣ","ΑΚΑΔ.ΑΝΤΙΣΦ.ΙΩΑΝΝΙΝΩΝ",28,0]
["16-32470","ΓΕΡΟΓΙΑΝΝΗΣ ΑΛΕΞΑΝΔΡΟΣ","Α.Ο.Α.ΧΑΪΔΑΡΙΟΥ",26.5,0]
["16-32318","ΓΕΡΑΡΔΗΣ ΕΜΜΑΝΟΥΗΛ","Ο.Α.ΠΕΤΡΟΥΠΟΛΗΣ",26,0]
["16-33530","ΓΙΑΚΟΥΜΑΚΗΣ ΙΩΑΝΝΗΣ","Ο.Α.ΧΑΝΙΩΝ",26,0]
["16-25750","ΚΟΝΤΟΓΙΩΡΓΗΣ ΓΕΡΑΣΙΜΟΣ","Ο.Α.ΚΕΡΚΥΡΑΣ",26,0]
["16-32896","ΣΕΡΤΗΣ ΕΥΑΓΓΕΛΟΣ","Σ.Α.ΔΡΑΜΑΣ",26,0]
["16-90105","ΑΛΕΞΑΚΗΣ ΠΕΤΡΟΣ","Ο.Α.ΧΑΝΙΩΝ",25.5,0]
["16-29162","ΖΑΦΕΙΡΗΣ ΣΠΥΡΟΣ","Α.Ο.Α.ΧΑΪΔΑΡΙΟΥ",25.5,0]
["16-30365","ΕΛΕΥΘΕΡΙΑΔΗΣ ΑΝΕΣΤΗΣ","Α.Σ.Α.ΠΑΝΟΡΑΜΑΤΟΣ",25,0]
["16-29952","ΚΑΝΕΛΛΟΠΟΥΛΟΣ ΠΕΤΡΟΣ","Α.Ε.Κ.ΤΡΙΠΟΛΗΣ",25,0]
["16-30064","ΚΟΥΚΟΥΛΙΘΡΑΣ ΙΩΑΝΝΗΣ","Ο.Α.ΚΕΡΑΤΣΙΝΙΟΥ",25,0]
["16-32051","ΚΥΡΛΑΣ ΣΤΑΥΡΟΣ","Γ.Ε.ΠΡΕΒΕΖΑΣ",25,0]
["16-28873","ΒΡΕΤΤΟΣ ΓΙΩΡΓΟΣ","Α.Ο.Α.ΦΙΛΟΘΕΗΣ",24.5,0]
["16-27108","ΔΕΛΗΣ ΚΩΝΣΤΑΝΤΙΝΟΣ-ΔΗΜΗΤΡΙΟΣ","Α.Ε.Κ.ΤΡΙΠΟΛΗΣ",24,0]
["16-33109","ΤΡΙΑΝΤΑΦΥΛΛΙΔΗΣ ΑΛΕΞΑΝΔΡΟΣ","Φ.Ο.Α.ΝΕΑΠΟΛΗΣ",24,0]
["16-30739","ΑΡΒΑΝΙΤΗΣ ΓΕΩΡΓΙΟΣ","Ο.Α.ΑΙΓΙΑΛΕΙΑΣ",23,0]
["16-28329","ΠΛΙΟΓΚΑΣ ΗΛΙΑΣ","Ο.Α.ΝΕΣΤΩΡΑΣ ΓΙΑΝΝΙΤΣΩΝ",23,0]
["16-30123","ΚΑΜΑΡΑΣ ΡΑΦΑΗΛ-ΚΩΝΣΤΑΝΤΙΝΟΣ","Α.Ο.Α.ΠΑΠΑΓΟΥ",22.5,0]
["16-31693","ΕΣΚΙΟΓΛΟΥ ΣΤΕΦΑΝΟΣ","Α.Π.Ο.ΣΑΝΝΥ ΣΠΟΡΤΣ ΚΛΑΜΠ",22,0]
["16-32226","ΚΟΣΜΙΔΗΣ ΓΕΩΡΓΙΟΣ","Ε.Σ.Ο.ΕΠΙΚΟΥΡΟΣ ΠΟΛΙΧΝΗΣ",22,0]
["16-28842","ΜΙΧΑΛΟΠΟΥΛΟΣ ΓΙΩΡΓΟΣ","Ο.Α.ΚΕΡΚΥΡΑΣ",22,0]
["16-28662","ΠΑΛΗΚΙΔΗΣ ΑΛΕΞΑΝΔΡΟΣ","Α.Ο.ΚΑΒΑΛΑΣ ΜΑΚΕΔΟΝΙΚΟΣ",22,0]
["16-27029","ΠΑΠΑΓΙΑΝΝΗΣ ΑΝΑΣΤΑΣΙΟΣ","Ο.Α.ΣΑΛΑΜΙΝΑΣ",22,0]
["16-28765","ΓΚΕΛΗΣ ΓΕΩΡΓΙΟΣ","Ο.Α.ΜΑΓΝΗΣΙΑΣ",21,0]
["16-28794","ΚΙΟΥΡΤΗΣ ΔΗΜΗΤΡΙΟΣ","Ο.Α.ΚΑΒΑΛΑΣ ΑΛΕΞΑΝΔΡΟΣ",21,0]
["16-28931","ΚΟΥΤΣΟΓΙΑΝΝΗΣ ΑΝΔΡΕΑΣ","Ο.Α.ΜΑΓΝΗΣΙΑΣ",21,0]
["16-31207","ΣΦΕΝΔΟΥΡΑΚΗΣ ΜΑΡΙΟΣ","Ο.Α.ΣΗΤΕΙΑΣ",21,0]
["16-25902","ΠΟΛΙΤΗΣ ΕΛΕΥΘΕΡΙΟΣ","Α.Ε.Κ.ΤΡΙΠΟΛΗΣ",20,0]
["16-29042","ΚΑΛΟΓΕΡΟΠΟΥΛΟΣ ΘΕΟΔΩΡΟΣ","Σ.Α.ΡΑΦΗΝΑΣ",19.5,0]
["16-30272","ΤΖΕΛΗΣ ΑΝΔΡΕΑ-ΜΑΡΙΟΣ","ΑΚΑΔ.ΑΝΤΙΣΦ.ΙΩΑΝΝΙΝΩΝ",19.5,0]
["16-32773","ΚΩΛΕΤΣΗΣ ΛΑΜΠΡΟΣ","ΑΚΑΔ.ΑΝΤΙΣΦ.ΙΩΑΝΝΙΝΩΝ",19,0]
["16-31631","ΠΛΑΚΟΓΙΑΝΝΗΣ ΜΑΡΙΝΟΣ","ΡΗΓΑΣ Α.Ο.Α.ΑΡΓΟΛΙΔΑΣ",19,0]
["16-30398","ΤΣΕΚΟΥΡΑΣ ΚΩΝΣΤΑΝΤΙΝΟΣ","Ο.Α.ΧΑΛΚΙΔΑΣ",18.5,0]
["16-30523","ΑΠΕΡΓΗΣ ΚΟΜΝΗΝΟΣ","Α.Ο.ΚΑΛΛΙΤΕΧΝΟΥΠΟΛΗΣ",18,0]
["16-27171","ΓΡΗΓΟΡΑΤΟΣ ΧΑΡΑΛΑΜΠΟΣ","Α.Ο.Α.ΗΛΙΟΥΠΟΛΗΣ",18,0]
["16-24107","ΚΟΥΣΤΕΡΙΔΗΣ ΡΑΦΑΗΛ","Ο.Α.ΕΥΟΣΜΟΥ ΘΕΣΣΑΛΟΝΙΚΗΣ",18,0]
["16-27013","ΜΠΕΓΝΗΣ ΧΡΗΣΤΟΣ","Ο.Α.ΣΑΛΑΜΙΝΑΣ",18,0]
["16-27875","ΠΑΡΙΣΣΗΣ ΕΥΑΓΓΕΛΟΣ","ΡΟΔΙΑΚΗ ΑΚΑΔ.ΑΝΤΙΣΦ.",18,0]
["16-34536","ΠΙΠΙΛΑΚΙΔΗΣ ΑΘΑΝΑΣΙΟΣ","Ο.Α.ΓΙΑΝΝΙΤΣΩΝ",18,0]
["16-26055","ΣΙΡΠΟΣ ΑΛΕΞΙΟΣ","Ο.Α.ΘΕΣΣΑΛΟΝΙΚΗΣ",18,0]
["16-25843","ΣΟΥΣΟΥΡΟΓΙΑΝΝΗΣ ΕΥΑΓΓΕΛΟΣ","Α.Ο.Α.ΚΑΤΕΡΙΝΗΣ",18,0]
["16-32100","ΣΠΗΛΙΩΤΟΠΟΥΛΟΣ ΠΑΝΑΓΙΩΤΗΣ","Ο.Α.ΑΙΓΙΑΛΕΙΑΣ",18,0]
["16-26179","ΣΤΑΥΡΟΥΛΑΚΗΣ ΙΩΑΝΝΗΣ","Ο.Α.ΑΓΙΑΣ ΠΑΡΑΣΚΕΥΗΣ",18,0]
["16-32785","ΧΡΙΣΤΟΦΙΛΟΠΟΥΛΟΣ ΝΙΚΟΛΑΟΣ","Ο.Α.ΚΕΡΑΤΣΙΝΙΟΥ",18,0]
["16-30560","ΣΟΦΗΣ ΝΙΚΟΛΑΟΣ","Α.Ε.Τ.ΝΙΚΗ ΠΑΤΡΩΝ",16.5,0]
["16-30056","ΧΑΤΖΗΓΙΑΝΝΗΣ ΣΤΑΥΡΟΣ","Α.Ο.ΑΡΓΥΡΟΥΠΟΛΗΣ",16.5,0]
["16-27383","ΧΑΤΖΗΣ ΣΤΕΦΑΝΟΣ-ΡΑΦΑΗΛ","Α.Ε.ΠΟΡΤΟ ΡΑΦΤΗ",16.5,0]
["16-28590","ΓΚΑΛΤΣΙΔΗΣ ΧΡΗΣΤΟΣ","Α.Ο.Α.ΑΣΤΕΡΑΣ ΘΕΣΣΑΛΟΝΙΚΗΣ",16,0]
["16-34030","ΚΩΣΤΟΠΟΥΛΟΣ ΝΙΚΟΛΑΟΣ","Α.Ε.Κ.ΤΡΙΠΟΛΗΣ",16,0]
["16-32707","ΜΠΕΛΛΟΣ ΠΕΤΡΟΣ","Ο.Α.ΑΓΙΑΣ ΠΑΡΑΣΚΕΥΗΣ",16,0]
["16-32165","ΓΙΑΤΣΟΣ ΠΟΛΥΜΕΡΟΣ-ΠΑΝΑΓΙΩΤΗΣ","Ο.Α.ΑΙΓΙΑΛΕΙΑΣ",15,0]
["16-31813","ΖΑΧΑΡΑΚΗΣ ΜΙΧΑΗΛ","ΗΡΑΚΛΕΙΟ Ο.Α.& Α.",15,0]
["16-26800","ΣΤΟΪΔΗΣ ΝΙΚΟΛΑΟΣ-ΝΙΚΗΦΟΡΟΣ","Μ.Γ.Σ.ΑΠΟΛΛΩΝ ΚΑΛΑΜΑΡΙΑΣ",15,0]
["16-32877","ΚΟΥΣΤΕΝΗΣ ΚΩΝΣΤΑΝΤΙΝΟΣ","Α.Ε.Κ.ΤΡΙΠΟΛΗΣ",14.5,0]
["16-29618","ΒΡΑΝΑΣ ΠΑΝΑΓΙΩΤΗΣ-ΗΛΙΑΣ","Α.Σ.Α.ΑΓΡΙΝΙΟΥ",14,0]
["16-26495","ΓΚΕΜΟΣ ΑΝΔΡΕΑΣ","Ο.Α.ΑΡΙΔΑΙΑΣ",14,0]
["16-29104","ΓΡΗΓΟΡΙΑΔΗΣ ΚΩΝΣΤΑΝΤΙΝΟΣ","Ε.Σ.Ο.ΕΠΙΚΟΥΡΟΣ ΠΟΛΙΧΝΗΣ",14,0]
["16-29615","ΚΛΑΔΕΥΤΗΡΑΣ ΦΩΤΗΣ","Ο.Α.ΠΕΤΡΟΥΠΟΛΗΣ",14,0]
["16-25941","ΛΙΑΤΣΟΣ ΝΙΚΗΦΟΡΟΣ-ΕΥΣΤΡΑΤΙΟΣ","Ο.Α.ΑΓΙΑΣ ΠΑΡΑΣΚΕΥΗΣ",14,0]
["16-26777","ΜΑΓΓΟΣ ΘΩΜΑΣ","Ο.Α.ΓΙΑΝΝΙΤΣΩΝ",14,0]
["16-29811","ΜΠΙΣΑΡΑ-ΜΑΪΛΙΑΝΗΣ ΑΝΤΑΜ","Ο.Α.ΝΕΣΤΩΡΑΣ ΓΙΑΝΝΙΤΣΩΝ",14,0]
["16-33339","ΠΑΣΧΑΛΙΔΗΣ ΜΑΡΙΟΣ","Α.Ο.Α.ΝΕΑΣ ΠΕΡΑΜΟΥ ΟΙ ΤΙΤΑΝΕΣ",14,0]
["16-29607","ΠΟΥΛΗΣ ΣΤΡΑΤΗΣ","Α.Σ.Ε.ΘΗΣΕΑΣ ΑΓΙΟΥ ΔΗΜΗΤΡΙΟΥ",14,0]
["16-32341","ΧΑΛΒΑΤΖΗΣ ΕΥΑΓΓΕΛΟΣ","Ε.Σ.Ο.ΕΠΙΚΟΥΡΟΣ ΠΟΛΙΧΝΗΣ",14,0]
["16-33872","ΚΡΟΝΤΗΡΑΣ ΑΝΑΣΤΑΣΙΟΣ","ΗΡΑΚΛΕΙΟ Ο.Α.& Α.",13,0]
["16-29435","ΤΖΑΘΑΣ ΝΙΚΟΛΑΟΣ-ΣΩΤΗΡΙΟΣ","Ο.Α.ΚΑΙΣΑΡΙΑΝΗΣ",12.5,0]
["16-29161","ΑΣΙΘΙΑΝΑΚΗΣ ΟΔΥΣΣΕΑΣ","Α.Α.ΑΙΓΑΛΕΩ",12,0]
["16-34309","ΒΡΑΧΑΣ ΙΩΑΝΝΗΣ","Ο.Α.ΑΓΙΑΣ ΠΑΡΑΣΚΕΥΗΣ",12,0]
["16-26875","ΓΕΩΡΓΑΚΟΠΟΥΛΟΣ ΑΡΗΣ","Γ.Ο.ΠΕΡΙΣΤΕΡΙΟΥ Γ.ΠΑΛΑΣΚΑΣ",12,0]
["16-32083","ΓΙΑΚΗΣ ΚΩΝΣΤΑΝΤΙΝΟΣ","Ο.Α.ΑΓΙΩΝ ΑΝΑΡΓΥΡΩΝ",12,0]
["16-29213","ΚΟΝΤΗΣ ΒΑΣΙΛΕΙΟΣ","Ο.Α.ΓΛΥΦΑΔΑΣ",12,0]
["16-34372","ΜΑΓΟΓΙΑΝΝΗΣ ΑΓΓΕΛΟΣ","Α.Ο.Α.ΧΑΪΔΑΡΙΟΥ",12,0]
["16-29587","ΜΠΙΛΗΣ ΣΤΑΥΡΟΣ","Α.Ο.ΒΑΡΗΣ ΑΝΑΓΥΡΟΥΣ",12,0]
["16-90060","ΜΠΙΟΡΑΤΣ ΜΠΟΡΚΟ","Ο.Α.ΡΕΘΥΜΝΟΥ",12,0]
["16-32359","ΣΩΜΑΡΑΚΗΣ ΑΡΙΣΤΟΤΕΛΗΣ","Α.Σ.ΑΚΑΔΗΜΙΕΣ ΠΡΩΤΑΘΛΗΤΩΝ ΠΕΥΚΩΝ",12,0]
["16-26714","ΤΣΕΚΜΕΖΟΓΛΟΥ ΑΝΕΣΤΗΣ","Ο.Α.ΚΑΒΑΛΑΣ ΑΛΕΞΑΝΔΡΟΣ",12,0]
["16-26671","ΦΑΣΙΛΗΣ ΚΥΡΙΑΚΟΣ","Ο.Α.ΚΑΒΑΛΑΣ ΑΛΕΞΑΝΔΡΟΣ",12,0]
["16-32294","ΔΡΙΒΑΣ ΧΑΡΑΛΑΜΠΟΣ","Α.Ο.ΚΑΛΛΙΤΕΧΝΟΥΠΟΛΗΣ",11.5,0]
["16-28224","ΚΑΠΝΙΑΣ ΕΥΑΓΓΕΛΟΣ","Ο.Α.ΚΕΡΑΤΣΙΝΙΟΥ",11.5,0]
["16-26886","ΟΙΚΟΝΟΜΟΠΟΥΛΟΣ ΙΩΑΝΝΗΣ","Ο.Α.ΚΟΡΙΝΘΟΥ",11.5,0]
["16-29451","ΑΡΓΥΡΟΥΛΗΣ ΑΝΤΩΝΙΟΣ","Α.Σ.Ε.ΘΗΣΕΑΣ ΑΓΙΟΥ ΔΗΜΗΤΡΙΟΥ",11,0]
["16-32709","ΚΑΡΑΓΙΑΝΝΗΣ ΑΘΑΝΑΣΙΟΣ","Ο.Α.ΧΕΡΣΟΝΗΣΟΥ",11,0]
["16-26726","ΜΠΟΥΓΑΣ ΠΑΝΑΓΙΩΤΗΣ","Α.Ο.ΑΡΓΥΡΟΥΠΟΛΗΣ",11,0]
["16-28024","ΜΥΛΩΝΟΠΟΥΛΟΣ ΘΕΟΔΩΡΟΣ","ΦΙΛΑΘΛ.ΟΜΙΛΟΣ ΠΥΡΓΟΥ",11,0]
["16-28757","ΠΑΠΟΥΔΑΣ-ΤΣΑΚΙΡΙΔΗΣ ΑΝΑΣΤΑΣΙΟΣ","Σ.Α.ΔΡΑΜΑΣ",11,0]
["16-31152","ΠΑΣΠΑΛΑΡΑΚΗΣ ΙΩΑΝΝΗΣ","Ο.Α.ΣΗΤΕΙΑΣ",11,0]
["16-30788","ΧΑΝΤΖΟΠΟΥΛΟΣ ΑΡΙΣΤΟΤΕΛΗΣ","ΠΕΥΚΗ Γ.ΚΑΛΟΒΕΛΩΝΗΣ",10.5,0]
["16-30889","ΑΛΕΞΑΝΔΡΙΔΗΣ ΕΛΕΥΘΕΡΙΟΣ","Α.Ο.ΛΑΤΩ ΑΓ.ΝΙΚΟΛΑΟΥ",10,0]
["16-28252","ΒΡΑΝΑΣ ΙΩΑΝΝΗΣ","Α.Ο.Α.ΦΙΛΟΘΕΗΣ",10,0]
["16-33357","ΚΑΚΟΥΛΙΑΔΗΣ ΓΙΩΡΓΟΣ","Ο.Α.ΞΑΝΘΗΣ",10,0]
["16-33984","ΜΟΥΣΤΑΚΗΣ ΑΠΟΣΤΟΛΟΣ","ΑΙΟΛΟΣ Α.Λ.ΙΛΙΟΥ",10,0]
["16-34205","ΜΟΥΣΤΡΟΥΦΗΣ ΝΙΚΟΛΑΟΣ","Α.Ο.ΤΑΤΟΪΟΥ",10,0]
["16-33904","ΜΟΥΤΖΟΓΛΟΥ` ΝΙΚΟΣ","Α.Α.ΑΙΓΑΛΕΩ",10,0]
["16-24301","ΜΠΑΛΤΖΟΓΛΟΥ ΚΩΝΣΤΑΝΤΙΝΟΣ","Ο.Α.ΚΟΡΙΝΘΟΥ",10,0]
["16-30251","ΜΠΟΥΦΙΔΗΣ ΓΙΩΡΓΟΣ","Α.Σ.ΑΚΑΔΗΜΙΕΣ ΠΡΩΤΑΘΛΗΤΩΝ ΠΕΥΚΩΝ",10,0]
["16-24501","ΣΠΥΡΟΣ ΓΕΩΡΓΙΟΣ","Ο.Α.ΑΡΤΑΣ",10,0]
["16-32940","ΑΡΑΜΠΑΤΖΗΣ ΠΑΝΑΓΙΩΤΗΣ","Ο.Α.ΑΡΙΔΑΙΑΣ",9,0]
["16-34648","ΟΙΚΟΝΟΜΟΥ ΝΙΚΟΛΑΟΣ","Α.Π.Ο.ΣΑΝΝΥ ΣΠΟΡΤΣ ΚΛΑΜΠ",9,0]
["16-29218","ΠΛΑΤΗΣ ΕΛΕΥΘΕΡΙΟΣ","Ο.Α.ΞΑΝΘΗΣ",9,0]
["16-29217","ΠΛΑΤΗΣ ΚΩΝΣΤΑΝΤΙΝΟΣ","Ο.Α.ΞΑΝΘΗΣ",9,0]
["16-30187","ΡΟΥΣΟΠΟΥΛΟΣ ΙΩΑΝΝΗΣ","Ο.Α.ΧΑΛΚΙΔΑΣ",9,0]
["16-30276","ΣΔΡΑΚΑΣ ΧΡΗΣΤΟΣ","Ο.Α.ΣΠΑΡΤΗΣ",9,0]
["16-31085","ΤΡΟΥΠΤΣΙΔΗΣ ΣΩΚΡΑΤΗΣ","Ο.Α.ΚΕΡΚΥΡΑΣ",9,0]
["16-29084","ΠΑΠΑΔΕΑΣ ΠΑΝΑΓΙΩΤΗΣ","Ο.Α.ΚΕΡΑΤΣΙΝΙΟΥ",8.5,0]
["16-33845","ΑΣΛΑΝΙΔΗΣ ΝΙΚΟΛΑΟΣ","Ο.Α.ΠΟΛΥΚΑΣΤΡΟΥ",8,0]
["16-33387","ΒΟΣΚΟΠΟΥΛΟΣ ΓΙΑΝΝΗΣ","ΛΕΣΧΗ ΠΟΛΙΤΙΣΜΟΥ ΦΛΩΡΙΝΑΣ",8,0]
["16-27848","ΓΑΤΟΣ ΘΕΟΔΟΣΙΟΣ","Μ.Γ.Σ.ΑΠΟΛΛΩΝ ΚΑΛΑΜΑΡΙΑΣ",8,0]
["16-33529","ΓΙΑΚΟΥΜΑΚΗΣ ΠΟΛΥΧΡΟΝΗΣ","Ο.Α.ΧΑΝΙΩΝ",8,0]
["16-29505","ΖΑΝΙΚΑΣ ΠΑΥΛΟΣ","Α.Ο.ΚΗΦΙΣΙΑΣ",8,0]
["16-33290","ΘΟΥΛΙΩΤΗΣ ΜΙΧΑΛΗΣ","Σ.Α.ΣΕΡΡΩΝ",8,0]
["16-28378","ΜΟΥΣΑΣ ΔΗΜΟΣΘΕΝΗΣ","Α.Ο.Α.ΦΙΛΟΘΕΗΣ",8,0]
["16-27655","ΜΠΑΓΟΡΔΑΚΗΣ ΟΔΥΣΣΕΑΣ","Ο.Α.ΣΗΤΕΙΑΣ",8,0]
["16-34195","ΣΚΑΡΛΑΤΟΣ ΒΑΣΙΛΗΣ","Α.Α.ΑΙΓΑΛΕΩ",8,0]
["16-25828","ΣΧΟΙΝΟΠΛΟΚΑΚΗΣ ΚΩΝΣΤΑΝΤΙΝΟΣ","Ο.Α.ΧΑΝΙΩΝ",8,0]
["16-24874","ΧΑΤΖΗΜΑΡΚΑΚΗΣ ΧΡΗΣΤΟΣ","Γ.Σ.ΛΙΒΥΚΟΣ ΙΕΡΑΠΕΤΡΑΣ",8,0]
["16-25831","ΧΑΤΖΟΠΟΥΛΟΣ ΚΩΝΣΤΑΝΤΙΝΟΣ","Ο.Α.ΒΟΛΟΥ",8,0]
["16-33796","ΘΕΟΧΑΡΗΣ ΒΑΣΙΛΕΙΟΣ","Α.Ο.Α.ΠΑΠΑΓΟΥ",7.5,0]
["16-28174","ΠΑΚΑΣ ΜΑΡΚΟΣ","Ο.Α.ΑΓΙΑΣ ΠΑΡΑΣΚΕΥΗΣ",7.5,0]
["16-34364","ΚΕΛΕΣΙΔΗΣ ΣΤΕΦΑΝΟΣ","Ο.Α.ΑΡΙΔΑΙΑΣ",7,0]
["16-34548","ΚΟΥΚΟΥΒΕΛΟΣ ΑΝΤΩΝΙΟΣ","Α.Σ.ΑΚΡΟΠΟΛΙΣ",7,0]
["16-29513","ΣΚΑΡΤΣΙΛΑΣ ΑΝΤΩΝΙΟΣ","Α.Ο.ΑΙΓΙΟΥ ΜΟΡΕΑΣ",7,0]
["16-29636","ΤΖΩΡΤΖΗΣ ΔΗΜΗΤΡΙΟΣ","ΑΚΑΔ.ΑΝΤΙΣΦ.ΙΩΑΝΝΙΝΩΝ",7,0]
["16-33918","ΚΑΒΑΛΛΙΕΡΟΣ ΝΙΚΟΛΑΟΣ","Ο.Α.ΑΘΛΗΤ.ΠΑΙΔΕΙΑ",6.5,0]
["16-29870","ΑΔΑΜΙΔΗΣ ΣΤΕΦΑΝΟΣ","Ο.Α.ΠΤΟΛΕΜΑΪΔΑΣ",6,0]
["16-29077","ΑΛΕΞΑΝΔΡΟΠΟΥΛΟΣ ΣΤΕΦΑΝΟΣ","Ο.Α.ΠΕΤΡΟΥΠΟΛΗΣ",6,0]
["16-33523","ΒΟΥΖΙΚΗΣ ΠΑΥΛΟΣ","Ο.Α.ΚΙΛΚΙΣ",6,0]
["16-90097","ΓΚΡΑΤΣΙΟΖΙ ΜΑΞΙΜ","Ο.Α.ΚΟΥΦΑΛΙΩΝ ΘΕΣΣΑΛΟΝΙΚΗΣ",6,0]
["16-32342","ΚΑΛΙΕΝΤΖΙΔΗΣ ΧΡΗΣΤΟΣ","Ο.Π.ΘΕΣΣΑΛΟΝΙΚΗΣ ΜΑΚΕΔΟΝΙΑ 92",6,0]
["16-31238","ΚΙΩΤΗΣ ΦΩΤΗΣ","Ο.Α.ΑΓΙΩΝ ΑΝΑΡΓΥΡΩΝ",6,0]
["16-30958","ΜΟΥΖΟΥΚΟΣ ΙΩΑΝΝΗΣ","Α.Ο.Α.ΧΑΪΔΑΡΙΟΥ",6,0]
["16-30140","ΜΥΛΩΝΑΣ ΚΩΝΣΤΑΝΤΙΝΟΣ-ΜΑΡΚΟΣ","Ε.Σ.Ο.ΕΠΙΚΟΥΡΟΣ ΠΟΛΙΧΝΗΣ",6,0]
["16-28789","ΠΑΝΤΑΖΗΣ ΘΕΟΔΩΡΟΣ","Ο.Α.ΚΟΡΙΝΘΟΥ",6,0]
["16-32382","ΠΕΠΠΑΣ ΓΕΩΡΓΙΟΣ","Σ.Α.ΓΑΛΑΤΣΙΟΥ",6,0]
["16-29121","ΣΑΡΤΖΕΤΑΚΗΣ ΘΕΟΔΩΡΟΣ","Α.Π.Ο.ΣΑΝΝΥ ΣΠΟΡΤΣ ΚΛΑΜΠ",6,0]
["16-28165","ΣΕΛΙΒΑΝΩΦ ΠΑΥΛΟΣ-ΣΤΕΡΓΙΟΣ","Ο.Α.ΘΕΣΣΑΛΟΝΙΚΗΣ",6,0]
["16-29262","ΣΕΧΟΠΟΥΛΟΣ ΠΕΤΡΟΣ","Α.Ο.ΚΗΦΙΣΙΑΣ",6,0]
["16-25488","ΧΟΤΟΚΟΥΡΙΔΗΣ ΒΑΣΙΛΗΣ","Σ.Α.ΚΑΤΕΡΙΝΗΣ",6,0]
["16-30185","ΝΕΡΟΥΤΣΟΣ ΔΗΜΗΤΡΙΟΣ","Ο.Α.ΧΑΛΚΙΔΑΣ",5.5,0]
["16-26897","ΑΝΑΣΤΑΣΙΟΥ ΚΩΝΣΤΑΝΤΙΝΟΣ","ΦΘΙΩΤΙΚΟΣ Ο.Α.",5,0]
["16-31248","ΒΑΜΒΑΚΑΣ ΒΑΣΙΛΕΙΟΣ","Ο.Α.ΤΟΥΜΠΑΣ",5,0]
["16-27420","ΒΡΑΔΗΣ ΕΥΑΓΓΕΛΟΣ","Ο.Α.ΚΕΡΚΥΡΑΣ",5,0]
["16-34265","ΓΚΟΡΟΓΙΑΣ ΔΗΜΗΤΡΙΟΣ","Α.Σ.Α.ΑΓΡΙΝΙΟΥ",5,0]
["16-34541","ΔΡΟΣΟΣ ΓΕΩΡΓΙΟΣ-ΠΕΤΡΟΣ","Ο.Α.ΠΑΡΟΥ",5,0]
["16-33990","ΖΑΦΕΙΡΙΟΥ ΙΩΑΝΝΗΣ","Ο.Α.ΤΟΥΜΠΑΣ",5,0]
["16-33969","ΛΑΜΠΡΗΣ ΙΩΑΝΝΗΣ","Σ.Α.ΓΑΛΑΤΣΙΟΥ",5,0]
["16-34329","ΜΕΓΚΟΥΛΗΣ ΣΤΑΥΡΟΣ","Α.Σ.ΟΛΥΜΠΙΑΚΟΥ ΧΩΡΙΟΥ Ο ΦΟΙΒΟΣ",5,0]
["16-26819","ΠΑΠΑΔΟΠΟΥΛΟΣ ΜΑΞΙΜΟΣ","Μ.Γ.Σ.ΑΠΟΛΛΩΝ ΚΑΛΑΜΑΡΙΑΣ",5,0]
["16-29366","ΠΑΥΛΟΠΟΥΛΟΣ ΔΙΟΝΥΣΙΟΣ","Ο.Α.ΚΑΛΑΜΑΤΑΣ",5,0]
["16-31078","ΤΕΡΖΟΠΟΥΛΟΣ ΚΩΝΣΤΑΝΤΙΝΟΣ","Α.Σ.ΠΕΡΑ",5,0]
["16-28119","ΦΙΛΙΠΠΟΥ ΣΤΑΜΑΤΗΣ","Ο.Α.ΑΝΑΦΛΥΣΤΟΣ ΣΑΡΩΝΙΔΑΣ",5,0]
["16-34331","ΧΩΡΙΑΝΟΠΟΥΛΟΣ ΣΤΕΦΑΝΟΣ","Α.Σ.ΟΛΥΜΠΙΑΚΟΥ ΧΩΡΙΟΥ Ο ΦΟΙΒΟΣ",5,0]
["16-33002","ΑΛΕΦΑΝΤΟΣ ΣΠΥΡΙΔΩΝ","Σ.Α.ΡΑΦΗΝΑΣ",4.5,0]
["16-32606","ΚΑΛΔΗΣ ΑΝΔΡΕΑΣ","Α.Σ.ΠΕΡΑ",4.5,0]
["16-28792","ΛΟΥΛΑΚΗΣ ΘΕΟΧΑΡΗΣ","Α.Ο.Α.ΠΑΠΑΓΟΥ",4.5,0]
["16-28939","ΝΤΑΟΠΟΥΛΟΣ ΚΩΝΣΤΑΝΤΙΝΟΣ","Ο.Α.ΙΩΛΚΟΣ ΒΟΛΟΥ",4.5,0]
["16-27667","ΤΟΥΡΝΑΤΖΗΣ ΑΘΑΝΑΣΙΟΣ","Ο.Α.ΚΕΡΑΤΣΙΝΙΟΥ",4.5,0]
["16-33746","ΑΝΤΩΝΟΠΟΥΛΟΣ ΚΩΝΣΤΑΝΤΙΝΟΣ","Α.Σ.ΑΚΑΔΗΜΙΕΣ ΠΡΩΤΑΘΛΗΤΩΝ ΠΕΥΚΩΝ",4,0]
["16-28417","ΖΕΡΒΟΣ ΙΩΑΝΝΗΣ","Ο.Α.ΒΙΚΕΛΑΣ ΒΕΡΟΙΑΣ",4,0]
["16-28945","ΚΑΚΑΚΗΣ ΒΑΣΙΛΕΙΟΣ-ΤΣΑΜΠΙΚΟΣ","ΡΟΔΙΑΚΟΣ Ο.Α.",4,0]
["16-24585","ΚΟΥΡΟΥΠΗΣ ΜΑΡΙΝΟΣ","Σ.Α.ΓΑΛΑΤΣΙΟΥ",4,0]
["16-31700","ΚΟΥΡΤΙΔΗΣ ΑΘΑΝΑΣΙΟΣ-ΧΡΗΣΤΟΣ","Α.Ο.ΧΡΥΣΟΥΠΟΛΗΣ",4,0]
["16-29094","ΚΩΣΤΑΣ ΒΛΑΧΟΥ  ΑΘΑΝΑΣΙΟΣ","Ο.Α.ΞΑΝΘΗΣ",4,0]
["16-29683","ΜΠΑΝΤΟΥΒΑΚΗΣ ΓΕΩΡΓΙΟΣ","Ο.Α.ΓΙΑΝΝΙΤΣΩΝ",4,0]
["16-32721","ΝΤΟΥΝΗΣ ΧΡΗΣΤΟΣ","Ο.Α.ΠΕΙΡΑΙΑ",4,0]
["16-33392","ΞΥΝΟΣ ΑΛΕΞΑΝΔΡΟΣ","Ο.Α.ΠΤΟΛΕΜΑΪΔΑΣ",4,0]
["16-33889","ΣΑΡΤΣΙΔΗΣ ΜΗΝΑΣ","Ο.Α.ΚΑΣΤΟΡΙΑΣ ΚΕΛΕΤΡΟΝ",4,0]
["16-29263","ΣΕΧΟΠΟΥΛΟΣ ΘΕΟΔΩΡΟΣ","Α.Ο.ΚΗΦΙΣΙΑΣ",4,0]
["16-29314","ΤΣΙΡΟΓΙΑΝΝΗΣ ΑΡΙΣΤΟΓΕΝΗΣ","Ο.Α.ΓΟΥΔΙΟΥ",4,0]
["16-27772","ΦΤΟΥΛΗΣ ΜΑΝΩΛΗΣ","Α.Σ.ΟΛΥΜΠΙΑΚΟΥ ΧΩΡΙΟΥ Ο ΦΟΙΒΟΣ",4,0]
["16-31008","ΘΩΜΑΣ ΡΑΦΑΗΛ","Α.Σ.ΠΕΡΑ",3.5,0]
["16-27019","ΧΡΙΣΤΟΦΟΡΙΔΗΣ ΙΩΑΝΝΗΣ-ΜΕΛΚΩΝ","Α.Σ.ΠΕΡΑ",3.5,0]
["16-29661","ΑΓΑΘΟΣ ΙΩΑΝΝΗΣ","Ο.Α.ΚΕΡΚΥΡΑΣ",3,0]
["16-29659","ΑΛΕΤΡΑΣ ΚΩΝΣΤΑΝΤΙΝΟΣ","Ο.Α.ΚΕΡΚΥΡΑΣ",3,0]
["16-34292","ΑΡΒΑΝΙΤΗΣ ΕΡΜΗΣ","ΑΙΟΛΟΣ Α.Λ.ΙΛΙΟΥ",3,0]
["16-25573","ΒΙΣΒΙΚΗΣ ΘΕΟΔΩΡΟΣ","Α.Κ.Α.ΜΑΡΑΘΩΝΑ",3,0]
["16-25399","ΒΛΟΓΙΑΡΗΣ ΓΡΗΓΟΡΗΣ","Μ.Γ.Σ.ΑΠΟΛΛΩΝ ΚΑΛΑΜΑΡΙΑΣ",3,0]
["16-33921","ΓΑΣΠΑΡΗΣ ΙΩΑΝΝΗΣ","Α.Ο.Α.ΗΛΙΟΥΠΟΛΗΣ",3,0]
["16-33869","ΖΟΥΡΙΔΑΚΗΣ ΔΗΜΗΤΡΙΟΣ","Α.Ο.Α.ΧΑΪΔΑΡΙΟΥ",3,0]
["16-26491","ΚΑΠΕΛΗΣ ΑΠΟΣΤΟΛΟΣ","Ο.Α.ΑΡΙΔΑΙΑΣ",3,0]
["16-27780","ΚΑΡΒΕΛΑΣ ΑΠΟΣΤΟΛΟΣ","Α.Σ.ΟΛΥΜΠΙΑΚΟΥ ΧΩΡΙΟΥ Ο ΦΟΙΒΟΣ",3,0]
["16-32264","ΚΑΡΥΔΗΣ ΦΩΤΗΣ","ΗΡΑΚΛΕΙΟ Ο.Α.& Α.",3,0]
["16-32092","ΚΟΝΤΑΚΤΣΗΣ ΛΑΖΑΡΟΣ","ΦΙΛΑΘΛΗΤ.ΣΥΛ.ΛΑΜΙΑΣ",3,0]
["16-34634","ΛΥΜΠΕΡΟΠΟΥΛΟΣ ΧΡΥΣΑΝΘΟΣ","Ο.Α.ΚΑΛΑΜΑΤΑΣ",3,0]
["16-28976","ΝΙΚΟΛΑΪΔΗΣ ΦΟΙΒΟΣ","Ο.Α.ΑΝΑΦΛΥΣΤΟΣ ΣΑΡΩΝΙΔΑΣ",3,0]
["16-32862","ΠΑΠΑΓΕΩΡΓΙΟΥ ΑΧΙΛΛΕΑΣ","Ο.Α.ΒΟΛΟΥ",3,0]
["16-31388","ΠΑΠΑΓΕΩΡΓΙΟΥ ΓΕΩΡΓΙΟΣ","Ο.Α.ΒΟΛΟΥ",3,0]
["16-29378","ΠΟΛΙΤΗΣ ΧΡΙΣΤΟΣ","Α.Ο.Α.ΧΑΪΔΑΡΙΟΥ",3,0]
["16-32948","ΠΡΑΤΙΚΑΚΗΣ ΕΜΜΑΝΟΥΗΛ","Ο.Α.ΞΑΝΘΗΣ",3,0]
["16-34320","ΡΑΜΑΝΤΑΝΗΣ ΝΙΚΟΛΑΟΣ","Ο.Α.ΣΟΦΑΔΩΝ ΚΑΡΔΙΤΣΑΣ",3,0]
["16-26456","ΣΠΑΝΟΥΔΑΚΗΣ ΠΑΥΛΟΣ-ΓΕΩΡΓΙΟΣ","Ο.Α.ΧΑΝΙΩΝ",3,0]
["16-33480","ΣΤΕΦΑΝΟΥ ΙΩΑΝΝΗΣ","Ο.Α.ΛΕΣΒΟΥ",3,0]
["16-28981","ΤΖΑΒΑΡΑΣ ΑΝΔΡΕΑΣ","Α.Ο.Α.ΠΑΤΡΩΝ",3,0]
["16-25400","ΤΣΟΓΚΑΣ ΔΙΟΝΥΣΗΣ","Μ.Γ.Σ.ΑΠΟΛΛΩΝ ΚΑΛΑΜΑΡΙΑΣ",3,0]
["16-28749","ΦΟΥΡΜΟΥΖΗΣ ΑΝΤΩΝΗΣ","Α.Ο.ΑΡΓΥΡΟΥΠΟΛΗΣ",3,0]
["16-28468","ΧΑΤΖΗΝΙΚΟΛΑΟΥ ΕΥΡΙΠΙΔΗΣ","Ο.Α.ΤΟΥΜΠΑΣ",3,0]
["16-28467","ΧΑΤΖΗΝΙΚΟΛΑΟΥ ΝΙΚΟΣ","Ο.Α.ΤΟΥΜΠΑΣ",3,0]
["16-30730","ΧΟΛΕΒΑΣ ΚΩΝ/ΝΟΣ","Ο.Α.ΑΙΓΙΑΛΕΙΑΣ",3,0]
["16-30405","ΓΚΙΩΝΗΣ ΔΗΜΗΤΡΗΣ","Ο.Α.ΚΑΙΣΑΡΙΑΝΗΣ",2.5,0]
["16-29735","ΤΑΛΙΟΥΡΗΣ ΓΕΩΡΓΙΟΣ","ΑΙΟΛΟΣ Α.Λ.ΙΛΙΟΥ",2.5,0]
["16-32501","ΤΖΙΕΡΑΣ ΙΑΣΟΝΑΣ","Α.Ο.ΒΑΡΗΣ ΑΝΑΓΥΡΟΥΣ",2.5,0]
["16-33271","ΤΣΟΥΜΑΝΗΣ ΓΕΩΡΓΙΟΣ-ΕΥΣΤΑΘΙΟΣ","Ο.Α.ΑΘΗΝΩΝ",2.5,0]
["16-30180","ΦΡΑΓΓΙΑΣ ΓΕΩΡΓΙΟΣ","Ο.Α.ΧΑΛΚΙΔΑΣ",2.5,0]
["16-28542","ΑΓΑΛΙΩΤΗΣ ΘΕΟΔΟΣΗΣ","Α.Ε.Τ.ΝΙΚΗ ΠΑΤΡΩΝ",2,0]
["16-32349","ΑΛΕΚΤΟΡΙΔΗΣ ΟΡΕΣΤΗΣ","Φ.Ο.Α.ΝΕΑΠΟΛΗΣ",2,0]
["16-29619","ΑΠΟΣΤΟΛΟΠΟΥΛΟΣ ΙΩΑΝΝΗΣ","Α.Σ.Α.ΑΓΡΙΝΙΟΥ",2,0]
["16-35175","ΑΠΟΣΤΟΛΟΥ ΙΩΑΝΝΗΣ","Α.Ο.Α.ΑΙΓΑΛΕΩ 92",2,0]
["16-24974","ΑΥΓΕΡΙΝΟΣ ΑΘΑΝΑΣΙΟΣ","Ο.Α.ΓΙΑΝΝΙΤΣΩΝ",2,0]
["16-33733","ΓΑΝΩΣΗΣ ΠΑΝΤΕΛΕΗΜΩΝ","Ο.Α.ΛΕΣΒΟΥ",2,0]
["16-34712","ΓΕΡΟΥ ΟΔΥΣΣΕΑΣ-ΑΓΓΕΛΟΣ","Α.Ο.ΚΑΛΛΙΤΕΧΝΟΥΠΟΛΗΣ",2,0]
["16-32905","ΓΚΕΣΟΥΛΗΣ ΑΡΙΣΤΟΤΕΛΗΣ","Ο.Α.ΙΩΑΝΝΙΝΩΝ",2,0]
["16-33949","ΓΛΕΝΤΗΣ ΚΩΝΣΤΑΝΤΙΝΟΣ","Ο.Α.ΑΓΙΑΣ ΠΑΡΑΣΚΕΥΗΣ",2,0]
["16-34633","ΔΙΟΝΥΣΟΠΟΥΛΟΣ ΑΛΕΞΑΝΔΡΟΣ","Ο.Α.ΚΑΛΑΜΑΤΑΣ",2,0]
["16-33508","ΕΥΑΓΓΕΛΙΔΗΣ ΕΥΑΓΓΕΛΟΣ","Α.Π.Ο.ΣΑΝΝΥ ΣΠΟΡΤΣ ΚΛΑΜΠ",2,0]
["16-33802","ΚΑΡΑΓΙΑΝΝΟΥΔΗΣ ΝΙΚΗΤΑΣ","Α.Σ.Α.ΠΑΝΟΡΑΜΑΤΟΣ",2,0]
["16-27785","ΚΑΡΒΕΛΑΣ ΣΩΤΗΡΗΣ","Α.Σ.ΟΛΥΜΠΙΑΚΟΥ ΧΩΡΙΟΥ Ο ΦΟΙΒΟΣ",2,0]
["16-34917","ΚΑΡΙΩΤΟΓΛΟΥ ΓΕΩΡΓΙΟΣ","Ο.Α.ΑΝΑΦΛΥΣΤΟΣ ΣΑΡΩΝΙΔΑΣ",2,0]
["16-33895","ΚΟΓΚΑΛΙΔΗΣ ΔΗΜΗΤΡΙΟΣ","Α.Ο.Α.ΠΟΣΕΙΔΩΝ ΘΕΣΣΑΛΟΝΙΚΗΣ",2,0]
["16-34332","ΚΩΣΤΑΚΗΣ ΒΑΣΙΛΕΙΟΣ","Ο.Α.ΚΟΥΦΑΛΙΩΝ ΘΕΣΣΑΛΟΝΙΚΗΣ",2,0]
["16-34675","ΚΩΤΣΑΝΤΑΣ ΑΝΤΩΝΗΣ","Ο.Α.ΧΑΛΚΙΔΑΣ",2,0]
["16-25930","ΛΑΣΚΑΡΑΤΟΣ ΑΧΙΛΛΕΑΣ","Α.Ο.Π.ΦΑΛΗΡΟΥ",2,0]
["16-29424","ΜΑΓΕΙΡΑΣ ΑΘΑΝΑΣΙΟΣ","Α.Σ.ΑΚΡΟΠΟΛΙΣ",2,0]
["16-28878","ΜΕΛΕΛΟΥΔΗΣ ΣΤΑΥΡΟΣ","Α.Ο.ΚΑΒΑΛΑΣ ΜΑΚΕΔΟΝΙΚΟΣ",2,0]
["16-27958","ΜΠΑΣΧΑΛΗΣ ΑΘΑΝΑΣΙΟΣ","Ο.Α.ΑΘΗΝΩΝ",2,0]
["16-34609","ΜΠΙΦΣΑΣ ΛΕΑΝΔΡΟΣ","Α.Σ.ΟΛΥΜΠΙΑΚΟΥ ΧΩΡΙΟΥ Ο ΦΟΙΒΟΣ",2,0]
["16-32495","ΜΠΟΥΤΙΚΟΣ ΧΡΗΣΤΟΣ","Γ.Ε.ΠΡΕΒΕΖΑΣ",2,0]
["16-31699","ΠΑΠΑΜΑΥΡΟΣ ΑΝΔΡΕΑΣ","Γ.Σ.ΚΗΦΙΣΙΑΣ",2,0]
["16-31263","ΠΑΠΠΑΣ ΝΙΚΟΣ","Α.Ο.Α.ΗΛΙΟΥΠΟΛΗΣ",2,0]
["16-34264","ΠΛΑΤΑΝΙΑΣ ΓΕΩΡΓΙΟΣ","Α.Σ.Α.ΑΓΡΙΝΙΟΥ",2,0]
["16-34369","ΠΡΑΤΙΚΑΚΗΣ ΧΡΗΣΤΟΣ","Σ.Α.ΓΑΛΑΤΣΙΟΥ",2,0]
["16-27221","ΤΑΤΣΑΚΗΣ ΝΙΚΟΛΑΟΣ","Ο.Α.ΘΕΣΠΡΩΤΙΑΣ ΤΙΤΑΝΗ",2,0]
["16-24815","ΤΣΑΚΙΡΗΣ ΙΩΑΝΝΗΣ","Ο.Α.ΛΕΣΒΟΥ",2,0]
["16-28548","ΤΣΙΓΓΕΛΗΣ ΚΩΝΣΤΑΝΤΙΝΟΣ","Α.Ε.Τ.ΝΙΚΗ ΠΑΤΡΩΝ",2,0]
["16-34472","ΤΣΙΜΠΙΔΗΣ ΑΛΕΞΑΝΔΡΟΣ","Α.Ο.Α.ΚΑΒΑΛΑΣ",2,0]
["16-30429","ΤΣΟΤΡΑΣ ΧΡΗΣΤΟΣ","ΠΕΥΚΗ Γ.ΚΑΛΟΒΕΛΩΝΗΣ",2,0]
["16-28150","ΦΛΩΡΟΣ ΝΙΚΟΛΑΟΣ","Ο.Α.ΕΥΟΣΜΟΥ ΘΕΣΣΑΛΟΝΙΚΗΣ",2,0]
["16-32700","ΑΝΤΩΝΑΚΟΣ ΧΑΡΑΛΑΜΠΟΣ","Ο.Α.ΚΕΡΑΤΣΙΝΙΟΥ",1,0]
["16-31684","ΓΚΟΤΣΗΣ ΕΥΑΓΓΕΛΟΣ","Ο.Α.ΙΩΑΝΝΙΝΩΝ",1,0]
["16-33595","ΔΑΝΔΟΥΛΑΚΗΣ ΙΩΑΝΝΗΣ","Ο.Α.ΚΙΛΚΙΣ",1,0]
["16-33401","ΚΟΥΤΑΛΑΚΗΣ ΝΙΚΟΛΑΟΣ-ΑΡΗΣ","Α.Ο.Α.ΑΤΤΙΚΟΣ ΗΛΙΟΣ",1,0]
["16-30750","ΛΑΪΝΑΣ ΓΕΩΡΓΙΟΣ-ΝΙΚΟΛΑΟΣ","Α.Ε.Τ.ΝΙΚΗ ΠΑΤΡΩΝ",1,0]
["16-32459","ΑΓΓΕΛΟΠΟΥΛΟΣ ΙΩΑΝΝΗΣ-ΒΛΑΣΙΟΣ","Α.Ο.Π.ΦΑΛΗΡΟΥ",0.5,0]
["16-34318","ΓΛΕΝΤΗΣ ΔΗΜΗΤΡΗΣ","Ο.Α.ΑΓΙΑΣ ΠΑΡΑΣΚΕΥΗΣ",0.5,0]
["16-27018","ΖΟΥΡΑΣ ΘΕΟΔΩΡΟΣ","Α.Σ.ΠΕΡΑ",0.5,0]
["16-32301","ΚΑΚΑΜΠΑΚΟΣ ΒΑΪΟΣ-ΑΝΔΡΕΑΣ","Α.Ο.Α.ΗΛΙΟΥΠΟΛΗΣ",0.5,0]
["16-28652","ΚΟΡΚΟΜΤΖΕΛΟΣ ΒΑΣΙΛΕΙΟΣ","Α.Ο.Α.ΗΛΙΟΥΠΟΛΗΣ",0.5,0]
["16-33901","ΠΟΛΥΧΡΟΝΟΠΟΥΛΟΣ ΑΡΜΑΝΔΟΣ","Α.Ο.Α.ΑΤΤΙΚΟΣ ΗΛΙΟΣ",0.5,0]
["16-32739","ΣΤΑΥΡΟΠΟΥΛΟΣ ΓΕΩΡΓΙΟΣ","Α.Ο.Α.ΗΛΙΟΥΠΟΛΗΣ",0.5,0]
["16-29603","ΑΡΑΝΙΤΗΣ ΚΩΝΣΤΑΝΤΙΝΟΣ","Α.Ο.Α.ΠΑΠΑΓΟΥ",0,0]
["16-29399","ΑΡΒΑΝΙΤΗΣ ΑΛΕΞΑΝΔΡΟΣ","Α.Κ.Α.ΜΑΡΑΘΩΝΑ",0,0]
["16-31542","ΒΕΝΝΟΣ ΑΡΗΣ","Γ.Α.Ε.ΤΡΙΦΥΛΙΑΣ ΔΙΩΝ ΚΥΠΑΡΙΣΣΕΥΣ",0,0]
["16-32487","ΓΑΪΤΑΝΑΡΟΣ ΤΗΛΕΜΑΧΟΣ","Γ.Ε.ΠΡΕΒΕΖΑΣ",0,0]
["16-24018","ΓΑΚΙΔΗΣ ΓΕΩΡΓΙΟΣ","Ο.Π.ΘΕΣΣΑΛΟΝΙΚΗΣ ΜΑΚΕΔΟΝΙΑ 92",0,0]
["16-29689","ΓΑΛΑΝΗΣ ΧΑΡΙΛΑΟΣ","Ο.Α.ΑΡΙΔΑΙΑΣ",0,0]
["16-32832","ΓΕΡΟΝΤΑΣ ΧΡΗΣΤΟΣ","Γ.Ε.ΠΡΕΒΕΖΑΣ",0,0]
["16-22585","ΓΚΑΡΤΖΩΝΗΣ ΛΑΜΠΡΟΣ","Α.Γ.Ο.ΦΙΛΙΠΠΙΑΔΑΣ",0,0]
["16-25876","ΓΚΙΝΑΛΗΣ ΔΗΜΗΤΡΙΟΣ","Ν.Ο.ΘΕΣΣΑΛΟΝΙΚΗΣ",0,0]
["16-25250","ΓΡΗΓΟΡΙΟΥ ΑΝΑΣΤΑΣΙΟΣ","Α.Ε.Κ.ΤΡΙΠΟΛΗΣ",0,0]
["16-31476","ΔΡΑΚΟΣ ΑΘΑΝΑΣΙΟΣ","Ο.Α.ΑΘΗΝΩΝ",0,0]
["16-28643","ΔΡΑΚΟΣ ΑΝΔΡΕΑΣ","Μ.Α.Σ.ΑΕΤΟΣ ΘΕΣΣΑΛΟΝΙΚΗΣ",0,0]
["16-28971","ΕΥΤΥΧΙΟΥ ΧΑΡΑΛΑΜΠΟΣ","Ο.Α.ΑΘΗΝΩΝ",0,0]
["16-32920","ΖΕΡΒΟΓΙΑΝΝΗΣ ΝΙΚΟΛΑΟΣ","Ε.Σ.Ο.ΕΠΙΚΟΥΡΟΣ ΠΟΛΙΧΝΗΣ",0,0]
["16-30851","ΙΒΑΝΟΥΔΗΣ ΔΗΜΗΤΡΙΟΣ","Ο.Α.ΚΟΥΦΑΛΙΩΝ ΘΕΣΣΑΛΟΝΙΚΗΣ",0,0]
["16-90128","ΙΓΚΝΙΑΤΟΒΙΤΣ ΜΑΡΤΙΝ","Σ.Α.ΓΑΛΑΤΣΙΟΥ",0,0]
["16-29828","ΚΑΖΑΝΤΖΗΣ ΓΕΡΑΣΙΜΟΣ","Ο.Α.ΑΘΗΝΩΝ",0,0]
["16-31743","ΚΑΝΤΖΑΒΕΛΟΣ ΜΙΧΑΗΛ","Α.Ε.Κ.ΤΡΙΠΟΛΗΣ",0,0]
["16-29854","ΚΟΥΤΣΙΚΟΣ ΒΑΣΙΛΕΙΟΣ","ΦΘΙΩΤΙΚΟΣ Ο.Α.",0,0]
["16-30155","ΛΑΜΠΡΟΠΟΥΛΟΣ ΠΑΝΑΓΙΩΤΗΣ","Α.Ε.Κ.ΤΡΙΠΟΛΗΣ",0,0]
["16-29114","ΛΟΥΤΡΙΑΝΑΚΗΣ ΕΥΑΓΓΕΛΟΣ","Α.Α.ΑΙΓΑΛΕΩ",0,0]
["16-30312","ΜΕΝΕΞΕΛΗΣ ΟΔΥΣΣΕΑΣ","Ο.Α.ΑΓΙΑΣ ΠΑΡΑΣΚΕΥΗΣ",0,0]
["16-31714","ΜΙΧΑΗΛΙΔΗΣ ΕΥΣΤΡΑΤΙΟΣ","Α.Ο.Α.ΣΤΑΥΡΟΥΠΟΛΗΣ ΙΦΙΤΟΣ",0,0]
["16-28970","ΜΟΡΦΟΝΙΟΣ ΓΕΩΡΓΙΟΣ","Α.Σ.ΠΕΡΑ",0,0]
["16-33584","ΜΟΥΖΑΚΗΣ ΒΑΣΙΛΕΙΟΣ","Σ.Α.ΡΑΦΗΝΑΣ",0,0]
["16-26896","ΜΠΑΜΙΔΗΣ ΑΘΑΝΑΣΙΟΣ","ΦΘΙΩΤΙΚΟΣ Ο.Α.",0,0]
["16-31990","ΜΠΑΜΠΑΡΟΥΤΣΗΣ ΦΩΤΙΟΣ","Α.Ο.ΑΤΛΑΝΤΙΣ",0,0]
["16-28555","ΜΠΑΡΔΟΥΛΗΣ ΑΠΟΣΤΟΛΟΣ","Ο.Α.ΞΥΛΟΚΑΣΤΡΟΥ ΣΥΘΑΣ",0,0]
["16-31591","ΜΠΑΡΤΖΟΣ-ΝΑΖΙΡΗΣ ΑΛΕΞΑΝΔΡΟΣ","Α.Ο.ΑΤΡΟΜΗΤΟΣ ΤΡΙΑΔΙΟΥ",0,0]
["16-34661","ΝΙΚΟΛΑΚΑΚΗΣ ΟΡΕΣΤΗΣ","ΠΑΝΕΛΛΗΝΙΟΣ Γ.Σ.",0,0]
["16-29686","ΠΑΝΤΕΛΙΟΣ ΝΙΚΟΛΑΟΣ","Ο.Α.ΚΕΡΚΥΡΑΣ",0,0]
["16-34445","ΠΑΠΑΚΥΡΙΑΚΟΥ ΜΙΧΑΛΗΣ","Α.Ο.ΒΑΡΗΣ ΑΝΑΓΥΡΟΥΣ",0,0]
["16-29763","ΠΑΠΥΡΑΚΗΣ ΚΩΣΤΑΣ","ΗΡΑΚΛΕΙΟ Ο.Α.& Α.",0,0]
["16-28129","ΠΑΥΛΙΔΗΣ ΘΕΟΔΟΣΙΟΣ","Ο.Α.ΘΕΣΣΑΛΟΝΙΚΗΣ",0,0]
["16-29808","ΡΟΖΟΣ ΝΙΚΟΛΑΟΣ","Ο.Α.ΙΩΑΝΝΙΝΩΝ",0,0]
["16-30060","ΡΟΥΜΠΗΣ ΑΛΕΞΑΝΔΡΟΣ","Ο.Α.ΧΑΛΚΙΔΑΣ",0,0]
["16-29859","ΡΩΪΜΠΑΣ ΑΛΕΞΑΝΔΡΟΣ","ΦΘΙΩΤΙΚΟΣ Ο.Α.",0,0]
["16-30054","ΣΑΚΕΛΛΑΡΙΔΗΣ ΜΙΧΑΛΗΣ","Ο.Α.ΑΓΙΑΣ ΠΑΡΑΣΚΕΥΗΣ",0,0]
["16-32558","ΣΑΜΟΪΛΗΣ ΓΕΡΑΣΙΜΟΣ","Ο.Α.ΚΕΡΚΥΡΑΣ",0,0]
["16-24455","ΤΑΡΑΜΟΝΛΗΣ ΔΗΜΟΣΘΕΝΗΣ","Γ.Α.Σ.ΚΑΡΑΤΕ ΕΡΜΗΣ",0,0]
["16-29855","ΤΕΡΤΙΓΚΑΣ ΔΗΜΗΤΡΙΟΣ","ΦΘΙΩΤΙΚΟΣ Ο.Α.",0,0]
["16-29829","ΤΖΕΝΕΤΟΠΟΥΛΟΣ ΜΑΤΕΟ","ΠΕΥΚΗ Γ.ΚΑΛΟΒΕΛΩΝΗΣ",0,0]
["16-32055","ΤΖΟΥΛΙΑΝΑ ΔΑΥΙΔ-ΧΡΗΣΤΟΣ","Ο.Α.ΒΡΙΛΗΣΣΙΩΝ",0,0]
["16-30918","ΤΡΙΑΝΤΑΦΥΛΛΙΔΗΣ-ΚΟΥΛΟΥΡΙΩΤΗΣ ΕΥΣΤΑΘΙΟΣ","Ε.Σ.Ο.ΕΠΙΚΟΥΡΟΣ ΠΟΛΙΧΝΗΣ",0,0]
["16-30911","ΤΣΑΚΑΛΑΚΗΣ ΝΙΚΟΛΑΟΣ","ΗΡΑΚΛΕΙΟ Ο.Α.& Α.",0,0]
["16-33281","ΤΣΑΚΙΡΗΣ ΣΤΕΦΑΝΟΣ","Α.Ο.Α.ΦΙΛΟΘΕΗΣ",0,0]
["16-30608","ΤΣΙΑΔΗΜΟΣ ΡΑΦΑΗΛ","Γ.Σ.ΕΛΕΥΘΕΡΙΟΥ ΚΟΡΔ.ΑΡΓΟΝΑΥΤΕΣ",0,0]
["16-30089","ΦΟΥΝΤΗΣ ΚΩΝΣΤΑΝΤΙΝΟΣ","Α.Ο.Α.ΧΑΪΔΑΡΙΟΥ",0,0]
["16-31279","ΧΑΡΑΛΑΜΠΙΔΗΣ ΓΕΩΡΓΙΟΣ","Ο.Α.ΠΟΛΥΚΑΣΤΡΟΥ",0,0]
["16-34498","ΧΡΙΣΤΟΔΟΥΛΟΠΟΥΛΟΣ ΔΗΜΟΣΘΕΝΗΣ","Α.Α.ΑΙΓΑΛΕΩ",0,0]
["16-29677","ΨΑΡΑΥΤΗΣ ΝΙΚΟΛΑΟΣ","Σ.Φ.Α.ΜΕΛΙΣΣΙΩΝ Ο ΦΟΙΒΟΣ",0,0]
["16-90116","ΑΜΜΕΡΜΑΝ ΣΤΕΦΑΝΟΣ","Ο.Α.ΑΘΛΗΤ.ΠΑΙΔΕΙΑ",0,0]
["16-26914","ΒΡΑΝΑΣ ΘΕΜΗΣ","Α.Ο.Α.ΦΙΛΟΘΕΗΣ",0,0]
["16-31254","ΓΙΑΝΝΟΥΤΣΟΣ ΘΕΟΔΩΡΟΣ","Α.Σ.ΑΚΡΟΠΟΛΙΣ",0,0]
["16-24994","ΚΑΛΙΦΑΤΙΔΗΣ ΧΡΗΣΤΟΣ","ΠΑΝΘΡΑΚΙΚΟΣ Ο.Α.ΚΟΜΟΤΗΝΗΣ",0,0]
["16-32743","ΚΑΝΕΛΛΟΠΟΥΛΟΣ ΔΗΜΗΤΡΗΣ","Ο.Α.ΓΛΥΦΑΔΑΣ",0,0]
["16-30800","ΜΑΡΙΝΟΣ ΝΙΚΟΛΑΟΣ","Ο.Α.ΠΕΤΡΟΥΠΟΛΗΣ",0,0]
["16-30188","ΜΟΥΤΣΑΤΣΟΣ ΝΙΚΟΛΑΟΣ","Ο.Α.ΧΑΛΚΙΔΑΣ",0,0]
["16-32850","ΝΤΙΝΟΥ ΠΑΡΑΣΚΕΥΑΣ","Α.Ο.Α.ΗΛΙΟΥΠΟΛΗΣ",0,0]
["16-28787","ΠΑΠΑΖΟΓΛΟΥ ΙΩΑΝΝΗΣ","Ο.Α.ΓΛΥΦΑΔΑΣ",0,0]
["16-25082","ΠΑΤΕΛΗΣ ΓΕΩΡΓΙΟΣ","Α.Ν.Ο.ΓΛΥΦΑΔΑΣ",0,0]
["16-34139","ΠΟΛΙΤΗΣ ΗΛΙΑΣ","Α.Ο.Α.ΑΙΓΑΛΕΩ 92",0,0]
["16-30066","ΣΕΚΛΕΙΖΙΩΤΗΣ ΒΑΣΙΛΗΣ","Ο.Α.ΚΕΡΑΤΣΙΝΙΟΥ",0,0]
["16-33321","ΣΤΑΜΑΤΙΟΥ ΑΓΓΕΛΟΣ","Ο.Α.ΑΘΛΗΤ.ΠΑΙΔΕΙΑ",0,0]
["16-29286","ΦΕΛΕΜΕΓΚΑΣ ΝΙΚΟΣ","Α.Ο.Π.ΦΑΛΗΡΟΥ",0,0]
["16-33143","ΔΙΟΝΥΣΟΠΟΥΛΟΣ ΜΑΡΙΟΣ","Ε.Σ.Ο.ΕΠΙΚΟΥΡΟΣ ΠΟΛΙΧΝΗΣ",0,0]
["16-26409","ΚΟΥΜΠΑΡΟΣ ΙΩΑΝΝΗΣ","Α.Ο.Α.ΠΡΩΤΑΘΛ.ΚΑΒΑΛΑΣ",0,0]
["16-30874","ΛΙΑΚΑΤΣΙΔΑΣ ΙΩΑΝΝΗΣ","Α.Ο.Π.ΦΑΛΗΡΟΥ",0,0]
["16-30058","ΜΕΡΚΟΥΡΗΣ ΓΕΩΡΓΙΟΣ","Ο.Α.ΚΕΡΑΤΣΙΝΙΟΥ",0,0]
["16-31644","ΜΠΕΛΛΟΣ ΝΙΚΟΛΑΣ","Α.Σ.ΠΕΡΑ",0,0]
["18-25438","ΤΣΙΤΣΙΠΑΣ ΣΤΕΦΑΝΟΣ","Ο.Α.ΓΛΥΦΑΔΑΣ",850,0]
["18-23775","ΑΝΤΩΝΟΠΟΥΛΟΣ ΧΡΗΣΤΟΣ","Ο.Α.ΚΕΡΑΤΣΙΝΙΟΥ",820,0]
["18-24845","ΗΛΙΟΠΟΥΛΟΣ ΒΑΣΙΛΗΣ","Α.Ο.Α.ΦΙΛΟΘΕΗΣ",750,0]
["18-21565","ΘΕΟΔΩΡΟΥ ΕΛΕΥΘΕΡΙΟΣ","Α.Ο.Α.ΦΙΛΟΘΕΗΣ",707.5,0]
["18-23517","ΤΣΙΡΑΝΙΔΗΣ ΕΥΣΤΑΘΙΟΣ","Ο.Α.ΚΑΣΤΟΡΙΑΣ ΚΕΛΕΤΡΟΝ",570,0]
["18-22979","ΣΧΙΝΑΣ ΣΤΕΦΑΝΟΣ","Α.Ο.Α.ΦΙΛΟΘΕΗΣ",567.5,0]
["18-22341","ΠΑΠΑΪΩΑΝΝΟΥ ΙΩΑΝΝΗΣ","Α.Ο.Α.ΧΑΪΔΑΡΙΟΥ",507.5,0]
["18-24586","ΓΚΟΝΤΣΑΡΗΣ ΣΤΥΛΙΑΝΟΣ","Ο.Α.ΘΕΣΣΑΛΟΝΙΚΗΣ",502.5,0]
["18-23042","ΣΚΑΛΙΔΑΚΗΣ ΔΗΜΗΤΡΙΟΣ","Ο.Α.ΧΑΝΙΩΝ",490,0]
["18-25875","ΛΑΖΑΡΙΔΗΣ ΚΩΝΣΤΑΝΤΙΝΟΣ","Ο.Α.ΕΥΟΣΜΟΥ ΘΕΣΣΑΛΟΝΙΚΗΣ",464,0]
["18-24695","ΣΙΡΠΟΣ ΠΟΛΥΧΡΟΝΗΣ","Ο.Α.ΘΕΣΣΑΛΟΝΙΚΗΣ",454.5,0]
["18-20650","ΚΟΥΡΑΣΗΣ ΔΗΜΗΤΡΙΟΣ","Α.Ο.Α.ΑΤΤΙΚΟΣ ΗΛΙΟΣ",440,0]
["18-24547","ΜΑΝΕΚΑΣ ΑΘΑΝΑΣΙΟΣ","Ο.Α.ΙΩΑΝΝΙΝΩΝ",422,0]
["18-26317","ΚΩΣΤΑΡΑΣ ΠΑΝΑΓΙΩΤΗΣ","Ο.Α.ΠΕΤΡΟΥΠΟΛΗΣ",416,0]
["18-23661","ΦΩΤΕΙΝΟΠΟΥΛΟΣ ΚΩΝΣΤΑΝΤΙΝΟΣ","Α.Ο.Α.ΗΛΙΟΥΠΟΛΗΣ",392,0]
["18-22969","ΚΑΝΕΛΛΟΠΟΥΛΟΣ ΑΛΕΞΑΝΔΡΟΣ","Α.Ο.ΤΑΤΟΪΟΥ",348,0]
["18-25690","ΓΚΑΝΙΟΣ ΑΝΤΩΝΙΟΣ","Α.Ο.Α.ΗΛΙΟΥΠΟΛΗΣ",342.5,0]
["18-25297","ΚΑΠΙΡΗΣ ΣΤΑΜΑΤΗΣ","Α.Ο.Α.ΗΛΙΟΥΠΟΛΗΣ",336,0]
["18-26297","ΑΓΙΟΥΣ ΓΕΩΡΓΙΟΣ","ΚΕΡΚΥΡΑΪΚΗ Λ.Τ.",335,0]
["18-23040","ΚΑΤΣΑΛΗΣ ΚΩΝΣΤΑΝΤΙΝΟΣ","Ο.Α.ΛΙΤΟΧΩΡΟΥ",318.5,0]
["18-30186","ΠΙΤΣΙΝΗΣ ΔΗΜΗΤΡΙΟΣ","Ο.Α.ΚΕΡΑΤΣΙΝΙΟΥ",300,0]
["18-27951","ΣΚΟΡΙΛΑΣ ΑΛΕΞΑΝΔΡΟΣ","ΑΚΑΔ.ΑΝΤΙΣΦ.ΙΩΑΝΝΙΝΩΝ",300,0]
["18-22082","ΤΑΡΑΜΟΝΛΗΣ ΙΩΑΝΝΗΣ","Ε.Σ.Ο.ΕΠΙΚΟΥΡΟΣ ΠΟΛΙΧΝΗΣ",287.5,0]
["18-27180","ΣΤΑΥΡΑΚΑΣ ΜΙΝΩΣ-ΚΙΜΩΝ","Α.Ο.ΚΗΦΙΣΙΑΣ",278,0]
["18-23234","ΚΑΖΑΝΤΖΗΣ ΜΙΧΑΗΛ-ΤΟΥΒ","Ο.Α.ΑΘΗΝΩΝ",270,0]
["18-26603","ΔΕΛΗΣ ΑΝΔΡΕΑΣ-ΑΛΕΞΑΝΔΡΟΣ","ΡΗΓΑΣ Α.Ο.Α.ΑΡΓΟΛΙΔΑΣ",268,0]
["18-22999","ΚΑΛΝΤΓΟΥΕΛ ΑΛΕΞΑΝΔΡΟΣ-ΒΑΣΙΛΕΙΟΣ","Α.Κ.Α.ΜΑΡΑΘΩΝΑ",266,0]
["18-22876","ΓΕΡΟΥΚΗΣ ΒΑΣΙΛΕΙΟΣ","Ο.Α.ΝΙΚΑΙΑ ΛΑΡΙΣΑΣ",264,0]
["18-22029","ΚΑΡΑΜΑΝΗΣ ΑΘΑΝΑΣΙΟΣ","Α.Ο.Α.ΧΑΪΔΑΡΙΟΥ",247.5,0]
["18-22965","ΚΟΡΔΟΣ ΓΙΑΝΝΗΣ","Ο.Α.ΓΛΥΦΑΔΑΣ",242,0]
["18-24766","ΣΤΑΜΑΤΙΑΔΗΣ ΓΙΩΡΓΟΣ","Ο.Α.ΘΕΣΣΑΛΟΝΙΚΗΣ",237.5,0]
["18-22183","ΚΑΡΑΓΙΑΝΝΙΔΗΣ ΦΡΑΝΤΖΕΣΚΟΣ","Α.Ο.Α.ΧΑΪΔΑΡΙΟΥ",230,0]
["18-21567","ΜΠΕΡΤΟΛΗΣ ΓΕΩΡΓΙΟΣ","Α.Κ.Α.ΜΑΡΑΘΩΝΑ",229.5,0]
["18-26190","ΑΝΔΡΩΝΗΣ ΙΩΑΝΝΗΣ","Ο.Α.ΑΓΙΑΣ ΠΑΡΑΣΚΕΥΗΣ",229,0]
["18-29652","ΚΟΣΚΙΝΑΣ ΝΙΚΟΛΑΟΣ","ΚΕΡΚΥΡΑΪΚΗ Λ.Τ.",228,0]
["18-24054","ΙΩΑΝΝΙΔΗΣ ΠΑΝΤΕΛΕΗΜΩΝ","Ο.Α.ΑΓΙΑΣ ΠΑΡΑΣΚΕΥΗΣ",227.5,0]
["18-23857","ΚΑΝΙΑΡΗΣ ΧΑΡΑΛΑΜΠΟΣ","Α.Ο.Α.ΧΑΪΔΑΡΙΟΥ",226,0]
["18-22866","ΚΟΝΤΟΠΟΥΛΟΣ ΘΕΟΦΑΝΗΣ","Ο.Α.ΚΕΡΑΤΣΙΝΙΟΥ",226,0]
["18-25240","ΔΗΜΟΠΟΥΛΟΣ ΜΑΡΙΟΣ-ΠΛΑΤΩΝ","Α.Ε.Τ.ΝΙΚΗ ΠΑΤΡΩΝ",224,0]
["18-23192","ΚΟΥΤΣΑΦΤΗΣ ΑΠΟΣΤΟΛΟΣ","Α.Σ.ΑΚΡΟΠΟΛΙΣ",220,0]
["18-26459","ΝΑΟΥΜ ΣΠΥΡΙΔΩΝ","Ο.Α.ΧΑΝΙΩΝ",218,0]
["18-22396","ΓΑΛΕΝΙΑΝΟΣ ΓΕΩΡΓΙΟΣ","Ο.Α.ΑΘΗΝΩΝ",214,0]
["18-23357","ΑΝΔΡΟΥΤΣΕΛΗΣ ΑΛΕΞΙΟΣ","Α.Ο.Α.ΠΑΤΡΩΝ",204.5,0]
["18-24184","ΚΑΛΠΑΚΙΔΗΣ ΙΩΑΝΝΗΣ","Γ.Ο.ΠΕΡΙΣΤΕΡΙΟΥ Γ.ΠΑΛΑΣΚΑΣ",200,0]
["18-23662","ΤΑΣΟΥΛΗΣ ΒΑΣΙΛΕΙΟΣ","Α.Ο.Α.ΗΛΙΟΥΠΟΛΗΣ",198,0]
["18-23425","ΧΡΗΣΤΟΥ ΓΙΑΝΝΗΣ","Α.Ο.Α.ΧΑΪΔΑΡΙΟΥ",197.5,0]
["18-26210","ΚΟΝΤΩΣΗΣ ΓΕΩΡΓΙΟΣ","Α.Ο.Α.ΦΙΛΟΘΕΗΣ",192,0]
["18-24165","ΠΕΡΔΙΚΟΓΙΑΝΝΗΣ ΣΤΥΛΙΑΝΟΣ","ΗΡΑΚΛΕΙΟ Ο.Α.& Α.",190,0]
["18-28405","ΚΑΡΔΑΡΗΣ ΑΝΔΡΕΑΣ","Ο.Α.ΑΘΗΝΩΝ",186,0]
["18-25503","ΠΑΡΑΣΧΑΚΗΣ ΝΙΚΟΛΑΟΣ","Ο.Α.ΜΑΓΝΗΣΙΑΣ",181,0]
["18-26389","ΒΑΡΔΑΚΗΣ ΒΑΣΙΛΕΙΟΣ","ΑΚΑΔ.ΑΝΤΙΣΦ.ΙΩΑΝΝΙΝΩΝ",179,0]
["18-25914","ΑΛΕΒΙΖΟΠΟΥΛΟΣ ΦΙΛΙΠΠΟΣ","Ο.Α.ΓΛΥΦΑΔΑΣ",176,0]
["18-28144","ΚΑΛΑΜΠΑΚΑΣ ΑΝΑΣΤΑΣΙΟΣ","Ο.Α.ΦΟΙΒΟΣ ΛΑΡΙΣΑΣ",175.5,0]
["18-26259","ΓΙΑΝΝΑΚΟΠΟΥΛΟΣ ΓΙΩΡΓΟΣ","Α.Ο.Α.ΧΑΪΔΑΡΙΟΥ",175,0]
["18-26457","ΑΡΕΤΑΚΗΣ ΙΩΑΝΝΗΣ","Ο.Α.ΧΑΝΙΩΝ",174,0]
["18-28108","ΦΛΩΡΕΝΤΙΑΔΗΣ ΜΑΡΚΟΣ","ΠΕΥΚΗ Γ.ΚΑΛΟΒΕΛΩΝΗΣ",174,0]
["18-33389","ΚΑΜΗΛΑΡΑΚΗΣ ΙΩΑΝΝΗΣ","Ο.Α.ΝΙΚΑΙΑ ΛΑΡΙΣΑΣ",172.5,0]
["18-28426","ΦΩΤΕΙΝΟΠΟΥΛΟΣ ΙΩΑΝΝΗΣ","Α.Ο.Α.ΗΛΙΟΥΠΟΛΗΣ",171,0]
["18-25296","ΣΠΑΘΗΣ ΜΑΡΙΝΟΣ","Ο.Α.ΑΘΗΝΩΝ",170,0]
["18-23091","ΝΙΚΟΛΟΥΛΗΣ ΚΩΝΣΤΑΝΤΙΝΟΣ","Ο.Α.ΝΙΚΑΙΑ ΛΑΡΙΣΑΣ",169.5,0]
["18-29817","ΝΙΑΡΧΟΣ ΝΙΚΗΤΑΣ","Ο.Α.ΑΘΛΗΤ.ΠΑΙΔΕΙΑ",166,0]
["18-24053","ΙΩΑΝΝΙΔΗΣ ΙΩΑΝΝΗΣ","Ο.Α.ΑΓΙΑΣ ΠΑΡΑΣΚΕΥΗΣ",164,0]
["18-24168","ΜΙΧΑΗΛΟΣ ΣΤΕΦΑΝΟΣ","ΗΡΑΚΛΕΙΟ Ο.Α.& Α.",164,0]
["18-25273","ΤΣΟΝΑΚΗΣ ΚΩΝΣΤΑΝΤΙΝΟΣ","Α.Ο.Α.ΠΑΠΑΓΟΥ",162,0]
["18-26885","ΚΑΠΕΡΩΝΗΣ ΣΠΥΡΙΔΩΝ","Ο.Α.ΡΙΟΥ",160,0]
["18-26533","ΖΕΡΔΙΛΑΣ ΑΙΤΟΡ","Ο.Α.ΠΕΤΡΟΥΠΟΛΗΣ",159,0]
["18-27583","ΠΑΧΑΚΗΣ ΝΙΚΟΛΑΟΣ-ΑΝΔΡΕΑΣ","Ο.Α.ΑΘΗΝΩΝ",159,0]
["18-22834","ΑΔΑΛΟΓΛΟΥ ΛΑΖΑΡΟΣ","Ε.Σ.Ο.ΕΠΙΚΟΥΡΟΣ ΠΟΛΙΧΝΗΣ",158,0]
["18-21763","ΠΑΤΡΙΚΙΟΣ ΝΙΚΟΛΑΟΣ","Σ.Α.ΣΕΡΡΩΝ",158,0]
["18-25351","ΔΙΑΜΑΝΤΟΠΟΥΛΟΣ ΓΙΩΡΓΟΣ","Ο.Α.ΑΘΗΝΩΝ",156,0]
["18-24171","ΚΕΛΑΪΔΗΣ ΚΑΡΛΟΣ","Ο.Α.ΓΛΥΦΑΔΑΣ",156,0]
["18-22012","ΚΟΜΜΑΤΑΣ ΣΤΕΦΑΝΟΣ","Α.Ο.Α.ΧΑΪΔΑΡΙΟΥ",156,0]
["18-27879","ΚΙΣΣΑΣ ΧΡΗΣΤΟΣ-ΕΥΑΓΓΕΛΟΣ","Α.Ο.ΣΙΚΥΩΝΟΣ ΚΙΑΤΟΥ",154,0]
["18-27398","ΚΟΤΣΑΡΙΝΗΣ ΒΑΣΙΛΕΙΟΣ","Α.Γ.Ο.ΦΙΛΙΠΠΙΑΔΑΣ",152,0]
["18-27371","ΤΣΙΤΣΙΠΑΣ ΠΕΤΡΟΣ","Ο.Α.ΓΛΥΦΑΔΑΣ",146.5,0]
["18-27656","ΝΑΣΙΟΠΟΥΛΟΣ ΓΕΩΡΓΙΟΣ","Ο.Α.ΑΘΗΝΩΝ",144,0]
["18-29274","ΣΗΜΑΙΟΦΟΡΙΔΗΣ ΧΑΡΑΛΑΜΠΟΣ","ΠΕΥΚΗ Γ.ΚΑΛΟΒΕΛΩΝΗΣ",143,0]
["18-24470","ΚΟΚΚΙΝΑΚΗΣ ΙΩΑΝΝΗΣ-ΜΑΡΙΟΣ","Ο.Α.ΣΟΥΔΑΣ",142,0]
["18-21892","ΔΕΜΕΝΕΓΑΣ ΝΙΚΟΛΑΟΣ","Α.Κ.Α.ΜΑΡΑΘΩΝΑ",140,0]
["18-26604","ΔΕΛΗΣ ΧΡΙΣΤΟΣ-ΕΡΡΙΚΟΣ","ΡΗΓΑΣ Α.Ο.Α.ΑΡΓΟΛΙΔΑΣ",132,0]
["18-25274","ΝΕΔΕΛΤΣΟΣ ΣΤΕΦΑΝΟΣ","Α.Ο.Α.ΗΛΙΟΥΠΟΛΗΣ",132,0]
["18-29081","ΣΤΥΛΙΑΝΟΥΔΑΚΗΣ ΕΥΑΓΓΕΛΟΣ","Ο.Α.ΚΕΡΑΤΣΙΝΙΟΥ",132,0]
["18-25976","ΣΤΑΥΡΟΠΟΥΛΟΣ ΔΗΜΗΤΡΗΣ","Ο.Α.ΑΘΗΝΩΝ",130,0]
["18-23093","ΚΑΛΔΕΡΩΝ ΖΑΚ","Ο.Α.ΝΙΚΑΙΑ ΛΑΡΙΣΑΣ",129.5,0]
["18-23109","ΧΑΤΖΗΣΤΟΥΓΙΑΝΝΗΣ ΔΗΜΗΤΡΙΟΣ","Σ.Α.ΣΕΡΡΩΝ",129.5,0]
["18-28357","ΕΞΙΖΙΔΗΣ-ΜΑΓΙΕΡ ΤΕΪΛΟΡ","Ο.Α.ΑΛΕΞΑΝΔΡΟΣ ΒΕΡΟΙΑΣ",128,0]
["18-28020","ΛΥΜΠΕΡΗΣ ΑΛΕΞΑΝΔΡΟΣ","Α.Ο.Α.ΦΙΛΟΘΕΗΣ",128,0]
["18-29258","ΜΠΑΛΤΑΓΙΑΝΝΗΣ ΝΙΚΟΛΑΟΣ","Ο.Α.ΝΙΚΑΙΑ ΛΑΡΙΣΑΣ",123,0]
["18-23025","ΦΡΑΓΚΟΥΛΗΣ ΒΑΣΙΛΗΣ","Α.Ο.ΑΡΓΥΡΟΥΠΟΛΗΣ",122.5,0]
["18-29122","ΑΛΕΞΙΟΥ ΔΗΜΗΤΡΙΟΣ","Ο.Α.ΑΘΗΝΩΝ",122,0]
["18-26497","ΠΙΠΕΡΗΣ ΚΩΝΣΤΑΝΤΙΝΟΣ","Ο.Α.ΕΥΟΣΜΟΥ ΘΕΣΣΑΛΟΝΙΚΗΣ",122,0]
["18-24346","ΣΤΑΡΑΤΖΗΣ ΔΗΜΗΤΡΙΟΣ","Α.Ο.Α.ΦΙΛΟΘΕΗΣ",122,0]
["18-25295","ΣΒΗΓΚΑΣ ΠΑΝΑΓΙΩΤΗΣ","Α.Ο.Α.ΗΛΙΟΥΠΟΛΗΣ",118,0]
["18-26836","ΦΟΥΖΑΣ ΑΝΑΣΤΑΣΙΟΣ","ΠΕΥΚΗ Γ.ΚΑΛΟΒΕΛΩΝΗΣ",117,0]
["18-25243","ΜΑΡΟΥΛΗΣ ΧΑΡΑΛΑΜΠΟΣ","Α.Ο.Α.ΠΑΤΡΩΝ",116,0]
["18-22842","ΤΣΑΡΚΝΙΑΣ ΣΤΕΡΓΙΟΣ","Ο.Α.ΑΡΙΔΑΙΑΣ",114,0]
["18-24511","ΙΩΑΝΝΙΔΗΣ ΝΙΚΟΛΑΟΣ","Α.Ο.Α.ΦΙΛΟΘΕΗΣ",112,0]
["18-25241","ΚΑΡΑΓΙΑΝΝΗΣ ΒΑΣΙΛΗΣ","Α.Ε.Τ.ΝΙΚΗ ΠΑΤΡΩΝ",112,0]
["18-22860","ΤΣΑΚΙΔΗΣ ΓΕΩΡΓΙΟΣ","Ο.Α.ΘΕΣΣΑΛΟΝΙΚΗΣ",112,0]
["18-28337","ΚΑΪΜΑΡΑΣ ΧΡΗΣΤΟΣ","Α.Κ.Α.ΜΑΡΑΘΩΝΑ",106,0]
["18-27841","ΠΑΠΑΪΩΑΝΝΟΥ ΟΔΥΣΣΕΑΣ","Α.Ο.Α.ΣΤΑΥΡΟΥΠΟΛΗΣ ΙΦΙΤΟΣ",106,0]
["18-30190","ΜΑΤΣΟΥΚΑΣ ΙΩΑΝΝΗΣ","Ο.Α.ΧΑΛΚΙΔΑΣ",103.5,0]
["18-25502","ΣΩΤΗΡΟΠΟΥΛΟΣ ΔΗΜΗΤΡΙΟΣ","Ο.Α.ΜΑΓΝΗΣΙΑΣ",103,0]
["18-28083","ΧΡΙΣΤΟΔΟΥΛΟΥ ΒΕΛΙΣΣΑΡΙΟΣ","Α.Ο.Α.ΦΙΛΟΘΕΗΣ",103,0]
["18-29711","ΜΠΙΛΛΗΣ ΑΘΑΝΑΣΙΟΣ","ΠΕΥΚΗ Γ.ΚΑΛΟΒΕΛΩΝΗΣ",102,0]
["18-23491","ΤΣΑΡΚΝΙΑΣ ΝΙΚΟΛΑΟΣ","Ο.Α.ΑΡΙΔΑΙΑΣ",102,0]
["18-20560","ΚΑΛΟΓΡΑΝΑΣ ΒΑΣΙΛΕΙΟΣ","Ο.Α.ΤΡΙΚΑΛΩΝ",100,0]
["18-28356","ΕΞΙΖΙΔΗΣ-ΜΑΓΙΕΡ ΤΖΕΪΣΟΝ-ΒΙΛΛΥ","Ο.Α.ΑΛΕΞΑΝΔΡΟΣ ΒΕΡΟΙΑΣ",99,0]
["18-26427","ΦΡΙΣΗΡΑΣ ΣΤΕΦΑΝΟΣ","Ο.Α.ΑΘΛΗΤ.ΠΑΙΔΕΙΑ",99,0]
["18-22402","ΡΑΠΤΗΣ ΓΡΗΓΟΡΗΣ","ΦΙΛΑΘΛΗΤ.ΣΥΛ.ΛΑΜΙΑΣ",98,0]
["18-28330","ΛΕΟΝΤΑΡΙΔΗΣ ΔΗΜΗΤΡΙΟΣ","Ο.Α.ΝΕΣΤΩΡΑΣ ΓΙΑΝΝΙΤΣΩΝ",93,0]
["18-28084","ΙΩΑΝΝΙΔΗΣ ΠΕΤΡΟΣ","Α.Ο.Α.ΦΙΛΟΘΕΗΣ",92,0]
["18-29888","ΤΡΙΚΚΑΣ-ΨΩΜΑΣ ΝΙΚΟΛΑΟΣ","Α.Σ.ΤΕΝΙΣ ΚΛΑΜΠ ΚΟΖΑΝΗΣ",90,0]
["18-28689","ΚΑΛΛΙΤΣΗΣ ΚΩΝΣΤΑΝΤΙΝΟΣ","Ο.Α.ΑΓΙΑΣ ΠΑΡΑΣΚΕΥΗΣ",89,0]
["18-29726","ΜΙΣΔΡΑΧΗΣ ΛΕΑΝΔΡΟΣ","Ο.Α.ΦΟΙΒΟΣ ΛΑΡΙΣΑΣ",88,0]
["18-25046","ΣΑΡΑΜΑΝΤΙΤΣ ΠΑΥΛΟΣ","Ο.Α.ΕΥΟΣΜΟΥ ΘΕΣΣΑΛΟΝΙΚΗΣ",88,0]
["18-26338","ΚΥΡΙΑΚΑΚΗΣ-ΜΕΣΣΑΡΙΤΑΚΗΣ ΓΕΩΡΓΙΟΣ","ΗΡΑΚΛΕΙΟ Ο.Α.& Α.",87,0]
["18-30411","ΔΑΓΚΛΗΣ ΧΡΗΣΤΟΣ-ΠΑΝΑΓΙΩΤΗΣ","Ο.Α.ΦΟΙΒΟΣ ΛΑΡΙΣΑΣ",86,0]
["18-22656","ΤΖΩΡΤΖΟΣ ΣΤΑΥΡΟΣ","Α.Ο.Α.ΣΤΑΥΡΟΥΠΟΛΗΣ ΙΦΙΤΟΣ",85,0]
["18-28465","ΚΟΥΔΟΥΝΑΣ ΜΙΛΤΙΑΔΗΣ","Α.Ο.Α.ΦΙΛΟΘΕΗΣ",83,0]
["18-23429","ΚΑΛΑΜΩΤΟΥΣΑΚΗΣ ΓΕΩΡΓΙΟΣ-ΕΜΜΑΝΟΥΗΛ","Α.Ο.Α.ΦΙΛΟΘΕΗΣ",82,0]
["18-25238","ΤΖΕΛΑΤΗΣ ΣΤΕΦΑΝΟΣ","Α.Κ.Α.ΜΑΡΑΘΩΝΑ",82,0]
["18-31213","ΦΡΑΓΚΙΣΤΑΣ ΕΥΑΓΓΕΛΟΣ","Α.Ο.ΒΟΥΛΙΑΓΜΕΝΗΣ",81,0]
["18-26385","ΒΟΥΛΓΑΡΑΚΗΣ ΕΛΕΥΘΕΡΙΟΣ","Ο.Α.ΣΟΥΔΑΣ",80,0]
["18-23048","ΓΟΥΣΙΑΣ ΓΕΩΡΓΙΟΣ","Ο.Α.ΑΡΤΑΣ",80,0]
["18-24506","ΖΙΩΓΑΣ ΑΛΕΞΑΝΔΡΟΣ","Ο.Α.ΑΡΤΑΣ",80,0]
["18-29372","ΚΟΤΖΑΜΑΝΗΣ ΝΙΚΟΛΑΟΣ","ΠΕΥΚΗ Γ.ΚΑΛΟΒΕΛΩΝΗΣ",80,0]
["18-24115","ΝΤΑΝΤΙΝΗΣ ΑΓΓΕΛΟΣ","Ο.Α.ΡΙΟΥ",78,0]
["18-31303","ΚΟΥΤΡΟΥΜΠΗΣ ΝΙΚΟΛΑΟΣ","ΠΕΥΚΗ Γ.ΚΑΛΟΒΕΛΩΝΗΣ",77,0]
["18-28575","ΨΑΡΙΑΔΗΣ ΜΙΧΑΛΗΣ","Ο.Α.ΑΙΓΙΑΛΕΙΑΣ",77,0]
["18-28588","ΑΓΓΕΛΟΠΟΥΛΟΣ ΜΙΛΤΙΑΔΗΣ","ΠΕΥΚΗ Γ.ΚΑΛΟΒΕΛΩΝΗΣ",74,0]
["18-21962","ΖΗΣΗΣ-ΤΕΓΟΣ ΚΛΕΑΝΘΗΣ","Α.Ο.Α.ΑΣΤΕΡΑΣ ΘΕΣΣΑΛΟΝΙΚΗΣ",74,0]
["18-28285","ΠΗΛΙΟΥΝΗΣ ΜΙΧΑΗΛ","Ο.Α.ΑΘΗΝΩΝ",74,0]
["18-24340","ΧΟΝΔΡΟΣ ΙΑΣΩΝ-ΣΤΥΛΙΑΝΟΣ","Ο.Α.ΚΕΡΑΤΣΙΝΙΟΥ",74,0]
["18-26507","ΜΑΓΚΛΑΡΑΣ ΕΥΑΓΓΕΛΟΣ","Α.Γ.Ο.ΦΙΛΙΠΠΙΑΔΑΣ",73,0]
["18-29087","ΠΑΠΑΔΕΑΣ ΣΤΑΥΡΟΣ","Ο.Α.ΚΕΡΑΤΣΙΝΙΟΥ",72.5,0]
["18-23214","ΚΟΡΩΝΙΟΣ ΑΝΤΩΝΙΟΣ","Α.Ο.ΑΡΓΥΡΟΥΠΟΛΗΣ",72,0]
["18-33604","ΤΖΩΡΤΖΗΣ ΚΩΝΣΤΑΝΤΙΝΟΣ","Α.Ο.Α.ΧΑΪΔΑΡΙΟΥ",71.5,0]
["18-90102","ΤΣΙΚΟΒ ΑΛΕΞΑΝΔΡΟΣ","ΖΑΚΥΝΘΙΝΟΣ Α.Ο.Α",71,0]
["18-29789","ΤΣΟΜΛΕΚΤΣΟΓΛΟΥ ΝΙΚΟΛΑΟΣ","Α.Ο.Α.ΦΙΛΟΘΕΗΣ",71,0]
["18-33608","ΠΛΑΚΑΚΗΣ ΣΤΑΘΗΣ","Α.Α.ΑΙΓΑΛΕΩ",70,0]
["18-27690","ΣΠΥΡΟΠΟΥΛΟΣ ΑΘΑΝΑΣΙΟΣ","Α.Ο.Α.ΦΙΛΟΘΕΗΣ",69,0]
["18-31084","ΧΑΛΚΙΔΗΣ ΘΕΟΔΩΡΟΣ","Ο.Α.ΕΥΟΣΜΟΥ ΘΕΣΣΑΛΟΝΙΚΗΣ",69,0]
["18-30018","ΣΠΗΛΙΩΤΟΠΟΥΛΟΣ ΑΓΓΕΛΟΣ","Ο.Α.ΠΕΤΡΟΥΠΟΛΗΣ",68,0]
["18-25395","ΧΑΡΙΤΩΝΙΔΗΣ ΧΑΡΙΤΩΝ","Α.Ο.ΑΡΓΥΡΟΥΠΟΛΗΣ",68,0]
["18-32250","ΖΟΥΓΛΗΣ ΗΡΑΚΛΗΣ","ΝΑΥΠΛΙΑΚΟΣ Ο.Α.",66,0]
["18-29502","ΠΑΤΕΡΑΣ ΔΙΑΜΑΝΤΗΣ","Α.Ο.ΤΑΤΟΪΟΥ",65.5,0]
["18-30044","ΠΕΝΤΟΥΣΗΣ ΠΑΡΙΣ","Ο.Α.ΘΕΣΣΑΛΟΝΙΚΗΣ",64,0]
["18-29884","ΤΣΙΓΚΕΝΗΣ ΓΕΩΡΓΙΟΣ","Α.Ο.Α.ΧΑΪΔΑΡΙΟΥ",63.5,0]
["18-28153","ΤΣΙΒΟΥΡΑΚΗΣ ΑΝΤΩΝΙΟΣ","Ο.Α.ΧΑΝΙΩΝ",63,0]
["18-28866","ΣΤΕΡΓΙΟΥΛΑΣ ΧΡΗΣΤΟΣ-ΜΑΡΙΟΣ","Ο.Α.ΜΑΓΝΗΣΙΑΣ",62,0]
["18-90110","ΠΑΝΤΟΥΡΑΡΟΥ ΚΩΝΣΤΑΝΤΙΝ-ΑΝΤΡΙΑΝ","Ο.Α.ΑΘΗΝΩΝ",61.5,0]
["18-29132","ΓΕΡΟΝΙΚΟΛΟΣ ΓΕΩΡΓΙΟΣ","Ο.Α.ΑΓΙΑΣ ΠΑΡΑΣΚΕΥΗΣ",60,0]
["18-28653","ΚΑΡΑΓΙΑΝΝΗΣ ΜΙΧΑΛΗΣ","ΝΑΥΠΛΙΑΚΟΣ Ο.Α.",60,0]
["18-29577","ΚΟΣΜΑΣ ΑΡΙΣΤΕΙΔΗΣ","Α.Σ.Α.ΠΑΝΟΡΑΜΑΤΟΣ",60,0]
["18-27471","ΠΕΝΘΕΡΟΥΔΑΚΗΣ ΜΑΡΙΟΣ-ΒΑΣΙΛΕΙΟΣ","Α.Ο.Α.ΑΤΤΙΚΟΣ ΗΛΙΟΣ",60,0]
["18-32380","ΑΡΓΥΡΙΟΥ ΔΙΟΓΕΝΗΣ","Ε.Α.Σ.ΟΛΥΜΠΙΑΔΑ",59,0]
["18-33453","ΣΤΑΥΡΟΠΟΥΛΟΣ ΜΑΡΙΟΣ-ΦΩΤΙΟΣ","Α.Ο.Α.ΦΙΛΟΘΕΗΣ",58,0]
["18-28874","ΒΡΕΤΤΟΣ ΣΤΕΦΑΝΟΣ","Α.Ο.Α.ΦΙΛΟΘΕΗΣ",57,0]
["18-32270","ΠΙΓΓΟΣ ΓΕΩΡΓΙΟΣ","Ο.Α.ΕΥΟΣΜΟΥ ΘΕΣΣΑΛΟΝΙΚΗΣ",57,0]
["18-32470","ΓΕΡΟΓΙΑΝΝΗΣ ΑΛΕΞΑΝΔΡΟΣ","Α.Ο.Α.ΧΑΪΔΑΡΙΟΥ",56.5,0]
["18-32290","ΛΑΥΡΑΝΟΣ ΓΡΗΓΟΡΗΣ","Α.Ο.Α.ΠΑΤΡΩΝ",56,0]
["18-23408","ΜΙΜΙΝΗΣ ΙΩΑΝΝΗΣ","Ο.Α.ΡΕΘΥΜΝΟΥ",56,0]
["18-26037","ΠΑΠΑΚΩΝΣΤΑΝΤΙΝΟΥ ΜΑΡΙΟΣ","Α.Ο.Α.ΦΙΛΟΘΕΗΣ",56,0]
["18-23338","ΣΤΡΑΤΑΚΟΣ ΣΤΑΘΗΣ","Α.Ο.Α.ΧΑΪΔΑΡΙΟΥ",55.5,0]
["18-30136","ΧΑΡΕΜΗΣ ΚΩΝΣΤΑΝΤΙΝΟΣ","Ο.Α.ΠΕΤΡΟΥΠΟΛΗΣ",55.5,0]
["18-26547","ΚΟΚΟΤΣΑΚΗΣ ΑΛΚΙΝΟΟΣ","Α.Ο.Α.ΗΛΙΟΥΠΟΛΗΣ",55,0]
["18-26859","ΣΙΟΝΤΗΣ ΒΑΣΙΛΕΙΟΣ","ΑΚΑΔ.ΑΝΤΙΣΦ.ΙΩΑΝΝΙΝΩΝ",55,0]
["18-22976","ΔΑΝΙΗΛ ΘΩΜΑΣ","Ο.Α.ΒΡΙΛΗΣΣΙΩΝ",54,0]
["18-27871","ΠΟΥΛΑΚΗΣ ΜΙΛΤΙΑΔΗΣ","Ο.Α.ΚΑΒΑΛΑΣ ΑΛΕΞΑΝΔΡΟΣ",54,0]
["18-33706","ΓΕΛΑΛΗΣ ΔΗΜΗΤΡΙΟΣ","Ο.Α.ΝΙΚΑΙΑ ΛΑΡΙΣΑΣ",53,0]
["18-28512","ΚΑΡΑΜΗΤΡΟΥΣΗΣ ΑΝΤΩΝΙΟΣ","Α.Ο.Α.ΠΟΣΕΙΔΩΝ ΘΕΣΣΑΛΟΝΙΚΗΣ",53,0]
["18-29651","ΝΙΚΟΛΑΚΑΚΗΣ ΙΩΑΝΝΗΣ","ΗΡΑΚΛΕΙΟ Ο.Α.& Α.",53,0]
["18-28259","ΝΙΚΟΛΑΚΟΠΟΥΛΟΣ ΒΑΣΙΛΕΙΟΣ","Σ.Α.ΣΕΡΡΩΝ",53,0]
["18-29626","ΒΑΡΕΛΗΣ ΝΙΚΟΛΑΟΣ","Ο.Α.ΚΕΡΚΥΡΑΣ",52,0]
["18-29812","ΣΤΑΥΡΟΥ ΕΛΕΥΘΕΡΙΟΣ-ΕΜΜΑΝΟΥΗΛ","Ο.Α.ΘΕΣΠΡΩΤΙΑΣ ΤΙΤΑΝΗ",52,0]
["18-26893","ΤΑΞΙΑΡΧΟΥ ΠΟΛΥΧΡΟΝΙΟΣ","ΦΘΙΩΤΙΚΟΣ Ο.Α.",51,0]
["18-26505","ΖΑΝΙΚΑΣ ΠΑΥΛΟΣ","Α.Γ.Ο.ΦΙΛΙΠΠΙΑΔΑΣ",50,0]
["18-25293","ΚΑΪΣΕΡΟΓΛΟΥ ΜΑΡΚΟΣ","Ο.Α.ΤΟΥΜΠΑΣ",50,0]
["18-23461","ΦΑΝΤΗΣ ΑΓΓΕΛΟΣ","Ο.Α.ΑΡΤΑΣ",50,0]
["18-26191","ΚΑΖΑΝΑΣ ΙΩΑΝΝΗΣ","Ο.Α.ΓΛΥΦΑΔΑΣ",49,0]
["18-25408","ΠΑΠΑΦΙΛΙΠΠΟΥ ΔΑΜΙΑΝΟΣ","Ο.Α.ΚΑΣΤΟΡΙΑΣ ΚΕΛΕΤΡΟΝ",48,0]
["18-23645","ΝΑΚΑΣ ΚΩΝΣΤΑΝΤΙΝΟΣ","Α.Σ.ΤΕΝΙΣ ΚΛΑΜΠ ΚΟΖΑΝΗΣ",47.5,0]
["18-29295","ΤΟΡΕ ΧΡΗΣΤΟΣ","Γ.Σ.ΕΛΕΥΘΕΡΙΟΥ ΚΟΡΔ.ΑΡΓΟΝΑΥΤΕΣ",47.5,0]
["18-32148","ΓΑΛΑΤΙΑΝΟΣ ΗΛΙΑΣ","Α.Ο.ΚΑΛΛΙΤΕΧΝΟΥΠΟΛΗΣ",46,0]
["18-34261","ΓΕΩΡΓΑΤΗΣ ΙΩΑΝΝΗΣ","ΑΚΑΔ.ΑΝΤΙΣΦ.ΙΩΑΝΝΙΝΩΝ",46,0]
["18-26705","ΚΟΥΤΣΟΥΛΗΣ ΜΑΡΙΟΣ","Α.Ο.ΑΡΓΥΡΟΥΠΟΛΗΣ",46,0]
["18-28251","ΛΑΖΟΠΟΥΛΟΣ ΛΑΜΠΡΟΣ","Α.Ο.Α.ΦΙΛΟΘΕΗΣ",46,0]
["18-28473","ΧΑΤΖΗΑΠΟΣΤΟΛΟΥ ΑΧΙΛΛΕΑΣ","Α.Σ.ΚΟΛΛΕΓΙΟΥ ΝΤΕΡΗ",46,0]
["18-31171","ΔΗΜΗΤΡΑΚΗΣ ΙΩΑΝΝΗΣ","ΡΟΔΙΑΚΗ ΑΚΑΔ.ΑΝΤΙΣΦ.",44,0]
["18-24772","ΜΑΡΚΟΓΙΑΝΝΑΚΗΣ ΚΩΝΣΤΑΝΤΙΝΟΣ","Ο.Α.ΡΕΘΥΜΝΟΥ",44,0]
["18-23777","ΜΠΙΚΑΣ ΑΝΤΩΝΙΟΣ","Ο.Α.ΚΕΡΑΤΣΙΝΙΟΥ",44,0]
["18-34260","ΝΟΥΣΗΣ ΚΩΝΣΤΑΝΤΙΝΟΣ","ΑΚΑΔ.ΑΝΤΙΣΦ.ΙΩΑΝΝΙΝΩΝ",44,0]
["18-26290","ΣΤΡΑΚΑΣ ΓΕΩΡΓΙΟΣ","Ο.Α.ΒΟΛΟΥ",44,0]
["18-33804","ΑΛΤΑΝΤΖΗΣ ΑΓΓΕΛΟΣ-ΙΚΑΡΟΣ","Α.Σ.Α.ΠΑΝΟΡΑΜΑΤΟΣ",42,0]
["18-25436","ΚΕΦΑΛΑΣ ΣΠΥΡΟΣ","Ο.Α.ΚΕΡΚΥΡΑΣ",42,0]
["18-27959","ΚΩΛΕΤΣΗΣ ΛΑΖΑΡΟΣ","ΑΚΑΔ.ΑΝΤΙΣΦ.ΙΩΑΝΝΙΝΩΝ",42,0]
["18-33515","ΣΚΑΜΑΓΚΑΣ ΔΗΜΗΤΡΗΣ","Α.Ο.Α.ΚΑΤΕΡΙΝΗΣ",42,0]
["18-26075","ΒΙΝΙΕΡΑΤΟΣ ΕΛΕΥΘΕΡΙΟΣ","Ο.Α.ΠΕΤΡΟΥΠΟΛΗΣ",40,0]
["18-33620","ΔΟΥΚΑΣ ΑΡΙΣΤΕΙΔΗΣ","Ο.Α.ΑΡΙΔΑΙΑΣ",40,0]
["18-26594","ΚΑΡΑΧΑΛΙΟΣ ΠΑΝΑΓΙΩΤΗΣ","Σ.Α.ΡΑΦΗΝΑΣ",40,0]
["18-30492","ΚΑΤΣΑΛΟΒ ΙΩΑΝΝΗΣ","Σ.Α.ΔΡΑΜΑΣ",40,0]
["18-29815","ΠΑΠΙΓΓΙΩΤΗΣ ΔΗΜΗΤΡΙΟΣ","Ο.Α.ΘΕΣΠΡΩΤΙΑΣ ΤΙΤΑΝΗ",40,0]
["18-29813","ΤΖΑΝΗΣ ΑΡΙΣΤΕΙΔΗΣ","Ο.Α.ΘΕΣΠΡΩΤΙΑΣ ΤΙΤΑΝΗ",40,0]
["18-32543","ΤΖΗΓΚΑΣ ΧΡΗΣΤΟΣ","Ο.Α.ΕΔΕΣΣΑΣ",40,0]
["18-30944","ΚΟΝΤΟΓΙΩΡΓΑΚΗΣ ΙΩΑΝΝΗΣ","Ο.Α.ΣΗΤΕΙΑΣ",39,0]
["18-27668","ΤΑΜΠΑΚΗΣ ΘΕΟΧΑΡΗΣ","Ο.Α.ΚΕΡΑΤΣΙΝΙΟΥ",39,0]
["18-32894","ΑΣΛΑΝΙΔΗΣ ΓΕΩΡΓΙΟΣ","Ο.Α.ΚΟΥΦΑΛΙΩΝ ΘΕΣΣΑΛΟΝΙΚΗΣ",38,0]
["18-22964","ΒΟΥΡΗΣ ΖΗΣΗΣ","Ο.Α.ΓΛΥΦΑΔΑΣ",38,0]
["18-28959","ΜΠΕΛΤΖΕΝΙΤΗΣ ΙΩΑΝΝΗΣ","Ο.Α.ΠΕΤΡΟΥΠΟΛΗΣ",38,0]
["18-31408","ΑΝΑΣΤΑΣΙΑΔΗΣ ΦΩΤΙΟΣ","ΡΟΔΙΑΚΟΣ Ο.Α.",37,0]
["18-29993","ΠΕΧΛΙΒΑΝΙΔΗΣ ΜΑΡΚΟΣ","Α.Ο.ΑΤΡΟΜΗΤΟΣ ΤΡΙΑΔΙΟΥ",37,0]
["18-29444","ΓΚΙΖΑΣ ΘΩΜΑΣ","Γ.Ε.ΠΡΕΒΕΖΑΣ",36,0]
["18-33917","ΚΑΒΑΛΛΙΕΡΟΣ ΚΩΝΣΤΑΝΤΙΝΟΣ","Ο.Α.ΑΘΛΗΤ.ΠΑΙΔΕΙΑ",36,0]
["18-31708","ΜΠΙΝΟΠΟΥΛΟΣ ΙΩΑΝΝΗΣ","Ν.Ο.ΘΕΣΣΑΛΟΝΙΚΗΣ",36,0]
["18-25492","ΜΠΟΥΡΤΖΑΛΑΣ ΗΛΙΑΣ-ΜΑΡΙΟΣ","ΦΘΙΩΤΙΚΟΣ Ο.Α.",36,0]
["18-26976","ΜΥΛΩΝΑΣ ΑΠΟΣΤΟΛΟΣ","Α.Ο.Α.ΦΙΛΟΘΕΗΣ",36,0]
["18-28957","ΚΥΡΙΑΚΟΠΟΥΛΟΣ ΠΕΡΙΚΛΗΣ","Ο.Α.ΙΩΛΚΟΣ ΒΟΛΟΥ",35,0]
["18-26230","ΜΑΝΟΥΣΑΚΗΣ ΚΥΡΙΑΚΟΣ","ΗΡΑΚΛΕΙΟ Ο.Α.& Α.",35,0]
["18-32768","ΠΑΠΑΔΟΠΟΥΛΟΣ ΠΑΝΑΓΙΩΤΗΣ","Ο.Α.ΑΘΗΝΩΝ",35,0]
["18-24329","ΤΖΙΑΣΤΟΥΔΗΣ ΧΡΗΣΤΟΣ","Ο.Α.ΦΟΙΒΟΣ ΛΑΡΙΣΑΣ",35,0]
["18-26780","ΖΑΓΟΡΑΙΟΣ ΚΩΝΣΤΑΝΤΙΝΟΣ","Α.Κ.Α.ΜΑΡΑΘΩΝΑ",34,0]
["18-30611","ΚΑΡΕΛΑΣ ΠΑΝΑΓΙΩΤΗΣ","Ο.Α.ΚΑΛΑΜΑΤΑΣ",34,0]
["18-28013","ΣΠΕΝΤΖΟΣ ΧΡΗΣΤΟΣ","Α.Κ.Α.ΜΑΡΑΘΩΝΑ",34,0]
["18-26172","ΣΤΑΥΡΟΥΛΑΚΗΣ ΓΕΩΡΓΙΟΣ","ΗΡΑΚΛΕΙΟ Ο.Α.& Α.",34,0]
["18-29660","ΓΚΕΡΕΚΟΣ ΣΠΥΡΙΔΩΝ","Ο.Α.ΚΕΡΚΥΡΑΣ",33,0]
["18-26478","ΚΗΠΟΥΡΟΣ ΣΤΑΥΡΟΣ","Ο.Α.ΧΑΝΙΩΝ",33,0]
["18-31335","ΛΑΖΑΡΙΔΗΣ ΓΕΩΡΓΙΟΣ-ΑΛΕΞΑΝΔΡΟΣ","Φ.Ο.Α.ΝΕΑΠΟΛΗΣ",33,0]
["18-27236","ΚΑΤΣΑΓΚΟΛΗΣ ΑΣΤΕΡΙΟΣ","Γ.Σ.ΛΙΒΥΚΟΣ ΙΕΡΑΠΕΤΡΑΣ",32,0]
["18-33516","ΚΡΗΤΟΣ ΚΩΝΣΤΑΝΤΙΝΟΣ","Α.Ο.Α.ΚΑΤΕΡΙΝΗΣ",32,0]
["18-32472","ΜΑΝΟΥΣΑΚΗΣ ΔΗΜΗΤΡΙΟΣ-ΠΑΝΑΓΙΩΤΗΣ","Γ.Ο.ΠΕΡΙΣΤΕΡΙΟΥ Γ.ΠΑΛΑΣΚΑΣ",32,0]
["18-29664","ΣΑΧΠΑΤΖΙΔΗΣ ΓΕΩΡΓΙΟΣ","Ο.Α.ΝΕΣΤΩΡΑΣ ΓΙΑΝΝΙΤΣΩΝ",32,0]
["18-32761","ΜΙΝΤΑΣ ΝΙΚΟΛΑΟΣ","ΠΕΥΚΗ Γ.ΚΑΛΟΒΕΛΩΝΗΣ",31,0]
["18-29450","ΚΟΖΥΡΑΚΗΣ ΦΩΤΙΟΣ","Α.Σ.Ε.ΘΗΣΕΑΣ ΑΓΙΟΥ ΔΗΜΗΤΡΙΟΥ",30,0]
["18-22989","ΛΑΜΠΡΟΠΟΥΛΟΣ ΠΑΝΑΓΙΩΤΗΣ","Α.Ε.Κ.ΤΡΙΠΟΛΗΣ",30,0]
["18-28229","ΝΟΤΑΣ ΚΩΝΣΤΑΝΤΙΝΟΣ","Ο.Α.ΘΕΣΣΑΛΟΝΙΚΗΣ",30,0]
["18-32220","ΣΦΙΚΤΗΣ ΠΑΝΑΓΙΩΤΗΣ","Ο.Α.ΠΕΤΡΟΥΠΟΛΗΣ",30,0]
["18-28474","ΧΡΟΝΟΠΟΥΛΟΣ ΔΗΜΗΤΡΙΟΣ","Α.Ο.Α.ΠΑΠΑΓΟΥ",30,0]
["18-28546","ΑΝΔΡΙΟΠΟΥΛΟΣ ΚΩΝΣΤΑΝΤΙΝΟΣ","Α.Ο.Α.ΠΑΤΡΩΝ",29,0]
["18-28243","ΚΡΑΣΟΥΔΑΚΗΣ ΙΩΑΝΝΗΣ-ΓΕΩΡΓΙΟΣ","Ο.Α.ΧΑΝΙΩΝ",29,0]
["18-29814","ΤΣΑΝΤΕΚΙΔΗΣ ΑΧΙΛΛΕΑΣ","Ο.Α.ΘΕΣΠΡΩΤΙΑΣ ΤΙΤΑΝΗ",29,0]
["18-28192","ΑΛΕΞΑΝΔΡΙΔΗΣ ΧΑΡΑΛΑΜΠΟΣ","Σ.Α.ΣΕΡΡΩΝ",28,0]
["18-28424","ΓΑΤΟΥΔΗΣ-ΜΑΛΙΝΔΡΕΤΟΣ ΝΙΚΟΛΑΟΣ","Ο.Α.ΧΑΝΙΩΝ",28,0]
["18-24765","ΛΑΖΑΡΙΔΗΣ ΚΥΡΙΑΚΟΣ","Ο.Α.ΘΕΣΣΑΛΟΝΙΚΗΣ",28,0]
["18-33801","ΣΟΦΟΣ ΚΟΡΝΕΙΛΙΟΣ","Α.Σ.Α.ΠΑΝΟΡΑΜΑΤΟΣ",28,0]
["18-90124","ΝΤΕ-ΛΙΜΑ-ΒΙΕΓΚΑΣ ΤΖΟΣΟΥΑ-ΝΕΛΣΟΝ","Α.Κ.Α.ΜΑΡΑΘΩΝΑ",27.5,0]
["18-28486","ΜΠΑΡΜΠΑΡΗΣ ΣΤΥΛΙΑΝΟΣ","Ο.Α.ΠΑΡΟΥ",27,0]
["18-28154","ΒΑΡΒΕΡΑΚΗΣ ΓΕΩΡΓΙΟΣ","Ο.Α.ΧΑΝΙΩΝ",26,0]
["18-31676","ΒΑΣΙΛΕΙΟΥ ΠΑΥΛΟΣ","Ο.Α.ΑΡΙΔΑΙΑΣ",26,0]
["18-24897","ΓΑΛΑΤΙΑΝΟΣ ΚΩΝΣΤΑΝΤΙΝΟΣ","Ο.Α.ΘΕΣΣΑΛΟΝΙΚΗΣ",26,0]
["18-32318","ΓΕΡΑΡΔΗΣ ΕΜΜΑΝΟΥΗΛ","Ο.Α.ΠΕΤΡΟΥΠΟΛΗΣ",26,0]
["18-33530","ΓΙΑΚΟΥΜΑΚΗΣ ΙΩΑΝΝΗΣ","Ο.Α.ΧΑΝΙΩΝ",26,0]
["18-25750","ΚΟΝΤΟΓΙΩΡΓΗΣ ΓΕΡΑΣΙΜΟΣ","Ο.Α.ΚΕΡΚΥΡΑΣ",26,0]
["18-27220","ΛΙΑΤΣΟΣ ΔΗΜΗΤΡΙΟΣ","Ο.Α.ΘΕΣΠΡΩΤΙΑΣ ΤΙΤΑΝΗ",26,0]
["18-27392","ΜΟΙΡΑΝΑΙΟΣ ΝΙΚΟΛΑΟΣ","Ο.Α.ΚΕΡΑΤΣΙΝΙΟΥ",26,0]
["18-29276","ΠΑΠΟΥΛΙΑΣ ΣΩΚΡΑΤΗΣ","Σ.Α.ΣΕΡΡΩΝ",26,0]
["18-32896","ΣΕΡΤΗΣ ΕΥΑΓΓΕΛΟΣ","Σ.Α.ΔΡΑΜΑΣ",26,0]
["18-29582","ΤΖΙΜΟΓΙΑΝΝΗΣ ΑΛΕΞΑΝΔΡΟΣ-ΔΗΜΗΤΡΙΟΣ","ΑΚΑΔ.ΑΝΤΙΣΦ.ΙΩΑΝΝΙΝΩΝ",26,0]
["18-90105","ΑΛΕΞΑΚΗΣ ΠΕΤΡΟΣ","Ο.Α.ΧΑΝΙΩΝ",25.5,0]
["18-23466","ΣΠΥΡΟΣ ΕΥΑΓΓΕΛΟΣ","Ο.Α.ΑΡΤΑΣ",25,0]
["18-23331","ΤΑΣΣΙΟΣ ΝΙΚΟΣ","Α.Ο.Α.ΧΑΪΔΑΡΙΟΥ",25,0]
["18-24621","ΒΑΝΑΣ ΦΩΤΙΟΣ","Ο.Α.ΓΛΥΦΑΔΑΣ",24,0]
["18-23409","ΣΑΒΒΑΚΗΣ ΝΙΚΟΛΑΟΣ","Ο.Α.ΡΕΘΥΜΝΟΥ",24,0]
["18-29001","ΜΕΛΙΣΣΙΝΟΣ ΔΗΜΗΤΡΙΟΣ","Φ.Ο.Α.ΝΕΑΠΟΛΗΣ",23,0]
["18-29125","ΝΙΚΟΛΑΪΔΗΣ ΝΙΚΟΛΑΟΣ","Ο.Α.ΛΙΤΟΧΩΡΟΥ",23,0]
["18-28329","ΠΛΙΟΓΚΑΣ ΗΛΙΑΣ","Ο.Α.ΝΕΣΤΩΡΑΣ ΓΙΑΝΝΙΤΣΩΝ",23,0]
["18-27108","ΔΕΛΗΣ ΚΩΝΣΤΑΝΤΙΝΟΣ-ΔΗΜΗΤΡΙΟΣ","Α.Ε.Κ.ΤΡΙΠΟΛΗΣ",22,0]
["18-30123","ΚΑΜΑΡΑΣ ΡΑΦΑΗΛ-ΚΩΝΣΤΑΝΤΙΝΟΣ","Α.Ο.Α.ΠΑΠΑΓΟΥ",22,0]
["18-32251","ΚΟΝΤΗΣ ΒΑΣΙΛΕΙΟΣ-ΝΙΚΟΛΑΟΣ","ΡΗΓΑΣ Α.Ο.Α.ΑΡΓΟΛΙΔΑΣ",22,0]
["18-28842","ΜΙΧΑΛΟΠΟΥΛΟΣ ΓΙΩΡΓΟΣ","Ο.Α.ΚΕΡΚΥΡΑΣ",22,0]
["18-28662","ΠΑΛΗΚΙΔΗΣ ΑΛΕΞΑΝΔΡΟΣ","Α.Ο.ΚΑΒΑΛΑΣ ΜΑΚΕΔΟΝΙΚΟΣ",22,0]
["18-35123","ΣΙΩΚΟΣ ΧΡΗΣΤΟΣ","Ο.Α.ΚΟΡΙΝΘΟΥ",22,0]
["18-32097","ΤΣΑΡΠΑΛΗΣ ΗΛΙΑΣ","Ο.Α.ΑΙΓΙΑΛΕΙΑΣ",22,0]
["18-23669","ΧΑΤΖΗΣ ΠΑΝΑΓΙΩΤΗΣ","Α.Ε.ΠΟΡΤΟ ΡΑΦΤΗ",22,0]
["18-29606","ΧΙΩΤΗΣ ΜΙΧΑΗΛ","Α.Σ.Ε.ΘΗΣΕΑΣ ΑΓΙΟΥ ΔΗΜΗΤΡΙΟΥ",22,0]
["18-30365","ΕΛΕΥΘΕΡΙΑΔΗΣ ΑΝΕΣΤΗΣ","Α.Σ.Α.ΠΑΝΟΡΑΜΑΤΟΣ",21,0]
["18-29162","ΖΑΦΕΙΡΗΣ ΣΠΥΡΟΣ","Α.Ο.Α.ΧΑΪΔΑΡΙΟΥ",21,0]
["18-28794","ΚΙΟΥΡΤΗΣ ΔΗΜΗΤΡΙΟΣ","Ο.Α.ΚΑΒΑΛΑΣ ΑΛΕΞΑΝΔΡΟΣ",21,0]
["18-28931","ΚΟΥΤΣΟΓΙΑΝΝΗΣ ΑΝΔΡΕΑΣ","Ο.Α.ΜΑΓΝΗΣΙΑΣ",21,0]
["18-32051","ΚΥΡΛΑΣ ΣΤΑΥΡΟΣ","Γ.Ε.ΠΡΕΒΕΖΑΣ",21,0]
["18-33109","ΤΡΙΑΝΤΑΦΥΛΛΙΔΗΣ ΑΛΕΞΑΝΔΡΟΣ","Φ.Ο.Α.ΝΕΑΠΟΛΗΣ",21,0]
["18-30739","ΑΡΒΑΝΙΤΗΣ ΓΕΩΡΓΙΟΣ","Ο.Α.ΑΙΓΙΑΛΕΙΑΣ",20,0]
["18-28765","ΓΚΕΛΗΣ ΓΕΩΡΓΙΟΣ","Ο.Α.ΜΑΓΝΗΣΙΑΣ",20,0]
["18-29952","ΚΑΝΕΛΛΟΠΟΥΛΟΣ ΠΕΤΡΟΣ","Α.Ε.Κ.ΤΡΙΠΟΛΗΣ",20,0]
["18-30064","ΚΟΥΚΟΥΛΙΘΡΑΣ ΙΩΑΝΝΗΣ","Ο.Α.ΚΕΡΑΤΣΙΝΙΟΥ",20,0]
["18-27029","ΠΑΠΑΓΙΑΝΝΗΣ ΑΝΑΣΤΑΣΙΟΣ","Ο.Α.ΣΑΛΑΜΙΝΑΣ",20,0]
["18-25902","ΠΟΛΙΤΗΣ ΕΛΕΥΘΕΡΙΟΣ","Α.Ε.Κ.ΤΡΙΠΟΛΗΣ",20,0]
["18-24378","ΤΣΕΒΡΕΝΙΔΗΣ ΧΡΗΣΤΟΣ","Α.Γ.Ο.ΦΙΛΙΠΠΙΑΔΑΣ",20,0]
["18-28873","ΒΡΕΤΤΟΣ ΓΙΩΡΓΟΣ","Α.Ο.Α.ΦΙΛΟΘΕΗΣ",19,0]
["18-31693","ΕΣΚΙΟΓΛΟΥ ΣΤΕΦΑΝΟΣ","Α.Π.Ο.ΣΑΝΝΥ ΣΠΟΡΤΣ ΚΛΑΜΠ",19,0]
["18-32226","ΚΟΣΜΙΔΗΣ ΓΕΩΡΓΙΟΣ","Ε.Σ.Ο.ΕΠΙΚΟΥΡΟΣ ΠΟΛΙΧΝΗΣ",19,0]
["18-31631","ΠΛΑΚΟΓΙΑΝΝΗΣ ΜΑΡΙΝΟΣ","ΡΗΓΑΣ Α.Ο.Α.ΑΡΓΟΛΙΔΑΣ",19,0]
["18-30398","ΤΣΕΚΟΥΡΑΣ ΚΩΝΣΤΑΝΤΙΝΟΣ","Ο.Α.ΧΑΛΚΙΔΑΣ",18.5,0]
["18-27171","ΓΡΗΓΟΡΑΤΟΣ ΧΑΡΑΛΑΜΠΟΣ","Α.Ο.Α.ΗΛΙΟΥΠΟΛΗΣ",18,0]
["18-24107","ΚΟΥΣΤΕΡΙΔΗΣ ΡΑΦΑΗΛ","Ο.Α.ΕΥΟΣΜΟΥ ΘΕΣΣΑΛΟΝΙΚΗΣ",18,0]
["18-32773","ΚΩΛΕΤΣΗΣ ΛΑΜΠΡΟΣ","ΑΚΑΔ.ΑΝΤΙΣΦ.ΙΩΑΝΝΙΝΩΝ",18,0]
["18-27013","ΜΠΕΓΝΗΣ ΧΡΗΣΤΟΣ","Ο.Α.ΣΑΛΑΜΙΝΑΣ",18,0]
["18-27875","ΠΑΡΙΣΣΗΣ ΕΥΑΓΓΕΛΟΣ","ΡΟΔΙΑΚΗ ΑΚΑΔ.ΑΝΤΙΣΦ.",18,0]
["18-34536","ΠΙΠΙΛΑΚΙΔΗΣ ΑΘΑΝΑΣΙΟΣ","Ο.Α.ΓΙΑΝΝΙΤΣΩΝ",18,0]
["18-26055","ΣΙΡΠΟΣ ΑΛΕΞΙΟΣ","Ο.Α.ΘΕΣΣΑΛΟΝΙΚΗΣ",18,0]
["18-25843","ΣΟΥΣΟΥΡΟΓΙΑΝΝΗΣ ΕΥΑΓΓΕΛΟΣ","Α.Ο.Α.ΚΑΤΕΡΙΝΗΣ",18,0]
["18-32100","ΣΠΗΛΙΩΤΟΠΟΥΛΟΣ ΠΑΝΑΓΙΩΤΗΣ","Ο.Α.ΑΙΓΙΑΛΕΙΑΣ",18,0]
["18-26179","ΣΤΑΥΡΟΥΛΑΚΗΣ ΙΩΑΝΝΗΣ","Ο.Α.ΑΓΙΑΣ ΠΑΡΑΣΚΕΥΗΣ",18,0]
["18-31207","ΣΦΕΝΔΟΥΡΑΚΗΣ ΜΑΡΙΟΣ","Ο.Α.ΣΗΤΕΙΑΣ",18,0]
["18-27862","ΦΟΥΝΤΟΥΛΗΣ ΔΗΜΗΤΡΙΟΣ","Α.Ο.Α.ΑΙΓΑΛΕΩ 92",18,0]
["18-32785","ΧΡΙΣΤΟΦΙΛΟΠΟΥΛΟΣ ΝΙΚΟΛΑΟΣ","Ο.Α.ΚΕΡΑΤΣΙΝΙΟΥ",18,0]
["18-30523","ΑΠΕΡΓΗΣ ΚΟΜΝΗΝΟΣ","Α.Ο.ΚΑΛΛΙΤΕΧΝΟΥΠΟΛΗΣ",17,0]
["18-29042","ΚΑΛΟΓΕΡΟΠΟΥΛΟΣ ΘΕΟΔΩΡΟΣ","Σ.Α.ΡΑΦΗΝΑΣ",17,0]
["18-90091","ΚΑΡΑΠΕΤΩΒ ΓΚΙΟΡΓΚΥ","Ο.Π.ΘΕΣΣΑΛΟΝΙΚΗΣ ΜΑΚΕΔΟΝΙΑ 92",17,0]
["18-30272","ΤΖΕΛΗΣ ΑΝΔΡΕΑ-ΜΑΡΙΟΣ","ΑΚΑΔ.ΑΝΤΙΣΦ.ΙΩΑΝΝΙΝΩΝ",17,0]
["18-25213","ΤΣΙΚΑΡΛΗΣ ΔΗΜΗΤΡΙΟΣ","Α.Κ.Α.ΜΑΡΑΘΩΝΑ",17,0]
["18-30560","ΣΟΦΗΣ ΝΙΚΟΛΑΟΣ","Α.Ε.Τ.ΝΙΚΗ ΠΑΤΡΩΝ",16.5,0]
["18-34030","ΚΩΣΤΟΠΟΥΛΟΣ ΝΙΚΟΛΑΟΣ","Α.Ε.Κ.ΤΡΙΠΟΛΗΣ",16,0]
["18-32707","ΜΠΕΛΛΟΣ ΠΕΤΡΟΣ","Ο.Α.ΑΓΙΑΣ ΠΑΡΑΣΚΕΥΗΣ",16,0]
["18-27383","ΧΑΤΖΗΣ ΣΤΕΦΑΝΟΣ-ΡΑΦΑΗΛ","Α.Ε.ΠΟΡΤΟ ΡΑΦΤΗ",16,0]
["18-32165","ΓΙΑΤΣΟΣ ΠΟΛΥΜΕΡΟΣ-ΠΑΝΑΓΙΩΤΗΣ","Ο.Α.ΑΙΓΙΑΛΕΙΑΣ",15,0]
["18-28590","ΓΚΑΛΤΣΙΔΗΣ ΧΡΗΣΤΟΣ","Α.Ο.Α.ΑΣΤΕΡΑΣ ΘΕΣΣΑΛΟΝΙΚΗΣ",15,0]
["18-31813","ΖΑΧΑΡΑΚΗΣ ΜΙΧΑΗΛ","ΗΡΑΚΛΕΙΟ Ο.Α.& Α.",15,0]
["18-27251","ΚΥΡΙΑΚΟΠΟΥΛΟΣ ΜΑΡΙΟΣ","Α.Ο.Α.ΠΑΠΑΓΟΥ",15,0]
["18-25519","ΣΕΚΛΕΙΖΙΩΤΗΣ ΝΙΚΟΛΑΟΣ","Ο.Α.ΚΕΡΑΤΣΙΝΙΟΥ",15,0]
["18-26800","ΣΤΟΪΔΗΣ ΝΙΚΟΛΑΟΣ-ΝΙΚΗΦΟΡΟΣ","Μ.Γ.Σ.ΑΠΟΛΛΩΝ ΚΑΛΑΜΑΡΙΑΣ",15,0]
["18-30056","ΧΑΤΖΗΓΙΑΝΝΗΣ ΣΤΑΥΡΟΣ","Α.Ο.ΑΡΓΥΡΟΥΠΟΛΗΣ",15,0]
["18-29618","ΒΡΑΝΑΣ ΠΑΝΑΓΙΩΤΗΣ-ΗΛΙΑΣ","Α.Σ.Α.ΑΓΡΙΝΙΟΥ",14,0]
["18-26495","ΓΚΕΜΟΣ ΑΝΔΡΕΑΣ","Ο.Α.ΑΡΙΔΑΙΑΣ",14,0]
["18-29104","ΓΡΗΓΟΡΙΑΔΗΣ ΚΩΝΣΤΑΝΤΙΝΟΣ","Ε.Σ.Ο.ΕΠΙΚΟΥΡΟΣ ΠΟΛΙΧΝΗΣ",14,0]
["18-30692","ΚΑΡΑΝΙΚΑΣ ΠΑΝΑΓΙΩΤΗΣ","Α.Ν.Ο.ΓΛΥΦΑΔΑΣ",14,0]
["18-29615","ΚΛΑΔΕΥΤΗΡΑΣ ΦΩΤΗΣ","Ο.Α.ΠΕΤΡΟΥΠΟΛΗΣ",14,0]
["18-32877","ΚΟΥΣΤΕΝΗΣ ΚΩΝΣΤΑΝΤΙΝΟΣ","Α.Ε.Κ.ΤΡΙΠΟΛΗΣ",14,0]
["18-25941","ΛΙΑΤΣΟΣ ΝΙΚΗΦΟΡΟΣ-ΕΥΣΤΡΑΤΙΟΣ","Ο.Α.ΑΓΙΑΣ ΠΑΡΑΣΚΕΥΗΣ",14,0]
["18-26777","ΜΑΓΓΟΣ ΘΩΜΑΣ","Ο.Α.ΓΙΑΝΝΙΤΣΩΝ",14,0]
["18-29811","ΜΠΙΣΑΡΑ-ΜΑΪΛΙΑΝΗΣ ΑΝΤΑΜ","Ο.Α.ΝΕΣΤΩΡΑΣ ΓΙΑΝΝΙΤΣΩΝ",14,0]
["18-33339","ΠΑΣΧΑΛΙΔΗΣ ΜΑΡΙΟΣ","Α.Ο.Α.ΝΕΑΣ ΠΕΡΑΜΟΥ ΟΙ ΤΙΤΑΝΕΣ",14,0]
["18-29607","ΠΟΥΛΗΣ ΣΤΡΑΤΗΣ","Α.Σ.Ε.ΘΗΣΕΑΣ ΑΓΙΟΥ ΔΗΜΗΤΡΙΟΥ",14,0]
["18-32341","ΧΑΛΒΑΤΖΗΣ ΕΥΑΓΓΕΛΟΣ","Ε.Σ.Ο.ΕΠΙΚΟΥΡΟΣ ΠΟΛΙΧΝΗΣ",14,0]
["18-33872","ΚΡΟΝΤΗΡΑΣ ΑΝΑΣΤΑΣΙΟΣ","ΗΡΑΚΛΕΙΟ Ο.Α.& Α.",13,0]
["18-34309","ΒΡΑΧΑΣ ΙΩΑΝΝΗΣ","Ο.Α.ΑΓΙΑΣ ΠΑΡΑΣΚΕΥΗΣ",12,0]
["18-26875","ΓΕΩΡΓΑΚΟΠΟΥΛΟΣ ΑΡΗΣ","Γ.Ο.ΠΕΡΙΣΤΕΡΙΟΥ Γ.ΠΑΛΑΣΚΑΣ",12,0]
["18-32083","ΓΙΑΚΗΣ ΚΩΝΣΤΑΝΤΙΝΟΣ","Ο.Α.ΑΓΙΩΝ ΑΝΑΡΓΥΡΩΝ",12,0]
["18-29213","ΚΟΝΤΗΣ ΒΑΣΙΛΕΙΟΣ","Ο.Α.ΓΛΥΦΑΔΑΣ",12,0]
["18-32343","ΚΟΥΪΜΤΖΙΔΗΣ ΒΑΣΙΛΕΙΟΣ","Ο.Π.ΘΕΣΣΑΛΟΝΙΚΗΣ ΜΑΚΕΔΟΝΙΑ 92",12,0]
["18-34372","ΜΑΓΟΓΙΑΝΝΗΣ ΑΓΓΕΛΟΣ","Α.Ο.Α.ΧΑΪΔΑΡΙΟΥ",12,0]
["18-90060","ΜΠΙΟΡΑΤΣ ΜΠΟΡΚΟ","Ο.Α.ΡΕΘΥΜΝΟΥ",12,0]
["18-29168","ΡΕΜΠΑΚΟΣ ΑΘΑΝΑΣΙΟΣ","Ο.Α.ΚΕΡΑΤΣΙΝΙΟΥ",12,0]
["18-32359","ΣΩΜΑΡΑΚΗΣ ΑΡΙΣΤΟΤΕΛΗΣ","Α.Σ.ΑΚΑΔΗΜΙΕΣ ΠΡΩΤΑΘΛΗΤΩΝ ΠΕΥΚΩΝ",12,0]
["18-29435","ΤΖΑΘΑΣ ΝΙΚΟΛΑΟΣ-ΣΩΤΗΡΙΟΣ","Ο.Α.ΚΑΙΣΑΡΙΑΝΗΣ",12,0]
["18-26714","ΤΣΕΚΜΕΖΟΓΛΟΥ ΑΝΕΣΤΗΣ","Ο.Α.ΚΑΒΑΛΑΣ ΑΛΕΞΑΝΔΡΟΣ",12,0]
["18-26671","ΦΑΣΙΛΗΣ ΚΥΡΙΑΚΟΣ","Ο.Α.ΚΑΒΑΛΑΣ ΑΛΕΞΑΝΔΡΟΣ",12,0]
["18-28224","ΚΑΠΝΙΑΣ ΕΥΑΓΓΕΛΟΣ","Ο.Α.ΚΕΡΑΤΣΙΝΙΟΥ",11.5,0]
["18-29451","ΑΡΓΥΡΟΥΛΗΣ ΑΝΤΩΝΙΟΣ","Α.Σ.Ε.ΘΗΣΕΑΣ ΑΓΙΟΥ ΔΗΜΗΤΡΙΟΥ",11,0]
["18-29161","ΑΣΙΘΙΑΝΑΚΗΣ ΟΔΥΣΣΕΑΣ","Α.Α.ΑΙΓΑΛΕΩ",11,0]
["18-32709","ΚΑΡΑΓΙΑΝΝΗΣ ΑΘΑΝΑΣΙΟΣ","Ο.Α.ΧΕΡΣΟΝΗΣΟΥ",11,0]
["18-29587","ΜΠΙΛΗΣ ΣΤΑΥΡΟΣ","Α.Ο.ΒΑΡΗΣ ΑΝΑΓΥΡΟΥΣ",11,0]
["18-26726","ΜΠΟΥΓΑΣ ΠΑΝΑΓΙΩΤΗΣ","Α.Ο.ΑΡΓΥΡΟΥΠΟΛΗΣ",11,0]
["18-28024","ΜΥΛΩΝΟΠΟΥΛΟΣ ΘΕΟΔΩΡΟΣ","ΦΙΛΑΘΛ.ΟΜΙΛΟΣ ΠΥΡΓΟΥ",11,0]
["18-26886","ΟΙΚΟΝΟΜΟΠΟΥΛΟΣ ΙΩΑΝΝΗΣ","Ο.Α.ΚΟΡΙΝΘΟΥ",11,0]
["18-28757","ΠΑΠΟΥΔΑΣ-ΤΣΑΚΙΡΙΔΗΣ ΑΝΑΣΤΑΣΙΟΣ","Σ.Α.ΔΡΑΜΑΣ",11,0]
["18-31152","ΠΑΣΠΑΛΑΡΑΚΗΣ ΙΩΑΝΝΗΣ","Ο.Α.ΣΗΤΕΙΑΣ",11,0]
["18-30788","ΧΑΝΤΖΟΠΟΥΛΟΣ ΑΡΙΣΤΟΤΕΛΗΣ","ΠΕΥΚΗ Γ.ΚΑΛΟΒΕΛΩΝΗΣ",10.5,0]
["18-30889","ΑΛΕΞΑΝΔΡΙΔΗΣ ΕΛΕΥΘΕΡΙΟΣ","Α.Ο.ΛΑΤΩ ΑΓ.ΝΙΚΟΛΑΟΥ",10,0]
["18-28252","ΒΡΑΝΑΣ ΙΩΑΝΝΗΣ","Α.Ο.Α.ΦΙΛΟΘΕΗΣ",10,0]
["18-23472","ΓΕΩΡΓΑΛΗΣ ΧΑΡΗΣ","Α.Ο.Α.ΚΑΒΑΛΑΣ",10,0]
["18-33357","ΚΑΚΟΥΛΙΑΔΗΣ ΓΙΩΡΓΟΣ","Ο.Α.ΞΑΝΘΗΣ",10,0]
["18-25247","ΜΑΝΕΝΤΗ ΑΝΤΩΝΙΑ","ΚΕΦΑΛΛΗΝΙΑΚΟΣ Ο.Α.",10,0]
["18-27421","ΜΑΣΤΡΑΝΤΩΝΗΣ ΜΙΧΑΗΛ","Α.Ο.Α.ΠΑΠΑΓΟΥ",10,0]
["18-33984","ΜΟΥΣΤΑΚΗΣ ΑΠΟΣΤΟΛΟΣ","ΑΙΟΛΟΣ Α.Λ.ΙΛΙΟΥ",10,0]
["18-34205","ΜΟΥΣΤΡΟΥΦΗΣ ΝΙΚΟΛΑΟΣ","Α.Ο.ΤΑΤΟΪΟΥ",10,0]
["18-33904","ΜΟΥΤΖΟΓΛΟΥ` ΝΙΚΟΣ","Α.Α.ΑΙΓΑΛΕΩ",10,0]
["18-24301","ΜΠΑΛΤΖΟΓΛΟΥ ΚΩΝΣΤΑΝΤΙΝΟΣ","Ο.Α.ΚΟΡΙΝΘΟΥ",10,0]
["18-30251","ΜΠΟΥΦΙΔΗΣ ΓΙΩΡΓΟΣ","Α.Σ.ΑΚΑΔΗΜΙΕΣ ΠΡΩΤΑΘΛΗΤΩΝ ΠΕΥΚΩΝ",10,0]
["18-24549","ΠΑΠΑΔΙΩΤΗΣ ΣΠΥΡΟΣ","Ο.Α.ΙΩΑΝΝΙΝΩΝ",10,0]
["18-24501","ΣΠΥΡΟΣ ΓΕΩΡΓΙΟΣ","Ο.Α.ΑΡΤΑΣ",10,0]
["18-33598","ΣΤΕΦΑΝΙΔΗΣ ΣΤΕΡΓΙΟΣ","Ο.Α.ΚΙΛΚΙΣ",10,0]
["18-32940","ΑΡΑΜΠΑΤΖΗΣ ΠΑΝΑΓΙΩΤΗΣ","Ο.Α.ΑΡΙΔΑΙΑΣ",9,0]
["18-32294","ΔΡΙΒΑΣ ΧΑΡΑΛΑΜΠΟΣ","Α.Ο.ΚΑΛΛΙΤΕΧΝΟΥΠΟΛΗΣ",9,0]
["18-34648","ΟΙΚΟΝΟΜΟΥ ΝΙΚΟΛΑΟΣ","Α.Π.Ο.ΣΑΝΝΥ ΣΠΟΡΤΣ ΚΛΑΜΠ",9,0]
["18-29218","ΠΛΑΤΗΣ ΕΛΕΥΘΕΡΙΟΣ","Ο.Α.ΞΑΝΘΗΣ",9,0]
["18-29217","ΠΛΑΤΗΣ ΚΩΝΣΤΑΝΤΙΝΟΣ","Ο.Α.ΞΑΝΘΗΣ",9,0]
["18-30187","ΡΟΥΣΟΠΟΥΛΟΣ ΙΩΑΝΝΗΣ","Ο.Α.ΧΑΛΚΙΔΑΣ",9,0]
["18-30276","ΣΔΡΑΚΑΣ ΧΡΗΣΤΟΣ","Ο.Α.ΣΠΑΡΤΗΣ",9,0]
["18-31085","ΤΡΟΥΠΤΣΙΔΗΣ ΣΩΚΡΑΤΗΣ","Ο.Α.ΚΕΡΚΥΡΑΣ",9,0]
["18-29084","ΠΑΠΑΔΕΑΣ ΠΑΝΑΓΙΩΤΗΣ","Ο.Α.ΚΕΡΑΤΣΙΝΙΟΥ",8.5,0]
["18-33715","ΑΜΠΑΡΤΖΙΔΗΣ ΙΩΑΚΕΙΜ","ΑΙΟΛΟΣ Α.Λ.ΙΛΙΟΥ",8,0]
["18-33845","ΑΣΛΑΝΙΔΗΣ ΝΙΚΟΛΑΟΣ","Ο.Α.ΠΟΛΥΚΑΣΤΡΟΥ",8,0]
["18-33387","ΒΟΣΚΟΠΟΥΛΟΣ ΓΙΑΝΝΗΣ","ΛΕΣΧΗ ΠΟΛΙΤΙΣΜΟΥ ΦΛΩΡΙΝΑΣ",8,0]
["18-27848","ΓΑΤΟΣ ΘΕΟΔΟΣΙΟΣ","Μ.Γ.Σ.ΑΠΟΛΛΩΝ ΚΑΛΑΜΑΡΙΑΣ",8,0]
["18-33529","ΓΙΑΚΟΥΜΑΚΗΣ ΠΟΛΥΧΡΟΝΗΣ","Ο.Α.ΧΑΝΙΩΝ",8,0]
["18-29505","ΖΑΝΙΚΑΣ ΠΑΥΛΟΣ","Α.Ο.ΚΗΦΙΣΙΑΣ",8,0]
["18-33290","ΘΟΥΛΙΩΤΗΣ ΜΙΧΑΛΗΣ","Σ.Α.ΣΕΡΡΩΝ",8,0]
["18-22540","ΚΑΡΓΙΩΤΗΣ ΓΕΩΡΓΙΟΣ","Γ.Σ.ΛΙΒΥΚΟΣ ΙΕΡΑΠΕΤΡΑΣ",8,0]
["18-28378","ΜΟΥΣΑΣ ΔΗΜΟΣΘΕΝΗΣ","Α.Ο.Α.ΦΙΛΟΘΕΗΣ",8,0]
["18-24182","ΜΠΑΓΟΡΔΑΚΗΣ ΜΑΡΙΟΣ","Ο.Α.ΣΗΤΕΙΑΣ",8,0]
["18-27655","ΜΠΑΓΟΡΔΑΚΗΣ ΟΔΥΣΣΕΑΣ","Ο.Α.ΣΗΤΕΙΑΣ",8,0]
["18-33434","ΜΠΑΚΟΜΙΧΑΛΗΣ ΘΩΜΑΣ","Γ.Ε.ΠΡΕΒΕΖΑΣ",8,0]
["18-33567","ΝΙΚΟΛΟΠΟΥΛΟΣ ΒΑΣΙΛΗΣ-ΠΑΪΣΙΟΣ","Α.Ο.Π.ΦΑΛΗΡΟΥ",8,0]
["18-34195","ΣΚΑΡΛΑΤΟΣ ΒΑΣΙΛΗΣ","Α.Α.ΑΙΓΑΛΕΩ",8,0]
["18-25828","ΣΧΟΙΝΟΠΛΟΚΑΚΗΣ ΚΩΝΣΤΑΝΤΙΝΟΣ","Ο.Α.ΧΑΝΙΩΝ",8,0]
["18-24874","ΧΑΤΖΗΜΑΡΚΑΚΗΣ ΧΡΗΣΤΟΣ","Γ.Σ.ΛΙΒΥΚΟΣ ΙΕΡΑΠΕΤΡΑΣ",8,0]
["18-25831","ΧΑΤΖΟΠΟΥΛΟΣ ΚΩΝΣΤΑΝΤΙΝΟΣ","Ο.Α.ΒΟΛΟΥ",8,0]
["18-33796","ΘΕΟΧΑΡΗΣ ΒΑΣΙΛΕΙΟΣ","Α.Ο.Α.ΠΑΠΑΓΟΥ",7.5,0]
["18-28174","ΠΑΚΑΣ ΜΑΡΚΟΣ","Ο.Α.ΑΓΙΑΣ ΠΑΡΑΣΚΕΥΗΣ",7.5,0]
["18-23569","ΠΑΥΛΙΔΗΣ ΑΝΑΣΤΑΣΙΟΣ","Α.Ο.ΜΕΓΑΣ ΑΛΕΞΑΝΔΡΟΣ",7.5,0]
["18-32368","ΣΕΙΣΟΠΟΥΛΟΣ ΠΑΣΧΑΛΗΣ","Α.Ο.ΜΕΓΑΣ ΑΛΕΞΑΝΔΡΟΣ",7.5,0]
["18-34364","ΚΕΛΕΣΙΔΗΣ ΣΤΕΦΑΝΟΣ","Ο.Α.ΑΡΙΔΑΙΑΣ",7,0]
["18-34548","ΚΟΥΚΟΥΒΕΛΟΣ ΑΝΤΩΝΙΟΣ","Α.Σ.ΑΚΡΟΠΟΛΙΣ",7,0]
["18-29513","ΣΚΑΡΤΣΙΛΑΣ ΑΝΤΩΝΙΟΣ","Α.Ο.ΑΙΓΙΟΥ ΜΟΡΕΑΣ",7,0]
["18-29636","ΤΖΩΡΤΖΗΣ ΔΗΜΗΤΡΙΟΣ","ΑΚΑΔ.ΑΝΤΙΣΦ.ΙΩΑΝΝΙΝΩΝ",7,0]
["18-33918","ΚΑΒΑΛΛΙΕΡΟΣ ΝΙΚΟΛΑΟΣ","Ο.Α.ΑΘΛΗΤ.ΠΑΙΔΕΙΑ",6.5,0]
["18-33543","ΑΒΡΑΜΙΔΗΣ ΑΝΑΣΤΑΣΙΟΣ","Ν.Ο.ΘΕΣΣΑΛΟΝΙΚΗΣ",6,0]
["18-29870","ΑΔΑΜΙΔΗΣ ΣΤΕΦΑΝΟΣ","Ο.Α.ΠΤΟΛΕΜΑΪΔΑΣ",6,0]
["18-29077","ΑΛΕΞΑΝΔΡΟΠΟΥΛΟΣ ΣΤΕΦΑΝΟΣ","Ο.Α.ΠΕΤΡΟΥΠΟΛΗΣ",6,0]
["18-33523","ΒΟΥΖΙΚΗΣ ΠΑΥΛΟΣ","Ο.Α.ΚΙΛΚΙΣ",6,0]
["18-90097","ΓΚΡΑΤΣΙΟΖΙ ΜΑΞΙΜ","Ο.Α.ΚΟΥΦΑΛΙΩΝ ΘΕΣΣΑΛΟΝΙΚΗΣ",6,0]
["18-34399","ΔΙΑΚΟΥΜΑΚΟΣ ΦΟΙΒΟΣ","Ο.Α.ΠΕΙΡΑΙΑ",6,0]
["18-32342","ΚΑΛΙΕΝΤΖΙΔΗΣ ΧΡΗΣΤΟΣ","Ο.Π.ΘΕΣΣΑΛΟΝΙΚΗΣ ΜΑΚΕΔΟΝΙΑ 92",6,0]
["18-34072","ΚΑΧΡΙΜΑΝΗΣ ΣΤΑΥΡΟΣ","Ο.Α.ΠΤΟΛΕΜΑΪΔΑΣ",6,0]
["18-31238","ΚΙΩΤΗΣ ΦΩΤΗΣ","Ο.Α.ΑΓΙΩΝ ΑΝΑΡΓΥΡΩΝ",6,0]
["18-30958","ΜΟΥΖΟΥΚΟΣ ΙΩΑΝΝΗΣ","Α.Ο.Α.ΧΑΪΔΑΡΙΟΥ",6,0]
["18-30140","ΜΥΛΩΝΑΣ ΚΩΝΣΤΑΝΤΙΝΟΣ-ΜΑΡΚΟΣ","Ε.Σ.Ο.ΕΠΙΚΟΥΡΟΣ ΠΟΛΙΧΝΗΣ",6,0]
["18-28941","ΝΤΑΛΙΑΣ ΝΙΚΟΛΑΟΣ","ΡΟΔΙΑΚΟΣ Ο.Α.",6,0]
["18-24114","ΝΤΑΝΤΙΝΗΣ ΠΕΤΡΟΣ","Ο.Α.ΡΙΟΥ",6,0]
["18-28789","ΠΑΝΤΑΖΗΣ ΘΕΟΔΩΡΟΣ","Ο.Α.ΚΟΡΙΝΘΟΥ",6,0]
["18-34662","ΠΑΠΑΔΟΓΙΑΝΝΗΣ ΘΑΝΟΣ","ΠΑΝΕΛΛΗΝΙΟΣ Γ.Σ.",6,0]
["18-30456","ΠΑΥΛΙΔΗΣ ΑΝΑΣΤΑΣΙΟΣ-ΜΑΡΚΟΣ","Α.Ο.ΑΤΡΟΜΗΤΟΣ ΤΡΙΑΔΙΟΥ",6,0]
["18-32382","ΠΕΠΠΑΣ ΓΕΩΡΓΙΟΣ","Σ.Α.ΓΑΛΑΤΣΙΟΥ",6,0]
["18-34073","ΠΟΥΡΛΟΥΚΑΚΗΣ ΘΑΝΟΣ","Ο.Α.ΠΤΟΛΕΜΑΪΔΑΣ",6,0]
["18-29121","ΣΑΡΤΖΕΤΑΚΗΣ ΘΕΟΔΩΡΟΣ","Α.Π.Ο.ΣΑΝΝΥ ΣΠΟΡΤΣ ΚΛΑΜΠ",6,0]
["18-28165","ΣΕΛΙΒΑΝΩΦ ΠΑΥΛΟΣ-ΣΤΕΡΓΙΟΣ","Ο.Α.ΘΕΣΣΑΛΟΝΙΚΗΣ",6,0]
["18-29262","ΣΕΧΟΠΟΥΛΟΣ ΠΕΤΡΟΣ","Α.Ο.ΚΗΦΙΣΙΑΣ",6,0]
["18-32073","ΣΤΑΥΡΑΚΑΚΗΣ ΓΕΩΡΓΙΟΣ","Σ.Α.ΓΑΛΑΤΣΙΟΥ",6,0]
["18-33242","ΤΟΠΧΑΝΑΛΗΣ ΙΩΑΝΝΗΣ","Α.Σ.ΜΑΧΗΤΕΣ ΠΕΥΚΩΝ",6,0]
["18-25488","ΧΟΤΟΚΟΥΡΙΔΗΣ ΒΑΣΙΛΗΣ","Σ.Α.ΚΑΤΕΡΙΝΗΣ",6,0]
["18-30185","ΝΕΡΟΥΤΣΟΣ ΔΗΜΗΤΡΙΟΣ","Ο.Α.ΧΑΛΚΙΔΑΣ",5.5,0]
["18-26897","ΑΝΑΣΤΑΣΙΟΥ ΚΩΝΣΤΑΝΤΙΝΟΣ","ΦΘΙΩΤΙΚΟΣ Ο.Α.",5,0]
["18-31248","ΒΑΜΒΑΚΑΣ ΒΑΣΙΛΕΙΟΣ","Ο.Α.ΤΟΥΜΠΑΣ",5,0]
["18-27420","ΒΡΑΔΗΣ ΕΥΑΓΓΕΛΟΣ","Ο.Α.ΚΕΡΚΥΡΑΣ",5,0]
["18-34265","ΓΚΟΡΟΓΙΑΣ ΔΗΜΗΤΡΙΟΣ","Α.Σ.Α.ΑΓΡΙΝΙΟΥ",5,0]
["18-34541","ΔΡΟΣΟΣ ΓΕΩΡΓΙΟΣ-ΠΕΤΡΟΣ","Ο.Α.ΠΑΡΟΥ",5,0]
["18-33990","ΖΑΦΕΙΡΙΟΥ ΙΩΑΝΝΗΣ","Ο.Α.ΤΟΥΜΠΑΣ",5,0]
["18-33969","ΛΑΜΠΡΗΣ ΙΩΑΝΝΗΣ","Σ.Α.ΓΑΛΑΤΣΙΟΥ",5,0]
["18-34329","ΜΕΓΚΟΥΛΗΣ ΣΤΑΥΡΟΣ","Α.Σ.ΟΛΥΜΠΙΑΚΟΥ ΧΩΡΙΟΥ Ο ΦΟΙΒΟΣ",5,0]
["18-26819","ΠΑΠΑΔΟΠΟΥΛΟΣ ΜΑΞΙΜΟΣ","Μ.Γ.Σ.ΑΠΟΛΛΩΝ ΚΑΛΑΜΑΡΙΑΣ",5,0]
["18-29366","ΠΑΥΛΟΠΟΥΛΟΣ ΔΙΟΝΥΣΙΟΣ","Ο.Α.ΚΑΛΑΜΑΤΑΣ",5,0]
["18-31078","ΤΕΡΖΟΠΟΥΛΟΣ ΚΩΝΣΤΑΝΤΙΝΟΣ","Α.Σ.ΠΕΡΑ",5,0]
["18-28119","ΦΙΛΙΠΠΟΥ ΣΤΑΜΑΤΗΣ","Ο.Α.ΑΝΑΦΛΥΣΤΟΣ ΣΑΡΩΝΙΔΑΣ",5,0]
["18-34331","ΧΩΡΙΑΝΟΠΟΥΛΟΣ ΣΤΕΦΑΝΟΣ","Α.Σ.ΟΛΥΜΠΙΑΚΟΥ ΧΩΡΙΟΥ Ο ΦΟΙΒΟΣ",5,0]
["18-33002","ΑΛΕΦΑΝΤΟΣ ΣΠΥΡΙΔΩΝ","Σ.Α.ΡΑΦΗΝΑΣ",4.5,0]
["18-32606","ΚΑΛΔΗΣ ΑΝΔΡΕΑΣ","Α.Σ.ΠΕΡΑ",4.5,0]
["18-28792","ΛΟΥΛΑΚΗΣ ΘΕΟΧΑΡΗΣ","Α.Ο.Α.ΠΑΠΑΓΟΥ",4.5,0]
["18-28939","ΝΤΑΟΠΟΥΛΟΣ ΚΩΝΣΤΑΝΤΙΝΟΣ","Ο.Α.ΙΩΛΚΟΣ ΒΟΛΟΥ",4.5,0]
["18-27667","ΤΟΥΡΝΑΤΖΗΣ ΑΘΑΝΑΣΙΟΣ","Ο.Α.ΚΕΡΑΤΣΙΝΙΟΥ",4.5,0]
["18-33746","ΑΝΤΩΝΟΠΟΥΛΟΣ ΚΩΝΣΤΑΝΤΙΝΟΣ","Α.Σ.ΑΚΑΔΗΜΙΕΣ ΠΡΩΤΑΘΛΗΤΩΝ ΠΕΥΚΩΝ",4,0]
["18-28417","ΖΕΡΒΟΣ ΙΩΑΝΝΗΣ","Ο.Α.ΒΙΚΕΛΑΣ ΒΕΡΟΙΑΣ",4,0]
["18-33869","ΖΟΥΡΙΔΑΚΗΣ ΔΗΜΗΤΡΙΟΣ","Α.Ο.Α.ΧΑΪΔΑΡΙΟΥ",4,0]
["18-28945","ΚΑΚΑΚΗΣ ΒΑΣΙΛΕΙΟΣ-ΤΣΑΜΠΙΚΟΣ","ΡΟΔΙΑΚΟΣ Ο.Α.",4,0]
["18-25452","ΚΑΡΑΜΟΛΕΓΚΟΣ ΔΗΜΗΤΡΙΟΣ","Ο.Α.ΣΑΛΑΜΙΝΑΣ",4,0]
["18-24585","ΚΟΥΡΟΥΠΗΣ ΜΑΡΙΝΟΣ","Σ.Α.ΓΑΛΑΤΣΙΟΥ",4,0]
["18-31700","ΚΟΥΡΤΙΔΗΣ ΑΘΑΝΑΣΙΟΣ-ΧΡΗΣΤΟΣ","Α.Ο.ΧΡΥΣΟΥΠΟΛΗΣ",4,0]
["18-29094","ΚΩΣΤΑΣ ΒΛΑΧΟΥ  ΑΘΑΝΑΣΙΟΣ","Ο.Α.ΞΑΝΘΗΣ",4,0]
["18-29683","ΜΠΑΝΤΟΥΒΑΚΗΣ ΓΕΩΡΓΙΟΣ","Ο.Α.ΓΙΑΝΝΙΤΣΩΝ",4,0]
["18-32721","ΝΤΟΥΝΗΣ ΧΡΗΣΤΟΣ","Ο.Α.ΠΕΙΡΑΙΑ",4,0]
["18-33392","ΞΥΝΟΣ ΑΛΕΞΑΝΔΡΟΣ","Ο.Α.ΠΤΟΛΕΜΑΪΔΑΣ",4,0]
["18-33889","ΣΑΡΤΣΙΔΗΣ ΜΗΝΑΣ","Ο.Α.ΚΑΣΤΟΡΙΑΣ ΚΕΛΕΤΡΟΝ",4,0]
["18-29263","ΣΕΧΟΠΟΥΛΟΣ ΘΕΟΔΩΡΟΣ","Α.Ο.ΚΗΦΙΣΙΑΣ",4,0]
["18-28014","ΤΡΙΓΚΑΣ ΜΙΧΑΗΛ-ΑΓΓΕΛΟΣ","Ο.Α.ΒΡΙΛΗΣΣΙΩΝ",4,0]
["18-29314","ΤΣΙΡΟΓΙΑΝΝΗΣ ΑΡΙΣΤΟΓΕΝΗΣ","Ο.Α.ΓΟΥΔΙΟΥ",4,0]
["18-27772","ΦΤΟΥΛΗΣ ΜΑΝΩΛΗΣ","Α.Σ.ΟΛΥΜΠΙΑΚΟΥ ΧΩΡΙΟΥ Ο ΦΟΙΒΟΣ",4,0]
["18-31008","ΘΩΜΑΣ ΡΑΦΑΗΛ","Α.Σ.ΠΕΡΑ",3.5,0]
["18-27019","ΧΡΙΣΤΟΦΟΡΙΔΗΣ ΙΩΑΝΝΗΣ-ΜΕΛΚΩΝ","Α.Σ.ΠΕΡΑ",3.5,0]
["18-29661","ΑΓΑΘΟΣ ΙΩΑΝΝΗΣ","Ο.Α.ΚΕΡΚΥΡΑΣ",3,0]
["18-29659","ΑΛΕΤΡΑΣ ΚΩΝΣΤΑΝΤΙΝΟΣ","Ο.Α.ΚΕΡΚΥΡΑΣ",3,0]
["18-34292","ΑΡΒΑΝΙΤΗΣ ΕΡΜΗΣ","ΑΙΟΛΟΣ Α.Λ.ΙΛΙΟΥ",3,0]
["18-25573","ΒΙΣΒΙΚΗΣ ΘΕΟΔΩΡΟΣ","Α.Κ.Α.ΜΑΡΑΘΩΝΑ",3,0]
["18-25399","ΒΛΟΓΙΑΡΗΣ ΓΡΗΓΟΡΗΣ","Μ.Γ.Σ.ΑΠΟΛΛΩΝ ΚΑΛΑΜΑΡΙΑΣ",3,0]
["18-33921","ΓΑΣΠΑΡΗΣ ΙΩΑΝΝΗΣ","Α.Ο.Α.ΗΛΙΟΥΠΟΛΗΣ",3,0]
["18-26491","ΚΑΠΕΛΗΣ ΑΠΟΣΤΟΛΟΣ","Ο.Α.ΑΡΙΔΑΙΑΣ",3,0]
["18-27780","ΚΑΡΒΕΛΑΣ ΑΠΟΣΤΟΛΟΣ","Α.Σ.ΟΛΥΜΠΙΑΚΟΥ ΧΩΡΙΟΥ Ο ΦΟΙΒΟΣ",3,0]
["18-32264","ΚΑΡΥΔΗΣ ΦΩΤΗΣ","ΗΡΑΚΛΕΙΟ Ο.Α.& Α.",3,0]
["18-32092","ΚΟΝΤΑΚΤΣΗΣ ΛΑΖΑΡΟΣ","ΦΙΛΑΘΛΗΤ.ΣΥΛ.ΛΑΜΙΑΣ",3,0]
["18-34634","ΛΥΜΠΕΡΟΠΟΥΛΟΣ ΧΡΥΣΑΝΘΟΣ","Ο.Α.ΚΑΛΑΜΑΤΑΣ",3,0]
["18-28976","ΝΙΚΟΛΑΪΔΗΣ ΦΟΙΒΟΣ","Ο.Α.ΑΝΑΦΛΥΣΤΟΣ ΣΑΡΩΝΙΔΑΣ",3,0]
["18-32862","ΠΑΠΑΓΕΩΡΓΙΟΥ ΑΧΙΛΛΕΑΣ","Ο.Α.ΒΟΛΟΥ",3,0]
["18-31388","ΠΑΠΑΓΕΩΡΓΙΟΥ ΓΕΩΡΓΙΟΣ","Ο.Α.ΒΟΛΟΥ",3,0]
["18-29378","ΠΟΛΙΤΗΣ ΧΡΙΣΤΟΣ","Α.Ο.Α.ΧΑΪΔΑΡΙΟΥ",3,0]
["18-32948","ΠΡΑΤΙΚΑΚΗΣ ΕΜΜΑΝΟΥΗΛ","Ο.Α.ΞΑΝΘΗΣ",3,0]
["18-34320","ΡΑΜΑΝΤΑΝΗΣ ΝΙΚΟΛΑΟΣ","Ο.Α.ΣΟΦΑΔΩΝ ΚΑΡΔΙΤΣΑΣ",3,0]
["18-26456","ΣΠΑΝΟΥΔΑΚΗΣ ΠΑΥΛΟΣ-ΓΕΩΡΓΙΟΣ","Ο.Α.ΧΑΝΙΩΝ",3,0]
["18-33480","ΣΤΕΦΑΝΟΥ ΙΩΑΝΝΗΣ","Ο.Α.ΛΕΣΒΟΥ",3,0]
["18-28981","ΤΖΑΒΑΡΑΣ ΑΝΔΡΕΑΣ","Α.Ο.Α.ΠΑΤΡΩΝ",3,0]
["18-25400","ΤΣΟΓΚΑΣ ΔΙΟΝΥΣΗΣ","Μ.Γ.Σ.ΑΠΟΛΛΩΝ ΚΑΛΑΜΑΡΙΑΣ",3,0]
["18-28749","ΦΟΥΡΜΟΥΖΗΣ ΑΝΤΩΝΗΣ","Α.Ο.ΑΡΓΥΡΟΥΠΟΛΗΣ",3,0]
["18-28468","ΧΑΤΖΗΝΙΚΟΛΑΟΥ ΕΥΡΙΠΙΔΗΣ","Ο.Α.ΤΟΥΜΠΑΣ",3,0]
["18-28467","ΧΑΤΖΗΝΙΚΟΛΑΟΥ ΝΙΚΟΣ","Ο.Α.ΤΟΥΜΠΑΣ",3,0]
["18-30730","ΧΟΛΕΒΑΣ ΚΩΝ/ΝΟΣ","Ο.Α.ΑΙΓΙΑΛΕΙΑΣ",3,0]
["18-30405","ΓΚΙΩΝΗΣ ΔΗΜΗΤΡΗΣ","Ο.Α.ΚΑΙΣΑΡΙΑΝΗΣ",2.5,0]
["18-29735","ΤΑΛΙΟΥΡΗΣ ΓΕΩΡΓΙΟΣ","ΑΙΟΛΟΣ Α.Λ.ΙΛΙΟΥ",2.5,0]
["18-32501","ΤΖΙΕΡΑΣ ΙΑΣΟΝΑΣ","Α.Ο.ΒΑΡΗΣ ΑΝΑΓΥΡΟΥΣ",2.5,0]
["18-33271","ΤΣΟΥΜΑΝΗΣ ΓΕΩΡΓΙΟΣ-ΕΥΣΤΑΘΙΟΣ","Ο.Α.ΑΘΗΝΩΝ",2.5,0]
["18-30180","ΦΡΑΓΓΙΑΣ ΓΕΩΡΓΙΟΣ","Ο.Α.ΧΑΛΚΙΔΑΣ",2.5,0]
["18-28542","ΑΓΑΛΙΩΤΗΣ ΘΕΟΔΟΣΗΣ","Α.Ε.Τ.ΝΙΚΗ ΠΑΤΡΩΝ",2,0]
["18-32349","ΑΛΕΚΤΟΡΙΔΗΣ ΟΡΕΣΤΗΣ","Φ.Ο.Α.ΝΕΑΠΟΛΗΣ",2,0]
["18-29619","ΑΠΟΣΤΟΛΟΠΟΥΛΟΣ ΙΩΑΝΝΗΣ","Α.Σ.Α.ΑΓΡΙΝΙΟΥ",2,0]
["18-35175","ΑΠΟΣΤΟΛΟΥ ΙΩΑΝΝΗΣ","Α.Ο.Α.ΑΙΓΑΛΕΩ 92",2,0]
["18-24974","ΑΥΓΕΡΙΝΟΣ ΑΘΑΝΑΣΙΟΣ","Ο.Α.ΓΙΑΝΝΙΤΣΩΝ",2,0]
["18-33733","ΓΑΝΩΣΗΣ ΠΑΝΤΕΛΕΗΜΩΝ","Ο.Α.ΛΕΣΒΟΥ",2,0]
["18-34712","ΓΕΡΟΥ ΟΔΥΣΣΕΑΣ-ΑΓΓΕΛΟΣ","Α.Ο.ΚΑΛΛΙΤΕΧΝΟΥΠΟΛΗΣ",2,0]
["18-32905","ΓΚΕΣΟΥΛΗΣ ΑΡΙΣΤΟΤΕΛΗΣ","Ο.Α.ΙΩΑΝΝΙΝΩΝ",2,0]
["18-33949","ΓΛΕΝΤΗΣ ΚΩΝΣΤΑΝΤΙΝΟΣ","Ο.Α.ΑΓΙΑΣ ΠΑΡΑΣΚΕΥΗΣ",2,0]
["18-34633","ΔΙΟΝΥΣΟΠΟΥΛΟΣ ΑΛΕΞΑΝΔΡΟΣ","Ο.Α.ΚΑΛΑΜΑΤΑΣ",2,0]
["18-27260","ΕΞΟΥΖΙΔΗΣ ΗΛΙΑΣ","Ο.Α.ΒΡΙΛΗΣΣΙΩΝ",2,0]
["18-33508","ΕΥΑΓΓΕΛΙΔΗΣ ΕΥΑΓΓΕΛΟΣ","Α.Π.Ο.ΣΑΝΝΥ ΣΠΟΡΤΣ ΚΛΑΜΠ",2,0]
["18-30933","ΚΑΖΙΑΝΗΣ ΙΩΑΝΝΗΣ","Α.Ο.ΜΕΓΑΣ ΑΛΕΞΑΝΔΡΟΣ",2,0]
["18-33802","ΚΑΡΑΓΙΑΝΝΟΥΔΗΣ ΝΙΚΗΤΑΣ","Α.Σ.Α.ΠΑΝΟΡΑΜΑΤΟΣ",2,0]
["18-27785","ΚΑΡΒΕΛΑΣ ΣΩΤΗΡΗΣ","Α.Σ.ΟΛΥΜΠΙΑΚΟΥ ΧΩΡΙΟΥ Ο ΦΟΙΒΟΣ",2,0]
["18-34917","ΚΑΡΙΩΤΟΓΛΟΥ ΓΕΩΡΓΙΟΣ","Ο.Α.ΑΝΑΦΛΥΣΤΟΣ ΣΑΡΩΝΙΔΑΣ",2,0]
["18-22733","ΚΑΤΣΙΚΟΓΙΩΡΓΟΣ ΟΡΦΕΑΣ","Α.Ο.Α.ΑΤΤΙΚΟΣ ΗΛΙΟΣ",2,0]
["18-33895","ΚΟΓΚΑΛΙΔΗΣ ΔΗΜΗΤΡΙΟΣ","Α.Ο.Α.ΠΟΣΕΙΔΩΝ ΘΕΣΣΑΛΟΝΙΚΗΣ",2,0]
["18-33401","ΚΟΥΤΑΛΑΚΗΣ ΝΙΚΟΛΑΟΣ-ΑΡΗΣ","Α.Ο.Α.ΑΤΤΙΚΟΣ ΗΛΙΟΣ",2,0]
["18-34332","ΚΩΣΤΑΚΗΣ ΒΑΣΙΛΕΙΟΣ","Ο.Α.ΚΟΥΦΑΛΙΩΝ ΘΕΣΣΑΛΟΝΙΚΗΣ",2,0]
["18-34675","ΚΩΤΣΑΝΤΑΣ ΑΝΤΩΝΗΣ","Ο.Α.ΧΑΛΚΙΔΑΣ",2,0]
["18-25930","ΛΑΣΚΑΡΑΤΟΣ ΑΧΙΛΛΕΑΣ","Α.Ο.Π.ΦΑΛΗΡΟΥ",2,0]
["18-29424","ΜΑΓΕΙΡΑΣ ΑΘΑΝΑΣΙΟΣ","Α.Σ.ΑΚΡΟΠΟΛΙΣ",2,0]
["18-32631","ΜΑΡΡΑΣ ΚΩΝΣΤΑΝΤΙΝΟΣ","Α.Ο.Α.ΗΛΙΟΥΠΟΛΗΣ",2,0]
["18-28878","ΜΕΛΕΛΟΥΔΗΣ ΣΤΑΥΡΟΣ","Α.Ο.ΚΑΒΑΛΑΣ ΜΑΚΕΔΟΝΙΚΟΣ",2,0]
["18-27958","ΜΠΑΣΧΑΛΗΣ ΑΘΑΝΑΣΙΟΣ","Ο.Α.ΑΘΗΝΩΝ",2,0]
["18-34609","ΜΠΙΦΣΑΣ ΛΕΑΝΔΡΟΣ","Α.Σ.ΟΛΥΜΠΙΑΚΟΥ ΧΩΡΙΟΥ Ο ΦΟΙΒΟΣ",2,0]
["18-32495","ΜΠΟΥΤΙΚΟΣ ΧΡΗΣΤΟΣ","Γ.Ε.ΠΡΕΒΕΖΑΣ",2,0]
["18-33713","ΜΠΡΟΔΗΜΑΣ ΔΗΜΗΤΡΗΣ","Α.Σ.ΠΕΡΑ",2,0]
["18-34299","ΠΑΠΑΪΚΟΝΟΜΟΥ ΕΜΜΑΝΟΥΗΛ","Α.Ε.Τ.ΝΙΚΗ ΠΑΤΡΩΝ",2,0]
["18-26036","ΠΑΠΑΚΩΝΣΤΑΝΤΙΝΟΥ ΧΡΗΣΤΟΣ","Σ.Φ.Α.ΜΕΛΙΣΣΙΩΝ Ο ΦΟΙΒΟΣ",2,0]
["18-31699","ΠΑΠΑΜΑΥΡΟΣ ΑΝΔΡΕΑΣ","Γ.Σ.ΚΗΦΙΣΙΑΣ",2,0]
["18-31263","ΠΑΠΠΑΣ ΝΙΚΟΣ","Α.Ο.Α.ΗΛΙΟΥΠΟΛΗΣ",2,0]
["18-34264","ΠΛΑΤΑΝΙΑΣ ΓΕΩΡΓΙΟΣ","Α.Σ.Α.ΑΓΡΙΝΙΟΥ",2,0]
["18-34369","ΠΡΑΤΙΚΑΚΗΣ ΧΡΗΣΤΟΣ","Σ.Α.ΓΑΛΑΤΣΙΟΥ",2,0]
["18-27221","ΤΑΤΣΑΚΗΣ ΝΙΚΟΛΑΟΣ","Ο.Α.ΘΕΣΠΡΩΤΙΑΣ ΤΙΤΑΝΗ",2,0]
["18-33403","ΤΑΧΟΣ ΙΩΑΝΝΗΣ","Ο.Α.ΕΔΕΣΣΑΣ",2,0]
["18-24815","ΤΣΑΚΙΡΗΣ ΙΩΑΝΝΗΣ","Ο.Α.ΛΕΣΒΟΥ",2,0]
["18-28548","ΤΣΙΓΓΕΛΗΣ ΚΩΝΣΤΑΝΤΙΝΟΣ","Α.Ε.Τ.ΝΙΚΗ ΠΑΤΡΩΝ",2,0]
["18-34472","ΤΣΙΜΠΙΔΗΣ ΑΛΕΞΑΝΔΡΟΣ","Α.Ο.Α.ΚΑΒΑΛΑΣ",2,0]
["18-30429","ΤΣΟΤΡΑΣ ΧΡΗΣΤΟΣ","ΠΕΥΚΗ Γ.ΚΑΛΟΒΕΛΩΝΗΣ",2,0]
["18-28150","ΦΛΩΡΟΣ ΝΙΚΟΛΑΟΣ","Ο.Α.ΕΥΟΣΜΟΥ ΘΕΣΣΑΛΟΝΙΚΗΣ",2,0]
["18-32700","ΑΝΤΩΝΑΚΟΣ ΧΑΡΑΛΑΜΠΟΣ","Ο.Α.ΚΕΡΑΤΣΙΝΙΟΥ",1,0]
["18-31684","ΓΚΟΤΣΗΣ ΕΥΑΓΓΕΛΟΣ","Ο.Α.ΙΩΑΝΝΙΝΩΝ",1,0]
["18-33595","ΔΑΝΔΟΥΛΑΚΗΣ ΙΩΑΝΝΗΣ","Ο.Α.ΚΙΛΚΙΣ",1,0]
["18-30750","ΛΑΪΝΑΣ ΓΕΩΡΓΙΟΣ-ΝΙΚΟΛΑΟΣ","Α.Ε.Τ.ΝΙΚΗ ΠΑΤΡΩΝ",1,0]
["18-29677","ΨΑΡΑΥΤΗΣ ΝΙΚΟΛΑΟΣ","Σ.Φ.Α.ΜΕΛΙΣΣΙΩΝ Ο ΦΟΙΒΟΣ",1,0]
["18-32459","ΑΓΓΕΛΟΠΟΥΛΟΣ ΙΩΑΝΝΗΣ-ΒΛΑΣΙΟΣ","Α.Ο.Π.ΦΑΛΗΡΟΥ",0.5,0]
["18-34318","ΓΛΕΝΤΗΣ ΔΗΜΗΤΡΗΣ","Ο.Α.ΑΓΙΑΣ ΠΑΡΑΣΚΕΥΗΣ",0.5,0]
["18-27018","ΖΟΥΡΑΣ ΘΕΟΔΩΡΟΣ","Α.Σ.ΠΕΡΑ",0.5,0]
["18-32301","ΚΑΚΑΜΠΑΚΟΣ ΒΑΪΟΣ-ΑΝΔΡΕΑΣ","Α.Ο.Α.ΗΛΙΟΥΠΟΛΗΣ",0.5,0]
["18-28652","ΚΟΡΚΟΜΤΖΕΛΟΣ ΒΑΣΙΛΕΙΟΣ","Α.Ο.Α.ΗΛΙΟΥΠΟΛΗΣ",0.5,0]
["18-33901","ΠΟΛΥΧΡΟΝΟΠΟΥΛΟΣ ΑΡΜΑΝΔΟΣ","Α.Ο.Α.ΑΤΤΙΚΟΣ ΗΛΙΟΣ",0.5,0]
["18-32739","ΣΤΑΥΡΟΠΟΥΛΟΣ ΓΕΩΡΓΙΟΣ","Α.Ο.Α.ΗΛΙΟΥΠΟΛΗΣ",0.5,0]
["18-29603","ΑΡΑΝΙΤΗΣ ΚΩΝΣΤΑΝΤΙΝΟΣ","Α.Ο.Α.ΠΑΠΑΓΟΥ",0,0]
["18-31542","ΒΕΝΝΟΣ ΑΡΗΣ","Γ.Α.Ε.ΤΡΙΦΥΛΙΑΣ ΔΙΩΝ ΚΥΠΑΡΙΣΣΕΥΣ",0,0]
["18-32487","ΓΑΪΤΑΝΑΡΟΣ ΤΗΛΕΜΑΧΟΣ","Γ.Ε.ΠΡΕΒΕΖΑΣ",0,0]
["18-24018","ΓΑΚΙΔΗΣ ΓΕΩΡΓΙΟΣ","Ο.Π.ΘΕΣΣΑΛΟΝΙΚΗΣ ΜΑΚΕΔΟΝΙΑ 92",0,0]
["18-29689","ΓΑΛΑΝΗΣ ΧΑΡΙΛΑΟΣ","Ο.Α.ΑΡΙΔΑΙΑΣ",0,0]
["18-33987","ΓΕΡΑΡΔΟΣ ΓΕΡΑΣΙΜΟΣ","Μ.Γ.Σ.ΑΠΟΛΛΩΝ ΚΑΛΑΜΑΡΙΑΣ",0,0]
["18-32832","ΓΕΡΟΝΤΑΣ ΧΡΗΣΤΟΣ","Γ.Ε.ΠΡΕΒΕΖΑΣ",0,0]
["18-33989","ΓΕΩΡΓΙΟΥ ΑΝΑΣΤΑΣΙΟΣ","Μ.Γ.Σ.ΑΠΟΛΛΩΝ ΚΑΛΑΜΑΡΙΑΣ",0,0]
["18-22585","ΓΚΑΡΤΖΩΝΗΣ ΛΑΜΠΡΟΣ","Α.Γ.Ο.ΦΙΛΙΠΠΙΑΔΑΣ",0,0]
["18-25876","ΓΚΙΝΑΛΗΣ ΔΗΜΗΤΡΙΟΣ","Ν.Ο.ΘΕΣΣΑΛΟΝΙΚΗΣ",0,0]
["18-25250","ΓΡΗΓΟΡΙΟΥ ΑΝΑΣΤΑΣΙΟΣ","Α.Ε.Κ.ΤΡΙΠΟΛΗΣ",0,0]
["18-28971","ΕΥΤΥΧΙΟΥ ΧΑΡΑΛΑΜΠΟΣ","Ο.Α.ΑΘΗΝΩΝ",0,0]
["18-31587","ΖΑΓΚΛΙΒΕΡΙΝΟΣ ΧΡΗΣΤΟΣ","Α.Ο.ΑΤΡΟΜΗΤΟΣ ΤΡΙΑΔΙΟΥ",0,0]
["18-90128","ΙΓΚΝΙΑΤΟΒΙΤΣ ΜΑΡΤΙΝ","Σ.Α.ΓΑΛΑΤΣΙΟΥ",0,0]
["18-29828","ΚΑΖΑΝΤΖΗΣ ΓΕΡΑΣΙΜΟΣ","Ο.Α.ΑΘΗΝΩΝ",0,0]
["18-31743","ΚΑΝΤΖΑΒΕΛΟΣ ΜΙΧΑΗΛ","Α.Ε.Κ.ΤΡΙΠΟΛΗΣ",0,0]
["18-28127","ΚΕΡΑΜΙΔΑΣ ΣΤΥΛΙΑΝΟΣ","Α.Ο.ΜΕΓΑΣ ΑΛΕΞΑΝΔΡΟΣ",0,0]
["18-30155","ΛΑΜΠΡΟΠΟΥΛΟΣ ΠΑΝΑΓΙΩΤΗΣ","Α.Ε.Κ.ΤΡΙΠΟΛΗΣ",0,0]
["18-31277","ΜΑΡΚΟΠΟΥΛΟΣ ΒΙΚΤΩΡ-ΠΑΝΑΓΙΩΤΗΣ","Ο.Α.ΒΡΙΛΗΣΣΙΩΝ",0,0]
["18-21340","ΜΗΤΡΟΠΟΥΛΟΣ ΑΛΕΞΑΝΔΡΟΣ","Ο.Π.ΘΕΣΣΑΛΟΝΙΚΗΣ ΜΑΚΕΔΟΝΙΑ 92",0,0]
["18-28970","ΜΟΡΦΟΝΙΟΣ ΓΕΩΡΓΙΟΣ","Α.Σ.ΠΕΡΑ",0,0]
["18-33584","ΜΟΥΖΑΚΗΣ ΒΑΣΙΛΕΙΟΣ","Σ.Α.ΡΑΦΗΝΑΣ",0,0]
["18-26896","ΜΠΑΜΙΔΗΣ ΑΘΑΝΑΣΙΟΣ","ΦΘΙΩΤΙΚΟΣ Ο.Α.",0,0]
["18-28555","ΜΠΑΡΔΟΥΛΗΣ ΑΠΟΣΤΟΛΟΣ","Ο.Α.ΞΥΛΟΚΑΣΤΡΟΥ ΣΥΘΑΣ",0,0]
["18-31591","ΜΠΑΡΤΖΟΣ-ΝΑΖΙΡΗΣ ΑΛΕΞΑΝΔΡΟΣ","Α.Ο.ΑΤΡΟΜΗΤΟΣ ΤΡΙΑΔΙΟΥ",0,0]
["18-34661","ΝΙΚΟΛΑΚΑΚΗΣ ΟΡΕΣΤΗΣ","ΠΑΝΕΛΛΗΝΙΟΣ Γ.Σ.",0,0]
["18-34445","ΠΑΠΑΚΥΡΙΑΚΟΥ ΜΙΧΑΛΗΣ","Α.Ο.ΒΑΡΗΣ ΑΝΑΓΥΡΟΥΣ",0,0]
["18-31457","ΠΑΠΑΛΑΜΠΡΟΥ ΧΡΗΣΤΟΣ","Ο.Π.ΘΕΣΣΑΛΟΝΙΚΗΣ ΜΑΚΕΔΟΝΙΑ 92",0,0]
["18-29763","ΠΑΠΥΡΑΚΗΣ ΚΩΣΤΑΣ","ΗΡΑΚΛΕΙΟ Ο.Α.& Α.",0,0]
["18-24183","ΠΑΣΠΑΛΑΡΑΚΗΣ ΝΙΚΟΛΑΟΣ","Ο.Α.ΣΗΤΕΙΑΣ",0,0]
["18-26099","ΠΑΥΛΙΔΗΣ ΜΙΧΑΗΛ-ΠΑΝΑΓΙΩΤΗΣ","Σ.Α.ΣΕΡΡΩΝ",0,0]
["18-29808","ΡΟΖΟΣ ΝΙΚΟΛΑΟΣ","Ο.Α.ΙΩΑΝΝΙΝΩΝ",0,0]
["18-32558","ΣΑΜΟΪΛΗΣ ΓΕΡΑΣΙΜΟΣ","Ο.Α.ΚΕΡΚΥΡΑΣ",0,0]
["18-28569","ΤΣΑΪΚΑΝΙΔΗΣ ΑΛΕΞΑΝΔΡΟΣ","Ο.Π.ΘΕΣΣΑΛΟΝΙΚΗΣ ΜΑΚΕΔΟΝΙΑ 92",0,0]
["18-30911","ΤΣΑΚΑΛΑΚΗΣ ΝΙΚΟΛΑΟΣ","ΗΡΑΚΛΕΙΟ Ο.Α.& Α.",0,0]
["18-33281","ΤΣΑΚΙΡΗΣ ΣΤΕΦΑΝΟΣ","Α.Ο.Α.ΦΙΛΟΘΕΗΣ",0,0]
["18-30608","ΤΣΙΑΔΗΜΟΣ ΡΑΦΑΗΛ","Γ.Σ.ΕΛΕΥΘΕΡΙΟΥ ΚΟΡΔ.ΑΡΓΟΝΑΥΤΕΣ",0,0]
["18-34498","ΧΡΙΣΤΟΔΟΥΛΟΠΟΥΛΟΣ ΔΗΜΟΣΘΕΝΗΣ","Α.Α.ΑΙΓΑΛΕΩ",0,0]
["18-90116","ΑΜΜΕΡΜΑΝ ΣΤΕΦΑΝΟΣ","Ο.Α.ΑΘΛΗΤ.ΠΑΙΔΕΙΑ",0,0]
["18-24792","ΒΑΘΗΣ ΦΩΚΑΣ","Ο.Α.ΚΕΡΑΤΣΙΝΙΟΥ",0,0]
["18-26914","ΒΡΑΝΑΣ ΘΕΜΗΣ","Α.Ο.Α.ΦΙΛΟΘΕΗΣ",0,0]
["18-31254","ΓΙΑΝΝΟΥΤΣΟΣ ΘΕΟΔΩΡΟΣ","Α.Σ.ΑΚΡΟΠΟΛΙΣ",0,0]
["18-33143","ΔΙΟΝΥΣΟΠΟΥΛΟΣ ΜΑΡΙΟΣ","Ε.Σ.Ο.ΕΠΙΚΟΥΡΟΣ ΠΟΛΙΧΝΗΣ",0,0]
["18-24994","ΚΑΛΙΦΑΤΙΔΗΣ ΧΡΗΣΤΟΣ","ΠΑΝΘΡΑΚΙΚΟΣ Ο.Α.ΚΟΜΟΤΗΝΗΣ",0,0]
["18-32743","ΚΑΝΕΛΛΟΠΟΥΛΟΣ ΔΗΜΗΤΡΗΣ","Ο.Α.ΓΛΥΦΑΔΑΣ",0,0]
["18-25239","ΚΑΡΑΒΑΣ ΚΩΝΣΤΑΝΤΙΝΟΣ","Σ.Α.ΡΑΦΗΝΑΣ",0,0]
["18-30905","ΚΑΡΑΜΠΑΤΣΗΣ ΝΕΟΚΛΗΣ","Α.Ο.Α.ΑΙΓΑΛΕΩ 92",0,0]
["18-31195","ΚΑΡΑΠΕΤΣΑΝΟΣ ΑΘΑΝΑΣΙΟΣ","ΚΕΝΤΡΟ ΑΝΤΙΣΦΑΙΡΙΣΗΣ ΛΙΒΑΔΕΙΑΣ",0,0]
["18-26409","ΚΟΥΜΠΑΡΟΣ ΙΩΑΝΝΗΣ","Α.Ο.Α.ΠΡΩΤΑΘΛ.ΚΑΒΑΛΑΣ",0,0]
["18-25234","ΚΟΥΤΣΟΘΟΔΩΡΟΣ ΙΩΑΝΝΗΣ","ΚΕΝΤΡΟ ΑΝΤΙΣΦΑΙΡΙΣΗΣ ΛΙΒΑΔΕΙΑΣ",0,0]
["18-30874","ΛΙΑΚΑΤΣΙΔΑΣ ΙΩΑΝΝΗΣ","Α.Ο.Π.ΦΑΛΗΡΟΥ",0,0]
["18-29114","ΛΟΥΤΡΙΑΝΑΚΗΣ ΕΥΑΓΓΕΛΟΣ","Α.Α.ΑΙΓΑΛΕΩ",0,0]
["18-34166","ΛΥΜΠΕΡΟΠΟΥΛΟΣ ΘΕΟΔΩΡΟΣ","Σ.Φ.Α.ΜΕΛΙΣΣΙΩΝ Ο ΦΟΙΒΟΣ",0,0]
["18-30800","ΜΑΡΙΝΟΣ ΝΙΚΟΛΑΟΣ","Ο.Α.ΠΕΤΡΟΥΠΟΛΗΣ",0,0]
["18-30058","ΜΕΡΚΟΥΡΗΣ ΓΕΩΡΓΙΟΣ","Ο.Α.ΚΕΡΑΤΣΙΝΙΟΥ",0,0]
["18-30188","ΜΟΥΤΣΑΤΣΟΣ ΝΙΚΟΛΑΟΣ","Ο.Α.ΧΑΛΚΙΔΑΣ",0,0]
["18-31644","ΜΠΕΛΛΟΣ ΝΙΚΟΛΑΣ","Α.Σ.ΠΕΡΑ",0,0]
["18-31197","ΜΠΙΜΗΣ ΚΩΝΣΤΑΝΤΙΝΟΣ","ΚΕΝΤΡΟ ΑΝΤΙΣΦΑΙΡΙΣΗΣ ΛΙΒΑΔΕΙΑΣ",0,0]
["18-30189","ΜΥΤΑΛΑΣ ΕΥΑΓΓΕΛΟΣ","Ο.Α.ΚΕΡΑΤΣΙΝΙΟΥ",0,0]
["18-32850","ΝΤΙΝΟΥ ΠΑΡΑΣΚΕΥΑΣ","Α.Ο.Α.ΗΛΙΟΥΠΟΛΗΣ",0,0]
["18-28787","ΠΑΠΑΖΟΓΛΟΥ ΙΩΑΝΝΗΣ","Ο.Α.ΓΛΥΦΑΔΑΣ",0,0]
["18-25082","ΠΑΤΕΛΗΣ ΓΕΩΡΓΙΟΣ","Α.Ν.Ο.ΓΛΥΦΑΔΑΣ",0,0]
["18-34139","ΠΟΛΙΤΗΣ ΗΛΙΑΣ","Α.Ο.Α.ΑΙΓΑΛΕΩ 92",0,0]
["18-33902","ΠΟΛΥΧΡΟΝΟΠΟΥΛΟΣ ΘΕΟΧΑΡΗΣ","Α.Ο.Α.ΑΤΤΙΚΟΣ ΗΛΙΟΣ",0,0]
["18-32891","ΠΟΥΛΑΚΗΣ ΣΤΕΦΑΝΟΣ","Ο.Α.ΚΑΒΑΛΑΣ ΑΛΕΞΑΝΔΡΟΣ",0,0]
["18-23570","ΣΑΚΟΥΛΗΣ ΠΑΝΑΓΙΩΤΗΣ","Α.Σ.ΠΕΡΑ",0,0]
["18-30066","ΣΕΚΛΕΙΖΙΩΤΗΣ ΒΑΣΙΛΗΣ","Ο.Α.ΚΕΡΑΤΣΙΝΙΟΥ",0,0]
["18-90052","ΣΛΙΠΤΣΕΝΚΟ ΜΑΡΚΟΣ","Α.Ο.Π.ΦΑΛΗΡΟΥ",0,0]
["18-22987","ΣΤΑΜΑΤΑΚΟΣ ΣΩΤΗΡΗΣ","Α.Ε.Κ.ΤΡΙΠΟΛΗΣ",0,0]
["18-33321","ΣΤΑΜΑΤΙΟΥ ΑΓΓΕΛΟΣ","Ο.Α.ΑΘΛΗΤ.ΠΑΙΔΕΙΑ",0,0]
["18-29902","ΣΤΥΛΙΑΝΟΣ ΠΑΝΑΓΙΩΤΗΣ","Α.Σ.Ε.ΘΗΣΕΑΣ ΑΓΙΟΥ ΔΗΜΗΤΡΙΟΥ",0,0]
["18-32055","ΤΖΟΥΛΙΑΝΑ ΔΑΥΙΔ-ΧΡΗΣΤΟΣ","Ο.Α.ΒΡΙΛΗΣΣΙΩΝ",0,0]
["18-31198","ΤΣΕΚΟΥΡΑΣ ΓΕΩΡΓΙΟΣ","ΚΕΝΤΡΟ ΑΝΤΙΣΦΑΙΡΙΣΗΣ ΛΙΒΑΔΕΙΑΣ",0,0]
["18-29286","ΦΕΛΕΜΕΓΚΑΣ ΝΙΚΟΣ","Α.Ο.Π.ΦΑΛΗΡΟΥ",0,0]
["18-25731","ΖΟΥΜΠΟΥΛΑΚΗΣ ΑΝΔΡΕΑΣ","Ο.Α.ΒΟΛΟΥ",0,0]
["12-34427","ΣΑΚΕΛΛΑΡΙΔΗ ΣΑΠΦΩ","Ο.Α.ΑΓΙΑΣ ΠΑΡΑΣΚΕΥΗΣ",180.5,0]
["12-31873","ΓΡΙΒΑ ΒΑΣΙΛΕΙΑ","ΑΙΟΛΟΣ Α.Λ.ΙΛΙΟΥ",93,0]
["12-31551","ΠΑΠΑΚΩΝΣΤΑΝΤΙΝΟΥ ΕΛΕΝΑ-ΜΑΡΙΑ","ΦΘΙΩΤΙΚΟΣ Ο.Α.",88,0]
["12-30176","ΓΙΑΝΝΑΚΟΥ ΙΩΑΝΝΑ","Α.Ο.Α.ΠΟΣΕΙΔΩΝ ΘΕΣΣΑΛΟΝΙΚΗΣ",68.5,0]
["12-29169","ΝΤΑΝΟΥ ΧΡΙΣΤΙΝΑ","Ο.Α.ΓΟΥΔΙΟΥ",67.5,0]
["12-31890","ΚΑΠΕΛΛΑ ΜΥΡΤΩ","Α.Ο.Α.ΗΛΙΟΥΠΟΛΗΣ",64.5,0]
["12-32081","ΚΥΠΡΑΙΟΥ ΣΤΕΦΑΝΙΑ-ΒΑΣΙΛΙΚΗ","Α.Ο.Α.ΣΤΑΥΡΟΥΠΟΛΗΣ ΙΦΙΤΟΣ",63.5,0]
["12-30765","ΠΑΡΑΣΚΕΥΟΥΔΗ ΑΝΑΣΤΑΣΙΑ","Φ.Ο.Α.ΝΕΑΠΟΛΗΣ",58.5,0]
["12-31131","ΔΗΜΗΤΡΑΚΟΠΟΥΛΟΥ ΣΕΜΕΛΗ-ΕΥΓΕΝΙΑ","Α.Κ.Α.ΜΑΡΑΘΩΝΑ",58,0]
["12-31555","ΖΟΥΜΠΑ ΕΥΤΥΧΙΑ","Ο.Α.ΣΟΥΔΑΣ",57,0]
["12-31487","ΒΛΑΧΟΥ ΛΥΔΙΑ","ΦΘΙΩΤΙΚΟΣ Ο.Α.",55,0]
["12-32289","ΦΑΣΟΥΛΑ ΕΛΕΝΗ","Ο.Α.ΓΛΥΦΑΔΑΣ",52,0]
["12-31603","ΠΑΠΑΔΗΜΗΤΡΗ ΠΑΡΑΣΚΕΥΗ","ΡΟΔΙΑΚΗ ΑΚΑΔ.ΑΝΤΙΣΦ.",48.5,0]
["12-32269","ΚΑΡΥΜΠΙΔΟΥ ΕΥΓΕΝΙΑ","Φ.Ο.Α.ΝΕΑΠΟΛΗΣ",45.5,0]
["12-30799","ΣΤΑΜΕΝΟΥ ΕΛΠΙΔΑ","Α.Κ.Α.ΜΑΡΑΘΩΝΑ",44.5,0]
["12-32546","ΖΑΧΑΡΑΚΗ ΙΩΑΝΝΑ","Ο.Α.ΣΑΛΑΜΙΝΑΣ",40.5,0]
["12-33158","ΧΟΛΕΒΑ ΕΛΕΝΗ-ΜΑΡΙΑ","Α.Σ.Α.ΠΑΜΒΩΤΙΣ ΙΩΑΝΝΙΝΩΝ",40.5,0]
["12-30563","ΑΝΔΡΙΟΠΟΥΛΟΥ ΑΓΓΕΛΙΚΗ-ΑΘΑΝΑΣΙΑ","Α.Ε.Τ.ΝΙΚΗ ΠΑΤΡΩΝ",39,0]
["12-32663","ΔΙΑΚΟΥΜΑΚΟΥ ΟΛΓΑ","Α.Ο.Α.ΠΑΠΑΓΟΥ",37.5,0]
["12-32883","ΑΝΑΓΝΩΣΤΟΥ ΑΙΚΑΤΕΡΙΝΗ","ΚΕΡΚΥΡΑΪΚΗ Λ.Τ.",34.5,0]
["12-32451","ΜΠΟΣΕΡΩ ΝΕΦΕΛΗ","Ο.Α.ΧΟΛΑΡΓΟΥ",34.5,0]
["12-30332","ΚΑΝΔΡΕΛΗ ΠΑΡΑΣΚΕΥΗ-ΜΑΡΙΝΑ","Α.Σ.Α.ΠΑΜΒΩΤΙΣ ΙΩΑΝΝΙΝΩΝ",34,0]
["12-34255","ΖΑΦΕΙΡΗ ΝΕΦΕΛΗ","Ο.Α.ΑΘΗΝΩΝ",31,0]
["12-30148","ΚΑΡΑΝΑΓΝΩΣΤΗ ΜΑΡΙΑ","Α.Ε.Κ.ΤΡΙΠΟΛΗΣ",29.5,0]
["12-33331","ΑΔΑΜΟΠΟΥΛΟΥ ΜΑΓΔΑΛΙΝΗ","Ο.Α.ΠΕΤΡΟΥΠΟΛΗΣ",29.5,0]
["12-31852","ΒΕΛΙΒΑΣΑΚΗ ΧΑΡΙΚΛΕΙΑ","ΗΡΑΚΛΕΙΟ Ο.Α.& Α.",29,0]
["12-30956","ΧΑΝΤΑΒΑ ΘΕΟΔΩΡΑ","Α.Σ.ΤΕΝΙΣ ΚΛΑΜΠ ΚΟΖΑΝΗΣ",29,0]
["12-30545","ΠΡΙΝΙΑΝΑΚΗ ΕΥΑΓΓΕΛΙΑ","ΦΙΛΙΑ Τ.Κ.",28,0]
["12-31639","ΓΑΝΙΤΗ ΖΩΗ","Ν.Ο.Ν.Α.Μ",27.5,0]
["12-30949","ΝΑΣΤΟΥ ΕΙΡΗΝΗ","Α.Ο.Α.ΠΡΩΤΑΘΛ.ΚΑΒΑΛΑΣ",25.5,0]
["12-30529","ΒΟΓΙΑΤΖΟΓΛΟΥ ΜΑΡΙΑΝΝΑ","Ο.Α.ΧΑΝΙΩΝ",24.5,0]
["12-32706","ΔΕΛΗΓΙΑΝΝΗ ΕΛΛΗ-ΕΥΤΥΧΙΑ","Α.Ο.Α.ΠΑΠΑΓΟΥ",24.5,0]
["12-33310","ΛΟΓΟΘΕΤΗ ΕΛΛΗ","Ο.Α.ΧΟΛΑΡΓΟΥ",24,0]
["12-31879","ΚΑΣΣΙΔΟΥ ΚΩΝΣΤΑΝΤΙΝΑ","Ο.Α.ΓΙΑΝΝΙΤΣΩΝ",23,0]
["12-31384","ΧΑΛΒΑΝΤΖΗ ΑΙΚΑΤΕΡΙΝΗ","Σ.Α.ΣΕΡΡΩΝ",23,0]
["12-30527","ΒΑΡΒΕΡΑΚΗ ΜΑΡΙΑ","Ο.Α.ΧΑΝΙΩΝ",22.5,0]
["12-33314","ΣΠΥΡΟΥ ΖΩΗ","Α.Ο.Π.ΦΑΛΗΡΟΥ",21,0]
["12-31573","ΚΙΤΣΗ ΜΕΛΠΟΜΕΝΗ","Σ.Α.ΕΛΑΣΣΟΝΑΣ",20.5,0]
["12-33089","ΚΩΤΣΙΟΥ ΜΑΡΙΑ-ΑΣΠΑΣΙΑ","ΗΡΑΚΛΕΙΟ Ο.Α.& Α.",20.5,0]
["12-30463","ΤΟΥΛΑΤΟΥ ΦΙΟΡΟΥΛΑ","ΚΕΦΑΛΛΗΝΙΑΚΟΣ Ο.Α.",20.5,0]
["12-32946","ΚΟΥΛΟΥΜΠΟΥ ΑΓΓΕΛΙΚΗ","Ο.Α.ΚΑΛΑΜΑΤΑΣ",19,0]
["12-33110","ΜΠΙΛΛΗ ΧΡΙΣΤΙΝΑ","ΠΕΥΚΗ Γ.ΚΑΛΟΒΕΛΩΝΗΣ",20,0]
["12-33092","ΔΕΣΚΟΥΛΙΔΟΥ ΧΡΥΣΑΝΘΗ","ΦΙΛΙΑ Τ.Κ.",19.5,0]
["12-32662","ΜΠΑΚΕΛΛΑ ΑΙΚΑΤΕΡΙΝΗ","Α.Ο.Α.ΠΑΠΑΓΟΥ",19,0]
["12-32860","ΠΟΤΣΗ ΓΕΩΡΓΙΑ-ΖΩΗ","Ο.Α.ΓΟΥΔΙΟΥ",19,0]
["12-33437","ΓΡΑΜΜΑΤΙΚΑΚΗ ΧΑΡΑΛΑΜΠΙΑ","ΠΕΥΚΗ Γ.ΚΑΛΟΒΕΛΩΝΗΣ",18,0]
["12-27518","ΚΟΥΛΟΥΚΥΘΑ ΣΗΜΕΛΑ-ΑΡΕΤΗ","Σ.Α.ΡΑΦΗΝΑΣ",17.5,0]
["12-33088","ΖΑΦΕΙΡΟΠΟΥΛΟΥ ΚΑΤΕΡΙΝΑ","ΗΡΑΚΛΕΙΟ Ο.Α.& Α.",17,0]
["12-33080","ΒΛΑΣΤΟΥ ΜΑΡΙΑ-ΕΥΑΓΓΕΛΙΑ","Ο.Α.ΑΙΓΙΑΛΕΙΑΣ",16.5,0]
["12-34231","ΚΑΤΡΑΛΗ ΑΝΝΑ","Ο.Α.ΑΘΗΝΩΝ",16.5,0]
["12-33177","ΚΟΥΚΟΥΒΕ ΖΩΗ","Α.Ο.Α.ΠΑΠΑΓΟΥ",16.5,0]
["12-32456","ΚΟΥΤΣΟΥΜΠΑ ΙΩΑΝΝΑ","ΦΘΙΩΤΙΚΟΣ Ο.Α.",16.5,0]
["12-32222","ΣΤΑΜΟΥΛΟΥ ΑΝΝΑ-ΜΑΡΙΑ","Ο.Α.ΧΑΝΙΩΝ",16.5,0]
["12-30394","ΠΟΛΙΟΥΔΑΚΗ ΑΝΝΑ-ΜΑΡΙΑ","Α.Ο.Α.ΡΕΘΥΜΝΟ Τ.Κ.",15.5,0]
["12-30847","ΓΕΡΟΜΑΡΚΑΚΗ ΑΝΑΣΤΑΣΙΑ","Α.Ο.Α.ΣΤΑΥΡΟΥΠΟΛΗΣ ΙΦΙΤΟΣ",15,0]
["12-30544","ΔΕΣΚΟΥΛΙΔΟΥ ΙΩΑΝΝΑ","ΦΙΛΙΑ Τ.Κ.",13.5,0]
["12-32603","ΚΛΑΔΟΥ ΑΜΑΛΙΑ","ΗΡΑΚΛΕΙΟ Ο.Α.& Α.",13.5,0]
["12-33525","ΠΑΡΑΣΚΕΥΑ ΑΝΤΩΝΙΑ","Α.Ο.Α.ΠΑΠΑΓΟΥ",12.5,0]
["12-31261","ΜΕΛΛΟΥ ΑΝΑΣΤΑΣΙΑ","ΝΑΥΠΛΙΑΚΟΣ Ο.Α.",12,0]
["12-33581","ΤΖΟΚΑ ΜΥΡΤΩ-ΙΩΑΝΝΑ","Γ.Ε.ΠΡΕΒΕΖΑΣ",12,0]
["12-30907","ΑΤΜΑΤΣΙΔΟΥ ΑΙΚΑΤΕΡΙΝΗ","Α.Ο.Α.ΣΤΑΥΡΟΥΠΟΛΗΣ ΙΦΙΤΟΣ",11.5,0]
["12-33382","ΠΙΤΤΑΡΑ ΑΡΤΕΜΙΣ","Ο.Α.ΓΟΥΔΙΟΥ",10.5,0]
["12-33411","ΚΟΚΑΛΗ ΕΙΡΗΝΗ","Α.Γ.Ο.ΦΙΛΙΠΠΙΑΔΑΣ",10,0]
["12-33408","ΣΤΑΜΑΤΗ ΔΗΜΗΤΡΑ-ΝΕΦΕΛΗ","Α.Γ.Ο.ΦΙΛΙΠΠΙΑΔΑΣ",10,0]
["12-31896","ΣΤΕΡΓΙΟΠΟΥΛΟΥ ΑΘΗΝΑ","Ο.Α.ΑΓΙΑΣ ΠΑΡΑΣΚΕΥΗΣ",10,0]
["12-24364","ΨΑΡΑΚΗ ΑΜΑΛΙΑ-ΜΑΡΙΝΑ","Α.Ε.Κ.ΤΡΙΠΟΛΗΣ",10,0]
["12-32742","ΒΕΡΓΟΥ ΕΥΑΓΓΕΛΙΑ","Α.Ο.Α.ΠΑΠΑΓΟΥ",9.5,0]
["12-31364","ΣΑΜΑΡΑ ΒΑΣΙΛΙΚΗ-ΜΑΓΔΑΛΗΝΗ","ΠΑΝΘΡΑΚΙΚΟΣ Ο.Α.ΚΟΜΟΤΗΝΗΣ",9.5,0]
["12-34607","ΦΟΥΝΤΟΥΛΗ ΑΛΕΞΑΝΔΡΑ","ΗΡΑΚΛΕΙΟ Ο.Α.& Α.",9.5,0]
["12-28303","ΤΣΕΠΛΕΤΙΔΟΥ ΜΑΡΙΑ","Μ.Γ.Σ.ΑΠΟΛΛΩΝ ΚΑΛΑΜΑΡΙΑΣ",8,0]
["12-34481","ΓΑΡΕΦΗ ΣΟΦΙΑ","Σ.Α.ΘΕΣΣΑΛΟΝΙΚΗΣ",8.5,0]
["12-33409","ΑΝΔΡΕΑΝΙΔΗ ΒΑΣΙΛΙΚΗ","Α.Γ.Ο.ΦΙΛΙΠΠΙΑΔΑΣ",8,0]
["12-31777","ΑΡΒΑΝΙΤΙΔΟΥ ΕΛΕΝΗ","Α.Ο.Α.ΠΡΩΤΑΘΛ.ΚΑΒΑΛΑΣ",8,0]
["12-31939","ΚΑΛΛΕΡΓΗ ΑΡΤΕΜΗ","ΗΡΑΚΛΕΙΟ Ο.Α.& Α.",8,0]
["12-32823","ΜΠΕΡΗ ΣΤΑΥΡΙΝΑ","Ο.Α.ΣΑΛΑΜΙΝΑΣ",8,0]
["12-29067","ΠΑΛΤΟΓΛΟΥ ΕΛΙΣΣΑΒΕΤ","Α.Ο.ΚΑΒΑΛΑΣ ΜΑΚΕΔΟΝΙΚΟΣ",7,0]
["12-31374","ΣΠΥΡΟΠΟΥΛΟΥ ΜΑΡΙΑΝΘΗ","Α.Σ.ΑΚΡΟΠΟΛΙΣ",7.5,0]
["12-30853","ΦΑΚΑ ΔΗΜΗΤΡΑ","Ο.Α.ΚΟΥΦΑΛΙΩΝ ΘΕΣΣΑΛΟΝΙΚΗΣ",7.5,0]
["12-33648","ΑΔΑΜΟΠΟΥΛΟΥ ΑΝΑΣΤΑΣΙΑ","Α.Ο.Α.ΧΑΪΔΑΡΙΟΥ",7,0]
["12-31297","ΒΑΦΕΙΑΔΟΥ ΣΤΥΑΡΟΥΛΑ","Ο.Α.ΓΙΑΝΝΙΤΣΩΝ",7,0]
["12-27436","ΠΑΠΑΔΟΠΟΥΛΟΥ ΕΥΘΥΜΙΑ-ΜΑΡΙΑ","Α.Ο.ΚΑΒΑΛΑΣ ΜΑΚΕΔΟΝΙΚΟΣ",7,0]
["12-33694","ΓΕΩΡΓΑΝΤΖΕΛΗ ΚΩΝΣΤΑΝΤΙΝΑ-ΚΥΡΙΑΚΗ","Φ.Ο.Α.ΝΕΑΠΟΛΗΣ",6.5,0]
["12-30844","ΚΥΡΙΤΣΗ ΠΑΡΑΣΚΕΥΗ","Α.Α.ΑΛΜΠΑΤΡΟΣ",6.5,0]
["12-30852","ΓΚΟΓΚΙΔΟΥ ΙΣΙΔΩΡΑ","Ο.Α.ΚΟΥΦΑΛΙΩΝ ΘΕΣΣΑΛΟΝΙΚΗΣ",6,0]
["12-31430","ΚΑΚΑΡΙΔΗ ΜΑΡΙΑ-ΖΑΝΑ","Σ.Α.ΣΕΡΡΩΝ",6,0]
["12-32683","ΚΟΥΛΑ ΙΣΜΗΝΗ","Α.Ο.Α.ΠΑΠΑΓΟΥ",6,0]
["12-33759","ΣΕΡΠΑΝΟΥ ΓΕΩΡΓΙΑ","Ο.Α.ΡΙΟΥ",6,0]
["12-31418","ΑΓΓΕΛΟΠΟΥΛΟΥ ΙΩΑΝΝΑ","Γ.Σ.ΛΙΒΥΚΟΣ ΙΕΡΑΠΕΤΡΑΣ",5.5,0]
["12-32155","ΒΑΓΓΕΛΑΤΟΥ ΕΥΑΓΓΕΛΙΑ","ΚΕΦΑΛΛΗΝΙΑΚΟΣ Ο.Α.",5.5,0]
["12-34287","ΚΑΚΑΒΑ ΛΑΜΠΡΙΝΗ","Α.Ο.Α.ΗΛΙΟΥΠΟΛΗΣ",5.5,0]
["12-33367","ΚΑΤΣΟΥΔΑ ΑΣΠΑΣΙΑ","Ο.Α.ΣΥΡΟΥ",5.5,0]
["12-32625","ΚΩΣΤΟΥΣΗ ΜΑΡΙΑ","Α.Γ.Ο.ΦΙΛΙΠΠΙΑΔΑΣ",5.5,0]
["12-32951","ΜΑΡΚΟΥΤΣΑ ΕΛΕΝΗ-ΑΝΝΑ","ΖΑΚΥΝΘΙΝΟΣ Α.Ο.Α",5.5,0]
["12-31416","ΠΕΤΑΣΗ ΣΤΕΛΛΑ","Γ.Σ.ΛΙΒΥΚΟΣ ΙΕΡΑΠΕΤΡΑΣ",5.5,0]
["12-29972","ΕΠΑΓΓΕΛΗ ΓΕΩΡΓΙΑ","Ο.Α.ΚΑΣΤΟΡΙΑΣ ΚΕΛΕΤΡΟΝ",4,0]
["12-34220","ΚΟΥΜΕΡΤΑ ΝΕΡΑΤΖΙΑ","Α.Ν.Σ.ΕΛΛΗΝΙΚΙΩΤΩΝ",5,0]
["12-32521","ΦΑΪΣΤ ΕΛΕΝΗ-ΛΕΟΚΑΝΤΙΑ","Α.Ο.Α.ΑΙΓΑΛΕΩ 92",5,0]
["12-30850","ΦΡΑΓΓΟΠΟΥΛΟΥ ΧΡΙΣΤΙΝΑ","Ο.Α.ΚΟΥΦΑΛΙΩΝ ΘΕΣΣΑΛΟΝΙΚΗΣ",5,0]
["12-31437","ΒΑΡΔΑ ΑΝΝΑ - ΜΑΡΙΑ","Α.Ο.ΛΑΤΩ ΑΓ.ΝΙΚΟΛΑΟΥ",4.5,0]
["12-90141","ΚΕΝΤΕΡ ΜΑΡΙΑ-ΛΟΥΙΖΑ","Σ.Α.ΡΑΦΗΝΑΣ",4.5,0]
["12-34319","ΚΛΑΔΕΥΤΗΡΑ ΔΑΝΑΗ","Ο.Α.ΠΕΤΡΟΥΠΟΛΗΣ",4.5,0]
["12-32726","ΣΤΡΑΝΤΖΙΑ ΑΝΑΣΤΑΣΙΑ","Ο.Α.ΝΕΣΤΩΡΑΣ ΓΙΑΝΝΙΤΣΩΝ",4.5,0]
["12-32091","ΧΑΤΖΗΑΠΟΣΤΟΛΟΥ ΕΛΕΝΗ","Ο.Α.ΞΑΝΘΗΣ",4.5,0]
["12-32878","ΘΕΟΧΑΡΗ ΜΑΡΙΑ","Α.Ν.Ο.ΓΛΥΦΑΔΑΣ",4,0]
["12-34284","ΚΑΛΟΚΥΡΗ ΜΑΡΙΑ","Α.Ο.ΜΕΓΑΣ ΑΛΕΞΑΝΔΡΟΣ",4,0]
["12-32193","ΜΑΡΑΓΚΟΥ ΜΑΡΓΑΡΙΤΑ","Ο.Α.ΣΥΡΟΥ",4,0]
["12-32192","ΜΑΡΑΓΚΟΥ ΝΙΚΟΛΕΤΤΑ","Ο.Α.ΣΥΡΟΥ",4,0]
["12-31436","ΝΙΚΗΤΑΚΗ ΜΑΡΙΑ","Α.Ο.ΛΑΤΩ ΑΓ.ΝΙΚΟΛΑΟΥ",4,0]
["12-27800","ΠΑΠΑΦΙΛΙΠΠΟΥ ΠΑΡΑΣΚΕΥΗ-ΙΩΑΝΝΑ","Ο.Α.ΚΑΣΤΟΡΙΑΣ ΚΕΛΕΤΡΟΝ",4,0]
["12-31415","ΠΕΤΑΣΗ ΕΛΠΙΔΑ","Γ.Σ.ΛΙΒΥΚΟΣ ΙΕΡΑΠΕΤΡΑΣ",4,0]
["12-32474","ΠΟΙΜΕΝΙΔΟΥ ΔΕΣΠΟΙΝΑ","Ο.Α.ΞΑΝΘΗΣ",4,0]
["12-30597","ΤΖΩΡΤΖΟΠΟΥΛΟΥ ΕΛΕΥΘΕΡΙΑ","ΗΡΑΚΛΕΙΟ Ο.Α.& Α.",4,0]
["12-32806","ΑΜΑΝΑΤΙΔΗ ΕΛΙΣΑΒΕΤ","Α.Ο.Α.ΑΤΤΙΚΟΣ ΗΛΙΟΣ",3.5,0]
["12-31717","ΒΑΣΙΛΕΙΑΔΟΥ ΡΑΦΑΗΛΙΑ-ΓΕΩΡΓΙΑ","Ο.Α.ΝΕΣΤΩΡΑΣ ΓΙΑΝΝΙΤΣΩΝ",3.5,0]
["12-31474","ΓΙΑΝΝΑΤΟΥ ΑΓΓΕΛΙΚΗ","ΚΕΦΑΛΛΗΝΙΑΚΟΣ Ο.Α.",3.5,0]
["12-31632","ΚΑΜΠΟΥΡΙΔΟΥ ΑΙΚΑΤΕΡΙΝΗ","Α.Ο.ΚΑΒΑΛΑΣ ΜΑΚΕΔΟΝΙΚΟΣ",3.5,0]
["12-31342","ΜΕΡΤΖΑΝΙΔΟΥ ΙΩΑΝΝΑ","Α.Ο.Α.ΝΕΑΣ ΠΕΡΑΜΟΥ ΟΙ ΤΙΤΑΝΕΣ",3.5,0]
["12-33496","ΜΠΑΖΙΓΟΥ ΕΛΕΥΘΕΡΙΑ-ΧΡΙΣΤΙΝΑ","ΚΕΦΑΛΛΗΝΙΑΚΟΣ Ο.Α.",3.5,0]
["12-31338","ΝΑΛΜΠΑΝΤΗ ΝΙΚΟΛΕΤΤΑ-ΙΣΜΗΝΗ","Α.Ο.Α.ΝΕΑΣ ΠΕΡΑΜΟΥ ΟΙ ΤΙΤΑΝΕΣ",3.5,0]
["12-34884","ΠΑΠΑΔΑΤΟΥ ΚΑΤΕΡΙΝΑ","ΚΕΦΑΛΛΗΝΙΑΚΟΣ Ο.Α.",3.5,0]
["12-34890","ΣΤΑΒΕΡΗ ΑΡΤΕΜΗ","ΚΕΦΑΛΛΗΝΙΑΚΟΣ Ο.Α.",3.5,0]
["12-33874","ΣΤΕΛΛΙΑΤΟΥ ΕΥΡΟΣΥΝΗ-ΓΕΩΡΓΙΑ","Α.Ο.ΜΕΓΑΣ ΑΛΕΞΑΝΔΡΟΣ",3.5,0]
["12-33383","ΤΣΟΜΠΑΝΙΔΟΥ ΝΙΚΟΛΕΤΑ","Σ.Α.ΔΡΑΜΑΣ",3.5,0]
["12-32504","ΜΑΚΡΗ ΜΥΡΣΙΝΗ","Α.Ο.Α.ΧΑΪΔΑΡΙΟΥ",1,0]
["12-33279","ΜΠΟΥΡΙΚΑ ΚΑΛΛΙΟΠΗ","ΝΑΥΠΛΙΑΚΟΣ Ο.Α.",3,0]
["12-31696","ΞΑΝΘΟΠΟΥΛΟΥ ΚΩΝΣΤΑΝΤΙΝΑ","Α.Σ.Ε.ΘΗΣΕΑΣ ΑΓΙΟΥ ΔΗΜΗΤΡΙΟΥ",2,0]
["12-33524","ΠΟΡΙΑΖΗ ΕΥΑΝΘΙΑ","Ο.Α.ΠΑΝΟΡΑΜΑΤΟΣ",3,0]
["12-32327","ΣΙΑ ΑΝΑΣΤΑΣΙΑ","Ο.Α.ΤΟΥΜΠΑΣ",3,0]
["12-34878","ΓΕΙΤΟΝΑ ΒΑϊΑ","Α.Γ.Ο.ΦΙΛΙΠΠΙΑΔΑΣ",2.5,0]
["12-32564","ΚΑΡΑΒΙΩΤΗ ΕΛΕΝΗ","Φ.Σ.ΚΑΛΛΙΘΕΑΣ",2.5,0]
["12-32859","ΚΟΥΚΟΥΡΑΚΗ ΜΕΛΙΝΑ","Α.Ο.Α.ΠΑΠΑΓΟΥ",2.5,0]
["12-34098","ΜΑΪΣΤΡΟΥ ΜΟΣΧΑ","Ο.Α.ΧΟΛΑΡΓΟΥ",2.5,0]
["12-33484","ΜΕΤΑΛΛΗΝΟΥ ΤΕΡΕΖΑ","ΚΕΡΚΥΡΑΪΚΗ Λ.Τ.",2.5,0]
["12-29280","ΜΠΟΥΜΠΟΥΛΗ ΑΛΕΞΑΝΔΡΑ","Α.Ο.Α.ΣΤΑΥΡΟΥΠΟΛΗΣ ΙΦΙΤΟΣ",2.5,0]
["12-26980","ΝΟΤΑΚΗ ΕΥΑΓΓΕΛΙΑ","Γ.Σ.ΛΙΒΥΚΟΣ ΙΕΡΑΠΕΤΡΑΣ",2.5,0]
["12-34949","ΝΤΕΛΛΑ ΧΑϊΔΩ","Ο.Α.ΒΙΚΕΛΑΣ ΒΕΡΟΙΑΣ",2.5,0]
["12-33407","ΠΑΠΑΧΡΗΣΤΟΥ ΜΑΡΙΑ","Ο.Α.ΑΡΤΑΣ",2.5,0]
["12-31429","ΠΟΛΥΡΑΒΑ ΣΩΤΗΡΙΑ","Σ.Α.ΣΕΡΡΩΝ",2.5,0]
["12-32388","ΒΕΡΓΟΥ ΑΦΡΟΔΙΤΗ","Α.Γ.Ο.ΦΙΛΙΠΠΙΑΔΑΣ",2,0]
["12-33896","ΒΟΥΡΚΟΥΤΙΩΤΗ ΝΕΦΕΛΗ","Α.Ε.ΠΟΡΤΟ ΡΑΦΤΗ",2,0]
["12-30954","ΚΑΠΕΤΑΝΙΚΟΛΑ ΡΑΦΑΕΛΑ-ΜΑΡΙΑ","Ο.Α.ΣΤΑΥΡΟΥ ΑΣΠΡΟΒΑΛΤΑΣ",2,0]
["12-30485","ΚΑΡΑΔΗΜΑ ΕΛΕΥΘΕΡΙΑ","Α.Ο.Α.ΑΤΤΙΚΟΣ ΗΛΙΟΣ",2,0]
["12-31572","ΚΙΤΣΗ ΑΘΗΝΑ","Σ.Α.ΕΛΑΣΣΟΝΑΣ",2,0]
["12-34045","ΛΑΓΟΥ ΧΡΙΣΤΙΝΑ","Ο.Α.ΙΩΑΝΝΙΝΩΝ",2,0]
["12-34373","ΜΑΓΟΓΙΑΝΝΗ ΡΑΦΑΕΛΑ","Α.Ο.Α.ΧΑΪΔΑΡΙΟΥ",2,0]
["12-29324","ΜΗΝΑΔΑΚΗ ΕΥΑ","Α.Ε.Κ.ΤΡΙΠΟΛΗΣ",2,0]
["12-33274","ΠΛΑΤΑΝΙΤΗ ΕΛΕΝΗ","ΝΑΥΠΛΙΑΚΟΣ Ο.Α.",2,0]
["12-34639","ΠΟΥΛΚΑ ΜΑΡΙΑ-ΕΛΕΝΗ","Α.Ο.Α.ΣΤΑΥΡΟΥΠΟΛΗΣ ΙΦΙΤΟΣ",2,0]
["12-34363","ΣΟΥΔΗ ΜΑΡΙΑ","Ο.Α.ΑΡΙΔΑΙΑΣ",2,0]
["12-27105","ΣΟΥΡΛΙΓΚΑ ΔΗΜΗΤΡΑ","Α.Ε.Κ.ΤΡΙΠΟΛΗΣ",2,0]
["12-31663","ΤΣΙΤΣΟΥ ΣΤΑΥΡΟΥΛΑ","Ο.Α.ΑΡΙΔΑΙΑΣ",2,0]
["12-33681","ΑΛΕΞΟΠΟΥΛΟΥ ΜΑΡΙΑ","Ο.Α.ΙΩΑΝΝΙΝΩΝ",1.5,0]
["12-34213","ΑΛΕΞΟΥΔΗ ΦΑΝΗ","Α.Σ.ΟΡΦΕΑΣ ΛΑΡΙΣΑΣ",1.5,0]
["12-33532","ΑΝΤΖΟΥΛΑΚΟΥ ΑΛΙΚΗ","Α.Σ.ΟΡΦΕΑΣ ΛΑΡΙΣΑΣ",1.5,0]
["12-32335","ΓΑΤΟΥ ΜΑΡΙΑ","Ο.Α.ΒΕΡΟΙΑΣ",1.5,0]
["12-34911","ΓΕΩΡΓΙΑΔΟΥ ΜΑΡΙΑ","Ο.Α.ΑΡΙΔΑΙΑΣ",1.5,0]
["12-33278","ΔΗΜΑΡΑΚΗ ΒΑΣΙΛΙΚΗ","ΝΑΥΠΛΙΑΚΟΣ Ο.Α.",1.5,0]
["12-35159","ΕΥΘΥΜΙΑΔΟΥ ΝΤΟΡΙΑΝΝΑ","Α.Ο.Α.ΑΤΤΙΚΟΣ ΗΛΙΟΣ",1.5,0]
["12-34237","ΚΑΔΟΓΛΟΥ ΔΕΣΠΟΙΝΑ","Σ.Α.ΔΡΑΜΑΣ",1.5,0]
["12-33458","ΚΑΛΛΙΑΡΙΔΟΥ ΟΛΓΑ-ΜΑΡΙΑ","Ο.Α.ΒΙΚΕΛΑΣ ΒΕΡΟΙΑΣ",1.5,0]
["12-34679","ΚΑΛΟΓΡΑ ΒΑΣΙΛΙΚΗ","Σ.Α.ΣΕΡΡΩΝ",1.5,0]
["12-34673","ΚΑΛΦΑΝΤΗ ΔΗΜΗΤΡΑ","Α.Ο.ΚΑΛΛΙΤΕΧΝΟΥΠΟΛΗΣ",1.5,0]
["12-32783","ΚΑΜΠΑ ΒΑΣΙΛΙΚΗ","Ο.Α.ΓΟΥΔΙΟΥ",1.5,0]
["12-34967","ΚΑΤΣΙΜΑΡΔΟΥ ΕΛΕΝΗ","Γ.Ο.ΠΕΡΙΣΤΕΡΙΟΥ Γ.ΠΑΛΑΣΚΑΣ",1.5,0]
["12-35149","ΠΑΝΑΚΑ ΝΕΦΕΛΗ","Ο.Α.ΘΕΣΣΑΛΟΝΙΚΗΣ",1.5,0]
["12-34826","ΠΡΟΔΡΟΜΙΔΗ ΕΛΕΥΘΕΡΙΑ","Γ.Ε.ΠΡΕΒΕΖΑΣ",1.5,0]
["12-34429","ΡΑΠΤΗ ΣΤΑΥΡΟΥΛΑ-ΜΑΡΙΝΑ","Γ.Ε.ΠΡΕΒΕΖΑΣ",1.5,0]
["12-33456","ΣΑΡΡΗ ΑΜΑΛΙΑ-ΜΑΡΙΑ","Ο.Α.ΠΕΤΡΟΥΠΟΛΗΣ",1.5,0]
["12-33121","ΤΙΜΠΙΛΗ ΒΑΣΙΛΙΚΗ","Α.Ε.Τ.ΝΙΚΗ ΠΑΤΡΩΝ",1.5,0]
["12-31059","ΤΣΟΥΡΟΥ ΣΟΦΙΑ","Ο.Α.ΑΓΙΩΝ ΑΝΑΡΓΥΡΩΝ",1.5,0]
["12-34919","ΧΙΩΤΙΝΗ ΑΝΝΑ-ΜΑΡΙΑ","Α.Ο.ΠΟΣΕΙΔΩΝ ΛΟΥΤΡΑΚΙΟΥ",1.5,0]
["12-32798","ΓΕΩΡΓΟΠΟΥΛΟΥ ΝΑΤΑΛΙΑ","Ο.Α.ΑΛΕΞΑΝΔΡΟΣ ΒΕΡΟΙΑΣ",1,0]
["12-34105","ΓΙΑΝΝΟΥΣΗ ΜΑΡΙΑ ΕΙΡΗΝΗ","Α.Σ.ΑΚΑΔΗΜΙΕΣ ΠΡΩΤΑΘΛΗΤΩΝ ΠΕΥΚΩΝ",1,0]
["12-33747","ΓΚΙΤΕΡΣΟΥ ΑΙΚΑΤΕΡΙΝΗ","Α.Σ.ΑΚΑΔΗΜΙΕΣ ΠΡΩΤΑΘΛΗΤΩΝ ΠΕΥΚΩΝ",1,0]
["12-34677","ΔΗΜΑΔΗ ΚΑΤΕΡΙΝΑ","Σ.Α.ΣΕΡΡΩΝ",1,0]
["12-30718","ΔΗΜΟΠΟΥΛΟΥ ΖΗΝΟΒΙΑ","Α.Ε.Τ.ΝΙΚΗ ΠΑΤΡΩΝ",1,0]
["12-33655","ΔΡΑΓΟΜΑΝΟΒΙΤΣ ΕΛΙΣΑΒΕΤ","Α.Ο.ΜΕΓΑΣ ΑΛΕΞΑΝΔΡΟΣ",0,0]
["12-33777","ΚΑΡΑΓΙΑΝΝΑΚΙΔΟΥ ΜΑΡΙΑ","Α.Σ.Α.ΠΑΝΟΡΑΜΑΤΟΣ",1,0]
["12-33280","ΚΥΡΙΑΚΙΔΟΥ ΑΛΕΞΑΝΔΡΑ","ΝΑΥΠΛΙΑΚΟΣ Ο.Α.",1,0]
["12-34630","ΜΑΝΙΚΑΚΗ ΑΝΝΑ ΜΑΡΙΑ","Σ.Α.ΣΕΡΡΩΝ",1,0]
["12-34631","ΜΑΝΙΚΑΚΗ ΧΡΙΣΤΙΝΑ","Σ.Α.ΣΕΡΡΩΝ",1,0]
["12-34564","ΜΑΥΡΟΜΑΤΗ ΝΑΤΑΛΙΑ-ΧΡΙΣΤΙΝΑ","Α.Ο.ΜΕΓΑΣ ΑΛΕΞΑΝΔΡΟΣ",1,0]
["12-34482","ΜΠΑΛΛΗ ΓΕΩΡΓΙΑ","Ο.Α.ΓΙΑΝΝΙΤΣΩΝ",1,0]
["12-34483","ΜΠΑΛΛΗ ΔΑΦΝΗ","Ο.Α.ΓΙΑΝΝΙΤΣΩΝ",1,0]
["12-35207","ΜΠΑΛΟΥΜΗ ΒΑΣΙΛΙΚΗ-ΚΩΝΣΤΑΝΤΙΝΑ","Α.Ο.Α.ΧΑΪΔΑΡΙΟΥ",1,0]
["12-35137","ΜΠΟΥΡΝΟΥΞΟΥΖΗ ΑΝΑΣΤΑΣΙΑ","Ο.Π.ΘΕΣΣΑΛΟΝΙΚΗΣ ΜΑΚΕΔΟΝΙΑ 92",1,0]
["12-32142","ΝΙΚΟΛΑϊΔΟΥ ΝΙΚΟΛΕΤΑ","Α.Α.ΑΛΜΠΑΤΡΟΣ",1,0]
["12-30233","ΠΑΠΑΓΕΩΡΓΙΟΥ ΜΥΡΤΩ","Α.Σ.ΑΚΑΔΗΜΙΕΣ ΠΡΩΤΑΘΛΗΤΩΝ ΠΕΥΚΩΝ",1,0]
["12-34882","ΠΑΠΑΔΡΕΑΔΗ ΒΑΣΙΛΙΚΗ","Γ.Σ.ΚΗΦΙΣΙΑΣ",1,0]
["12-34401","ΡΑΛΛΗ ΚΑΤΕΡΙΝΑ","Ο.Α.ΠΤΟΛΕΜΑΪΔΑΣ",1,0]
["12-33322","ΣΑΚΕΤΑ ΔΗΜΗΤΡΑ","Α.Ο.ΑΡΓΥΡΟΥΠΟΛΗΣ",1,0]
["12-31664","ΣΙΩΠΗ ΑΡΙΑΔΝΗ","Ο.Α.ΑΡΙΔΑΙΑΣ",1,0]
["12-33910","ΣΠΥΡΟΠΟΥΛΟΥ ΙΡΙΔΑ","Α.Ν.Ο.ΓΛΥΦΑΔΑΣ",0,0]
["12-34267","ΣΤΙΓΚΑ ΚΩΝΣΤΑΝΤΙΝΑ","Α.Σ.Α.ΑΓΡΙΝΙΟΥ",1,0]
["12-35177","ΤΟΠΑΤΣΗ ΑΝΔΡΙΑΝΑ","Σ.Α.ΣΕΡΡΩΝ",1,0]
["12-34918","ΧΙΩΤΙΝΗ ΜΑΡΙΝΑ","Α.Ο.ΠΟΣΕΙΔΩΝ ΛΟΥΤΡΑΚΙΟΥ",1,0]
["12-29564","ΑΝΑΣΤΑΣΟΠΟΥΛΟΥ ΗΡΩ","Α.Ο.Ν.Φ.ΑΤΤΑΛΟΣ",0,0]
["12-30875","ΛΑΜΠΡΟΥ ΜΑΡΙΑ-ΑΓΓΕΛΙΚΗ","Α.Ο.Π.ΦΑΛΗΡΟΥ",0.5,0]
["12-29959","ΠΡΑΤΣΟΥΛΑΚΗ ΑΘΗΝΑ","Ο.Α.ΒΙΚΕΛΑΣ ΒΕΡΟΙΑΣ",0.5,0]
["12-34711","ΤΡΙΑΝΤΑΦΥΛΛΙΔΟΥ ΜΑΡΙΑ","Ο.Α.ΚΙΛΚΙΣ",0.5,0]
["12-32682","ΖΑΡΓΙΑΝΝΑΚΗ ΝΑΤΑΛΙΑ","Α.Ο.Α.ΗΛΙΟΥΠΟΛΗΣ",0,0]
["12-90129","ΙΓΚΝΙΑΤΟΒΙΤΣ ΑΝΙΑ","Σ.Α.ΓΑΛΑΤΣΙΟΥ",0,0]
["12-32907","ΚΟΥΚΟΥΒΙΤΑΚΗ ΕΛΕΝΗ","ΑΙΟΛΟΣ Α.Λ.ΙΛΙΟΥ",0,0]
["12-32667","ΚΩΣΤΑ ΔΗΜΗΤΡΑ","Ο.Α.ΝΕΣΤΩΡΑΣ ΓΙΑΝΝΙΤΣΩΝ",0,0]
["12-34317","ΦΩΤΗ ΦΩΤΕΙΝΗ","Α.Σ.ΑΚΑΔΗΜΙΕΣ ΠΡΩΤΑΘΛΗΤΩΝ ΠΕΥΚΩΝ",0,0]
["12-33448","ΧΑΪΖΙΝΧΑ ΣΕΛΙΝ","ΑΙΟΛΟΣ Α.Λ.ΙΛΙΟΥ",0,0]
["14-28387","ΚΑΡΒΟΥΝΗ ΒΑΣΙΛΙΚΗ","Α.Ο.Α.ΦΙΛΟΘΕΗΣ",540,0]
["14-27688","ΝΙΚΟΛΟΠΟΥΛΟΥ ΝΑΤΑΛΙΑ","Α.Ο.ΒΟΥΛΙΑΓΜΕΝΗΣ",526,0]
["14-30673","ΠΕΤΡΟΥΛΑ ΔΑΝΑΗ","Α.Π.Ο.ΣΑΝΝΥ ΣΠΟΡΤΣ ΚΛΑΜΠ",416,0]
["14-30051","ΑΡΚΑΔΙΑΝΟΥ ΑΝΝΑ","Α.Ο.Α.ΧΑΪΔΑΡΙΟΥ",270.5,0]
["14-28631","ΓΡΙΒΑ ΒΑΡΒΑΡΑ","ΑΙΟΛΟΣ Α.Λ.ΙΛΙΟΥ",263,0]
["14-26107","ΑΝΤΩΝΑΚΗ ΕΜΜΑΝΟΥΕΛΑ","Α.Ο.Α.ΑΤΤΙΚΟΣ ΗΛΙΟΣ",250,0]
["14-29877","ΧΑΡΑΛΑΜΠΙΔΗ ΓΑΒΡΙΕΛΛΑ","Α.Ε.Τ.ΝΙΚΗ ΠΑΤΡΩΝ",236,0]
["14-28688","ΣΤΑΜΑΤΟΓΙΑΝΝΟΠΟΥΛΟΥ ΒΑΣΙΛΙΚΗ","Γ.Ο.ΠΕΡΙΣΤΕΡΙΟΥ Γ.ΠΑΛΑΣΚΑΣ",230.5,0]
["14-34427","ΣΑΚΕΛΛΑΡΙΔΗ ΣΑΠΦΩ","Ο.Α.ΑΓΙΑΣ ΠΑΡΑΣΚΕΥΗΣ",225.5,0]
["14-27857","ΚΟΚΚΙΝΑΚΗ ΕΥΑΓΓΕΛΙΑ","Ο.Α.ΧΑΝΙΩΝ",207,0]
["14-24718","ΦΟΥΛΟΠ ΡΑΦΑΗΛΙΑ-ΝΙΚΟΛΕΤΑ","Α.Κ.Α.ΜΑΡΑΘΩΝΑ",195,0]
["14-27858","ΚΟΚΚΙΝΑΚΗ ΕΥΓΕΝΙΑ","Ο.Α.ΧΑΝΙΩΝ",194,0]
["14-90069","ΜΤΣΕΝΤΛΙΤΖΕ ΕΛΕΝΗ","Α.Ο.Α.ΣΤΑΥΡΟΥΠΟΛΗΣ ΙΦΙΤΟΣ",185,0]
["14-28936","ΕΥΘΥΜΙΑΔΟΥ ΜΑΓΔΑΛΗΝΗ","Ο.Α.ΙΩΛΚΟΣ ΒΟΛΟΥ",174,0]
["14-28094","ΓΚΟΓΚΟΥ ΕΛΕΥΘΕΡΙΑ","Ο.Α.ΣΟΥΔΑΣ",169,0]
["14-26982","ΚΑΝΕΛΛΟΠΟΥΛΟΥ ΜΑΡΙΛΗ","Α.Ο.ΤΑΤΟΪΟΥ",169,0]
["14-28284","ΓΚΟΥΣΚΟΥ ΚΑΛΛΙΟΠΗ","Α.Ο.Α.ΦΙΛΟΘΕΗΣ",163,0]
["14-31211","ΑΝΤΩΝΙΟΥ-ΚΑΡΑΔΕΜΗΤΡΟΥ ΝΙΚΟΛΕΤΑ","Ο.Α.ΒΟΛΟΥ",155,0]
["14-28968","ΑΡΓΥΡΟΚΑΣΤΡΙΤΗ ΜΑΡΙΑΝΝΑ","Α.Σ.ΚΟΛΛΕΓΙΟΥ ΝΤΕΡΗ",154,0]
["14-29879","ΚΑΛΛΙΣΤΡΟΥ ΜΑΡΙΑ","Α.Ε.Τ.ΝΙΚΗ ΠΑΤΡΩΝ",145.5,0]
["14-28990","ΑΝΑΓΝΩΣΤΟΥ ΕΥΑΓΓΕΛΙΑ","Ο.Α.ΙΩΛΚΟΣ ΒΟΛΟΥ",142,0]
["14-28404","ΚΑΜΠΙΩΤΗ ΑΘΗΝΑ","ΖΑΚΥΝΘΙΝΟΣ Α.Ο.Α",139,0]
["14-25972","ΤΣΙΑΡΑ ΕΥΘΥΜΙΑ","Ο.Α.ΠΕΤΡΟΥΠΟΛΗΣ",130,0]
["14-29038","ΓΑΚΗ ΕΛΕΝΑ","Ο.Α.ΠΕΤΡΟΥΠΟΛΗΣ",125,0]
["14-29942","ΑΛΦΑΝΤΗ ΑΝΑΣΤΑΣΙΑ","Ο.Α.ΠΕΤΡΟΥΠΟΛΗΣ",114,0]
["14-32325","ΜΕΣΟΧΩΡΙΤΗ ΓΑΛΑΤΕΙΑ","Ο.Α.ΤΟΥΜΠΑΣ",113.5,0]
["14-31161","ΚΩΣΤΑ-ΦΩΤΗ ΑΛΕΞΑΝΔΡΑ","ΡΟΔΙΑΚΗ ΑΚΑΔ.ΑΝΤΙΣΦ.",111.5,0]
["14-27702","ΚΑΜΠΑΝΤΑΗ ΕΛΕΝΗ","Α.Σ.ΠΕΡΑ",103,0]
["14-29655","ΜΠΑΛΑΣΚΑ ΒΑΣΙΛΙΚΗ","Ο.Α.ΣΟΥΔΑΣ",100.5,0]
["14-30601","ΚΑΡΠΟΥΖΑ ΣΟΦΙΑ","Ο.Α.ΜΑΓΝΗΣΙΑΣ",99.5,0]
["14-29201","ΚΙΖΙΡΑΚΟΥ ΔΗΜΗΤΡΑ","Ο.Α.ΑΘΗΝΩΝ",96,0]
["14-29223","ΜΕΤΑΞΟΠΟΥΛΟΥ ΣΤΕΦΑΝΙΑ-ΕΛΕΝΑ","Σ.Α.ΡΑΦΗΝΑΣ",96,0]
["14-24748","ΑΓΓΕΛΑΚΗ ΝΙΚΟΛΕΤΤΑ","Ο.Α.ΦΟΙΒΟΣ ΛΑΡΙΣΑΣ",94.5,0]
["14-32719","ΖΑΡΑΡΗ ΚΥΡΙΑΚΗ","ΡΟΔΙΑΚΟΣ Ο.Α.",94,0]
["14-31641","ΒΑΣΙΛΕΙΑΔΗ ΔΕΣΠΟΙΝΑ","Α.Σ.ΚΟΛΛΕΓΙΟΥ ΝΤΕΡΗ",93,0]
["14-31873","ΓΡΙΒΑ ΒΑΣΙΛΕΙΑ","ΑΙΟΛΟΣ Α.Λ.ΙΛΙΟΥ",93,0]
["14-26602","ΜΑΝΑΟΥ-ΓΙΑΝΝΟΥΣΗ ΑΛΚΥΟΝΗ-ΜΑΡΙΑ","Ο.Α.ΦΟΙΒΟΣ ΛΑΡΙΣΑΣ",93,0]
["14-28070","ΜΑΡΝΕΛΛΟΥ ΜΑΡΙΑ","ΗΡΑΚΛΕΙΟ Ο.Α.& Α.",92,0]
["14-29695","ΜΕΤΑΞΑ ΚΛΕΙΩ","Α.Σ.ΚΟΛΛΕΓΙΟΥ ΝΤΕΡΗ",92,0]
["14-28466","ΑΣΗΜΑΚΗ ΜΑΡΙΝΑ","Ο.Α.ΑΘΛΗΤ.ΠΑΙΔΕΙΑ",90,0]
["14-29656","ΜΙΟΥΜΠΗ ΜΥΡΙΑΜ","Ο.Α.ΧΑΝΙΩΝ",88,0]
["14-31551","ΠΑΠΑΚΩΝΣΤΑΝΤΙΝΟΥ ΕΛΕΝΑ-ΜΑΡΙΑ","ΦΘΙΩΤΙΚΟΣ Ο.Α.",88,0]
["14-27416","ΤΟΛΗ ΚΛΕΙΩ-ΝΙΚΟΛΕΤΑ","Α.Ο.ΒΑΡΗΣ ΑΝΑΓΥΡΟΥΣ",88,0]
["14-29694","ΜΕΤΑΞΑ ΔΙΟΝΥΣΙΑ-ΜΥΡΤΩ","Α.Σ.ΚΟΛΛΕΓΙΟΥ ΝΤΕΡΗ",85,0]
["14-28935","ΤΖΙΦΑ-ΚΡΑΤΗΡΑ ΖΩΗ","Ο.Α.ΜΑΓΝΗΣΙΑΣ",82,0]
["14-30318","ΤΣΑΔΑΡΗ ΙΩΑΝΝΑ","Ο.Α.ΠΕΤΡΟΥΠΟΛΗΣ",82,0]
["14-29208","ΣΤΑΜΟΥΛΗ ΦΡΕΙΔΕΡΙΚΗ","Ο.Α.ΜΑΓΝΗΣΙΑΣ",78,0]
["14-30092","ΜΠΟΥΚΟΥΒΑΛΑ ΦΩΤΕΙΝΗ","Α.Ο.Α.ΗΛΙΟΥΠΟΛΗΣ",75,0]
["14-30033","ΜΑΜΑΗ ΕΒΕΛΙΝΑ","Α.Μ.Ε.Σ.Ν.ΕΡΥΘΡΑΙΑΣ",74,0]
["14-29654","ΚΟΥΚΛΑΚΗ ΕΥΓΕΝΙΑ","Ο.Α.ΧΑΝΙΩΝ",71,0]
["14-31998","ΤΣΕΡΕΓΚΟΥΝΗ ΜΑΡΙΑ","Α.Σ.ΚΟΛΛΕΓΙΟΥ ΝΤΕΡΗ",71,0]
["14-28341","ΜΙΧΑΗΛΙΔΟΥ ΚΩΝΣΤΑΝΤΙΝΑ","Ο.Α.ΕΥΟΣΜΟΥ ΘΕΣΣΑΛΟΝΙΚΗΣ",69,0]
["14-30176","ΓΙΑΝΝΑΚΟΥ ΙΩΑΝΝΑ","Α.Ο.Α.ΠΟΣΕΙΔΩΝ ΘΕΣΣΑΛΟΝΙΚΗΣ",68.5,0]
["14-29194","ΚΑΡΑΒΑ ΖΩΗ","Ο.Α.ΤΟΥΜΠΑΣ",68,0]
["14-29169","ΝΤΑΝΟΥ ΧΡΙΣΤΙΝΑ","Ο.Α.ΓΟΥΔΙΟΥ",67.5,0]
["14-28686","ΚΑΡΒΟΥΝΑ ΜΑΡΙΑΝΝΑ","Γ.Ο.ΠΕΡΙΣΤΕΡΙΟΥ Γ.ΠΑΛΑΣΚΑΣ",67,0]
["14-30709","ΣΜΥΡΛΟΓΛΟΥ ΧΡΙΣΤΙΝΑ-ΙΩΑΝΝΑ","Σ.Α.ΡΑΦΗΝΑΣ",67,0]
["14-29767","ΣΙΜΩΝΙΔΟΥ ΑΝΝΑ","Ο.Α.ΞΑΝΘΗΣ",65.5,0]
["14-31890","ΚΑΠΕΛΛΑ ΜΥΡΤΩ","Α.Ο.Α.ΗΛΙΟΥΠΟΛΗΣ",64.5,0]
["14-32081","ΚΥΠΡΑΙΟΥ ΣΤΕΦΑΝΙΑ-ΒΑΣΙΛΙΚΗ","Α.Ο.Α.ΣΤΑΥΡΟΥΠΟΛΗΣ ΙΦΙΤΟΣ",63.5,0]
["14-90109","ΠΑΝΤΟΥΡΑΡΟΥ ΜΑΡΙΑ-ΛΟΥΙΖΑ","Ο.Α.ΑΘΗΝΩΝ",62.5,0]
["14-28137","ΧΑΤΖΗΣΤΟΥΓΙΑΝΝΗ ΣΟΦΙΑ-ΜΑΡΙΑ","Σ.Α.ΣΕΡΡΩΝ",62,0]
["14-31826","ΠΑΡΑΣΚΕΥΑ ΑΝΤΙΓΟΝΗ","Α.Σ.ΚΟΛΛΕΓΙΟΥ ΝΤΕΡΗ",61.5,0]
["14-30099","ΚΟΥΡΙΔΑΚΗ ΑΘΗΝΑ","Ο.Α.ΧΑΝΙΩΝ",61,0]
["14-32899","ΑΡΓΥΡΙΟΥ ΑΙΚΑΤΕΡΙΝΗ","Α.Σ.Α.ΛΑΡΙΣΑΣ",59.5,0]
["14-30955","ΠΟΣΤΑΝΤΖΙΑΝ ΜΑΡΚΕΛΛΑ","Ο.Α.ΠΕΤΡΟΥΠΟΛΗΣ",59,0]
["14-30873","ΣΠΥΡΟΠΟΥΛΟΥ ΗΡΩ-ΧΡΙΣΤΙΝΑ","Α.Ο.Π.ΦΑΛΗΡΟΥ",59,0]
["14-30765","ΠΑΡΑΣΚΕΥΟΥΔΗ ΑΝΑΣΤΑΣΙΑ","Φ.Ο.Α.ΝΕΑΠΟΛΗΣ",58.5,0]
["14-29210","ΑΓΙΩΤΗ ΕΛΕΝΗ","Ο.Α.ΜΑΓΝΗΣΙΑΣ",58,0]
["14-31131","ΔΗΜΗΤΡΑΚΟΠΟΥΛΟΥ ΣΕΜΕΛΗ-ΕΥΓΕΝΙΑ","Α.Κ.Α.ΜΑΡΑΘΩΝΑ",58,0]
["14-30157","ΤΣΙΟΛΑΚΙΔΟΥ ΒΑΣΙΛΙΚΗ","Α.Ο.Α.ΗΛΙΟΥΠΟΛΗΣ",57.5,0]
["14-31555","ΖΟΥΜΠΑ ΕΥΤΥΧΙΑ","Ο.Α.ΣΟΥΔΑΣ",57,0]
["14-30774","ΡΕΝΤΟΥΜΗ ΜΑΡΙΑ","Α.Κ.Α.ΜΑΡΑΘΩΝΑ",57,0]
["14-30106","ΤΟΠΟΥΖΙΔΟΥ ΝΙΚΟΛΕΤΑ","Ο.Α.ΕΥΟΣΜΟΥ ΘΕΣΣΑΛΟΝΙΚΗΣ",57,0]
["14-28455","ΑΝΔΡΕΟΠΟΥΛΟΥ ΝΕΦΕΛΗ","Α.Ο.Α.ΠΑΠΑΓΟΥ",56,0]
["14-30178","ΑΓΑΚΕΧΑΓΙΑ ΖΩΗ","Α.Ο.Α.ΣΤΑΥΡΟΥΠΟΛΗΣ ΙΦΙΤΟΣ",55.5,0]
["14-31487","ΒΛΑΧΟΥ ΛΥΔΙΑ","ΦΘΙΩΤΙΚΟΣ Ο.Α.",55,0]
["14-28523","ΤΡΙΑΝΤΑΦΥΛΙΔΟΥ-ΚΟΥΛΟΥΡΙΩΤΟΥ ΚΑΛΛΙΟΠΗ","Ε.Σ.Ο.ΕΠΙΚΟΥΡΟΣ ΠΟΛΙΧΝΗΣ",53,0]
["14-27414","ΔΕΤΣΗ ΜΑΡΙΑΝ","Α.Ο.ΒΑΡΗΣ ΑΝΑΓΥΡΟΥΣ",52,0]
["14-22533","ΤΕΖΑΨΙΔΟΥ ΔΗΜΗΤΡΑ","Μ.Α.Σ.ΑΕΤΟΣ ΘΕΣΣΑΛΟΝΙΚΗΣ",52,0]
["14-32289","ΦΑΣΟΥΛΑ ΕΛΕΝΗ","Ο.Α.ΓΛΥΦΑΔΑΣ",52,0]
["14-34587","ΠΑΤΡΩΝΙΔΗ ΕΙΡΗΝΗ-ΑΣΗΜΙΝΑ","Ο.Α.ΦΟΙΒΟΣ ΛΑΡΙΣΑΣ",51.5,0]
["14-32326","ΜΩΥΣΙΑΔΗ ΣΤΕΦΑΝΙΑ","Α.Ο.Α.ΣΤΑΥΡΟΥΠΟΛΗΣ ΙΦΙΤΟΣ",51,0]
["14-27349","ΤΖΙΑΡΛΗ ΔΗΜΗΤΡΑ","Ο.Α.ΕΥΟΣΜΟΥ ΘΕΣΣΑΛΟΝΙΚΗΣ",49,0]
["14-31603","ΠΑΠΑΔΗΜΗΤΡΗ ΠΑΡΑΣΚΕΥΗ","ΡΟΔΙΑΚΗ ΑΚΑΔ.ΑΝΤΙΣΦ.",48.5,0]
["14-28699","ΒΡΥΩΝΗ ΒΑΣΙΛΙΚΗ","Ο.Α.ΚΑΛΑΜΑΤΑΣ",48,0]
["14-29250","ΓΙΤΣΟΠΟΥΛΟΥ ΜΑΡΙΑ-ΕΛΕΝΗ","Ο.Α.ΦΟΙΒΟΣ ΛΑΡΙΣΑΣ",47,0]
["14-28088","ΜΠΑΡΜΠΑΡΗ ΑΡΙΣΤΕΑ","Α.Κ.Α.ΜΑΡΑΘΩΝΑ",47,0]
["14-31286","ΠΑΛΑΙΟΛΟΓΟΥ ΕΥΡΥΔΙΚΗ","Α.Ο.Α.ΗΛΙΟΥΠΟΛΗΣ",47,0]
["14-32365","ΣΤΑΥΡΑΚΗ ΚΩΝΣΤΑΝΤΙΝΑ","Α.Ο.ΒΑΡΗΣ ΑΝΑΓΥΡΟΥΣ",46,0]
["14-32269","ΚΑΡΥΜΠΙΔΟΥ ΕΥΓΕΝΙΑ","Φ.Ο.Α.ΝΕΑΠΟΛΗΣ",45.5,0]
["14-32746","ΚΥΒΡΑΝΟΓΛΟΥ ΜΑΡΚΕΛΛΑ","Ο.Α.ΘΕΣΠΡΩΤΙΑΣ ΤΙΤΑΝΗ",44.5,0]
["14-30799","ΣΤΑΜΕΝΟΥ ΕΛΠΙΔΑ","Α.Κ.Α.ΜΑΡΑΘΩΝΑ",44.5,0]
["14-31103","ΝΕΔΕΛΤΣΟΥ ΠΑΥΛΙΝΑ","Α.Ο.Α.ΠΑΠΑΓΟΥ",44,0]
["14-29590","ΧΑΛΑΡΗ ΑΝΝΑ","Σ.Α.ΡΑΦΗΝΑΣ",44,0]
["14-28420","ΣΙΑΪΝΗ ΑΘΑΝΑΣΙΑ","Σ.Α.ΡΑΦΗΝΑΣ",41,0]
["14-32546","ΖΑΧΑΡΑΚΗ ΙΩΑΝΝΑ","Ο.Α.ΣΑΛΑΜΙΝΑΣ",40.5,0]
["14-33158","ΧΟΛΕΒΑ ΕΛΕΝΗ-ΜΑΡΙΑ","Α.Σ.Α.ΠΑΜΒΩΤΙΣ ΙΩΑΝΝΙΝΩΝ",40.5,0]
["14-29137","ΠΑΠΑΔΟΠΟΥΛΟΥ ΕΛΕΥΘΕΡΙΑ","Ο.Α.ΕΥΟΣΜΟΥ ΘΕΣΣΑΛΟΝΙΚΗΣ",40,0]
["14-33505","ΜΠΟΥΡΑ ΑΣΗΜΙΝΑ","Ο.Α.ΦΟΙΒΟΣ ΛΑΡΙΣΑΣ",39.5,0]
["14-30563","ΑΝΔΡΙΟΠΟΥΛΟΥ ΑΓΓΕΛΙΚΗ-ΑΘΑΝΑΣΙΑ","Α.Ε.Τ.ΝΙΚΗ ΠΑΤΡΩΝ",39,0]
["14-30449","ΚΑΠΕΤΑΝΑΚΗ ΕΛΕΝΗ","ΗΡΑΚΛΕΙΟ Ο.Α.& Α.",38.5,0]
["14-29438","ΚΑΡΙΠΙΔΟΥ ΘΕΟΔΩΡΑ","Ο.Α.ΠΤΟΛΕΜΑΪΔΑΣ",38,0]
["14-29876","ΤΣΑΓΓΑΡΗ-ΝΤΥΜΠΑΛΣΚΑ ΕΛΙΣΣΑΒΕΤ","Α.Ε.Τ.ΝΙΚΗ ΠΑΤΡΩΝ",38,0]
["14-32663","ΔΙΑΚΟΥΜΑΚΟΥ ΟΛΓΑ","Α.Ο.Α.ΠΑΠΑΓΟΥ",37.5,0]
["14-30390","ΝΙΚΟΛΑΪΔΟΥ ΕΛΕΝΗ","Φ.Ο.Α.ΝΕΑΠΟΛΗΣ",37,0]
["14-28956","ΠΑΝΗ ΒΑΣΙΛΙΚΗ","Ο.Α.ΙΩΛΚΟΣ ΒΟΛΟΥ",36,0]
["14-32883","ΑΝΑΓΝΩΣΤΟΥ ΑΙΚΑΤΕΡΙΝΗ","ΚΕΡΚΥΡΑΪΚΗ Λ.Τ.",34.5,0]
["14-28687","ΠΑΛΛΗ ΧΡΙΣΤΙΝΑ","Γ.Ο.ΠΕΡΙΣΤΕΡΙΟΥ Γ.ΠΑΛΑΣΚΑΣ",35,0]
["14-30084","ΤΣΟΤΣΟΛΗ ΑΙΚΑΤΕΡΙΝΗ","Α.Σ.Α.ΠΑΝΟΡΑΜΑΤΟΣ",35,0]
["14-32451","ΜΠΟΣΕΡΩ ΝΕΦΕΛΗ","Ο.Α.ΧΟΛΑΡΓΟΥ",34.5,0]
["14-32328","ΑΝΤΩΝΙΑΔΟΥ-ΣΑΜΑΡΤΖΙΔΟΥ ΣΟΦΙΑ-ΜΑΡΤΙΝΑ","Ο.Α.ΤΟΥΜΠΑΣ",34,0]
["14-30332","ΚΑΝΔΡΕΛΗ ΠΑΡΑΣΚΕΥΗ-ΜΑΡΙΝΑ","Α.Σ.Α.ΠΑΜΒΩΤΙΣ ΙΩΑΝΝΙΝΩΝ",34,0]
["14-28991","ΚΑΡΑΜΑΝΛΗ ΜΑΡΙΑ","Ο.Α.ΙΩΛΚΟΣ ΒΟΛΟΥ",34,0]
["14-28136","ΚΙΜΟΓΛΟΥ ΜΑΡΙΑ-ΑΝΝΑ","Σ.Α.ΣΕΡΡΩΝ",33,0]
["14-30596","ΚΡΟΝΤΗΡΑ ΕΛΕΝΗ","ΗΡΑΚΛΕΙΟ Ο.Α.& Α.",33.5,0]
["14-29060","ΠΑΥΛΙΔΟΥ ΠΑΡΘΕΝΑ","Ο.Α.ΒΕΡΟΙΑΣ",33.5,0]
["14-29604","ΔΡΟΥΓΚΑ ΕΛΕΥΘΕΡΙΑ","Α.Ο.Α.ΠΑΠΑΓΟΥ",33,0]
["14-28593","ΜΑΓΓΙΝΑ ΔΗΜΗΤΡΑ","Α.Κ.Α.ΜΑΡΑΘΩΝΑ",33,0]
["14-32267","ΑΝΔΡΕΑΣΙΔΟΥ ΦΩΤΕΙΝΗ","Φ.Ο.Α.ΝΕΑΠΟΛΗΣ",32,0]
["14-32400","ΔΡΑΚΟΥ ΑΝΔΡΙΑΝΝΑ","Α.Ο.ΒΑΡΗΣ ΑΝΑΓΥΡΟΥΣ",32,0]
["14-34255","ΖΑΦΕΙΡΗ ΝΕΦΕΛΗ","Ο.Α.ΑΘΗΝΩΝ",31,0]
["14-31547","ΚΑΤΣΙΜΑΝΗ ΠΟΛΥΞΕΝΗ","Ο.Α.ΘΕΣΠΡΩΤΙΑΣ ΤΙΤΑΝΗ",31,0]
["14-30148","ΚΑΡΑΝΑΓΝΩΣΤΗ ΜΑΡΙΑ","Α.Ε.Κ.ΤΡΙΠΟΛΗΣ",29.5,0]
["14-30024","ΚΡΗΤΙΚΟΥ ΕΜΜΑΝΟΥΕΛΛΑ","ΑΙΟΛΟΣ Α.Λ.ΙΛΙΟΥ",30,0]
["14-33331","ΑΔΑΜΟΠΟΥΛΟΥ ΜΑΓΔΑΛΙΝΗ","Ο.Α.ΠΕΤΡΟΥΠΟΛΗΣ",29.5,0]
["14-31852","ΒΕΛΙΒΑΣΑΚΗ ΧΑΡΙΚΛΕΙΑ","ΗΡΑΚΛΕΙΟ Ο.Α.& Α.",29,0]
["14-30086","ΖΕΡΒΑ ΕΥΑΓΓΕΛΙΑ","Α.Α.ΑΙΓΑΛΕΩ",29,0]
["14-31407","ΚΑΜΠΟΥΡΗ ΓΡΑΜΜΑΤΙΚΗ","ΡΟΔΙΑΚΟΣ Ο.Α.",29,0]
["14-30561","ΜΑΓΕΙΡΟΠΟΥΛΟΥ ΜΑΡΙΛΙΑ-ΑΓΛΑΪΑ","Α.Ε.Τ.ΝΙΚΗ ΠΑΤΡΩΝ",29,0]
["14-29807","ΠΑΠΑΔΟΠΟΥΛΟΥ ΙΩΑΝΝΑ","Ο.Α.ΓΛΥΦΑΔΑΣ",29,0]
["14-30371","ΤΡΑΪΚΑΠΗ ΕΥΑΓΓΕΛΙΑ","Α.Σ.Α.ΠΑΜΒΩΤΙΣ ΙΩΑΝΝΙΝΩΝ",29,0]
["14-30956","ΧΑΝΤΑΒΑ ΘΕΟΔΩΡΑ","Α.Σ.ΤΕΝΙΣ ΚΛΑΜΠ ΚΟΖΑΝΗΣ",29,0]
["14-30545","ΠΡΙΝΙΑΝΑΚΗ ΕΥΑΓΓΕΛΙΑ","ΦΙΛΙΑ Τ.Κ.",28,0]
["14-31639","ΓΑΝΙΤΗ ΖΩΗ","Ν.Ο.Ν.Α.Μ",27.5,0]
["14-31582","ΦΙΛΙΔΟΥ ΑΝΝΑ","Α.Ο.Α.ΠΡΩΤΑΘΛ.ΚΑΒΑΛΑΣ",27.5,0]
["14-30990","ΓΚΙΘΚΟΠΟΥΛΟΥ ΕΛΕΝΗ","Ο.Α.ΚΑΛΑΜΑΚΙΟΥ",27,0]
["14-32570","ΣΤΕΡΓΙΟΠΟΥΛΟΥ ΖΩΗ","Ο.Α.ΑΓΙΑΣ ΠΑΡΑΣΚΕΥΗΣ",27,0]
["14-31723","ΑΓΙΟΥΣ ΟΛΓΑ-ΜΑΡΙΑ","ΚΕΡΚΥΡΑΪΚΗ Λ.Τ.",25,0]
["14-32090","ΜΑΥΡΟΓΙΑΝΝΑΚΗ ΔΗΜΗΤΡΑ","Ο.Α.ΠΕΤΡΟΥΠΟΛΗΣ",26,0]
["14-30949","ΝΑΣΤΟΥ ΕΙΡΗΝΗ","Α.Ο.Α.ΠΡΩΤΑΘΛ.ΚΑΒΑΛΑΣ",25.5,0]
["14-33798","ΣΙΟΥΝΑ ΑΘΗΝΑ","Ο.Α.ΑΓΙΑΣ ΠΑΡΑΣΚΕΥΗΣ",25.5,0]
["14-31087","ΓΑΛΑΝΟΥ ΟΥΡΑΝΙΑ-ΝΑΤΑΛΙΑ","Μ.Α.Σ.ΑΕΤΟΣ ΘΕΣΣΑΛΟΝΙΚΗΣ",25,0]
["14-30529","ΒΟΓΙΑΤΖΟΓΛΟΥ ΜΑΡΙΑΝΝΑ","Ο.Α.ΧΑΝΙΩΝ",24.5,0]
["14-32706","ΔΕΛΗΓΙΑΝΝΗ ΕΛΛΗ-ΕΥΤΥΧΙΑ","Α.Ο.Α.ΠΑΠΑΓΟΥ",24.5,0]
["14-33310","ΛΟΓΟΘΕΤΗ ΕΛΛΗ","Ο.Α.ΧΟΛΑΡΓΟΥ",24,0]
["14-31879","ΚΑΣΣΙΔΟΥ ΚΩΝΣΤΑΝΤΙΝΑ","Ο.Α.ΓΙΑΝΝΙΤΣΩΝ",23,0]
["14-31384","ΧΑΛΒΑΝΤΖΗ ΑΙΚΑΤΕΡΙΝΗ","Σ.Α.ΣΕΡΡΩΝ",23,0]
["14-30527","ΒΑΡΒΕΡΑΚΗ ΜΑΡΙΑ","Ο.Α.ΧΑΝΙΩΝ",22.5,0]
["14-31104","ΑΣΤΡΕΙΝΙΔΗ ΑΛΕΞΑΝΔΡΑ","Α.Ο.Α.ΠΑΠΑΓΟΥ",22,0]
["14-29706","ΚΑΡΑΓΕΩΡΓΟΥ ΜΑΡΙΑ","Ο.Α.ΑΡΤΑΣ",21,0]
["14-33314","ΣΠΥΡΟΥ ΖΩΗ","Α.Ο.Π.ΦΑΛΗΡΟΥ",21,0]
["14-31573","ΚΙΤΣΗ ΜΕΛΠΟΜΕΝΗ","Σ.Α.ΕΛΑΣΣΟΝΑΣ",20.5,0]
["14-33089","ΚΩΤΣΙΟΥ ΜΑΡΙΑ-ΑΣΠΑΣΙΑ","ΗΡΑΚΛΕΙΟ Ο.Α.& Α.",20.5,0]
["14-30463","ΤΟΥΛΑΤΟΥ ΦΙΟΡΟΥΛΑ","ΚΕΦΑΛΛΗΝΙΑΚΟΣ Ο.Α.",20.5,0]
["14-32946","ΚΟΥΛΟΥΜΠΟΥ ΑΓΓΕΛΙΚΗ","Ο.Α.ΚΑΛΑΜΑΤΑΣ",19,0]
["14-32710","ΜΟΥΡΤΖΑΚΗ ΧΑΡΙΚΛΕΙΑ","Ο.Α.ΧΕΡΣΟΝΗΣΟΥ",20,0]
["14-33110","ΜΠΙΛΛΗ ΧΡΙΣΤΙΝΑ","ΠΕΥΚΗ Γ.ΚΑΛΟΒΕΛΩΝΗΣ",20,0]
["14-33092","ΔΕΣΚΟΥΛΙΔΟΥ ΧΡΥΣΑΝΘΗ","ΦΙΛΙΑ Τ.Κ.",19.5,0]
["14-28816","ΒΛΑΧΟΥΤΣΗ ΠΕΤΡΟΥΛΑ","ΡΗΓΑΣ Α.Ο.Α.ΑΡΓΟΛΙΔΑΣ",19,0]
["14-30352","ΓΕΩΡΓΟΥΣΗ ΠΑΝΑΓΙΩΤΑ","ΦΙΛΑΘΛΗΤ.ΣΥΛ.ΛΑΜΙΑΣ",19,0]
["14-33560","ΚΑΡΑΔΗΜΟΥ ΜΑΡΙΛΕΝΑ","Α.Ο.Α.ΚΑΤΕΡΙΝΗΣ",19,0]
["14-32662","ΜΠΑΚΕΛΛΑ ΑΙΚΑΤΕΡΙΝΗ","Α.Ο.Α.ΠΑΠΑΓΟΥ",19,0]
["14-32860","ΠΟΤΣΗ ΓΕΩΡΓΙΑ-ΖΩΗ","Ο.Α.ΓΟΥΔΙΟΥ",19,0]
["14-31546","ΝΙΚΟΛΑΟΥ ΑΘΗΝΑ","Ο.Α.ΘΕΣΠΡΩΤΙΑΣ ΤΙΤΑΝΗ",18.5,0]
["14-31874","ΒΡΥΖΑ ΔΑΦΝΗ","Α.Ο.Α.ΗΛΙΟΥΠΟΛΗΣ",18,0]
["14-32471","ΓΙΑΝΝΟΠΟΥΛΟΥ ΦΩΤΕΙΝΗ","Γ.Ο.ΠΕΡΙΣΤΕΡΙΟΥ Γ.ΠΑΛΑΣΚΑΣ",18,0]
["14-33437","ΓΡΑΜΜΑΤΙΚΑΚΗ ΧΑΡΑΛΑΜΠΙΑ","ΠΕΥΚΗ Γ.ΚΑΛΟΒΕΛΩΝΗΣ",18,0]
["14-32366","ΦΡΑΓΚΙΣΤΑ ΙΖΑΜΠΕΛΛΑ","Α.Ο.ΜΕΓΑΣ ΑΛΕΞΑΝΔΡΟΣ",18,0]
["14-29588","ΑΛΕΞΟΠΟΥΛΟΥ ΙΩΑΝΝΑ","Ο.Α.ΒΕΡΟΙΑΣ",17.5,0]
["14-27518","ΚΟΥΛΟΥΚΥΘΑ ΣΗΜΕΛΑ-ΑΡΕΤΗ","Σ.Α.ΡΑΦΗΝΑΣ",17.5,0]
["14-30903","ΑΣΗΜΟΠΟΥΛΟΥ ΑΙΚΑΤΕΡΙΝΗ","Α.Σ.Α.ΠΑΝΟΡΑΜΑΤΟΣ",17,0]
["14-29858","ΔΑΝΙΗΛ ΑΡΓΥΡΩ","ΦΘΙΩΤΙΚΟΣ Ο.Α.",17,0]
["14-33088","ΖΑΦΕΙΡΟΠΟΥΛΟΥ ΚΑΤΕΡΙΝΑ","ΗΡΑΚΛΕΙΟ Ο.Α.& Α.",17,0]
["14-29296","ΛΑΜΠΡΟΥ ΕΛΕΝΗ","Α.Ο.ΜΕΓΑΣ ΑΛΕΞΑΝΔΡΟΣ",17,0]
["14-33447","ΤΣΕΣΜΕΤΖΗ ΜΑΡΙΑΝΘΗ","Ο.Α.ΛΕΣΒΟΥ",17,0]
["14-33080","ΒΛΑΣΤΟΥ ΜΑΡΙΑ-ΕΥΑΓΓΕΛΙΑ","Ο.Α.ΑΙΓΙΑΛΕΙΑΣ",16.5,0]
["14-29971","ΕΠΑΓΓΕΛΗ ΒΕΡΑ","Ο.Α.ΚΑΣΤΟΡΙΑΣ ΚΕΛΕΤΡΟΝ",15.5,0]
["14-34231","ΚΑΤΡΑΛΗ ΑΝΝΑ","Ο.Α.ΑΘΗΝΩΝ",16.5,0]
["14-33177","ΚΟΥΚΟΥΒΕ ΖΩΗ","Α.Ο.Α.ΠΑΠΑΓΟΥ",16.5,0]
["14-32456","ΚΟΥΤΣΟΥΜΠΑ ΙΩΑΝΝΑ","ΦΘΙΩΤΙΚΟΣ Ο.Α.",16.5,0]
["14-30116","ΜΠΑΖΟΥ ΑΝΤΩΝΙΑ-ΕΛΕΝΗ","ΝΑΥΠΛΙΑΚΟΣ Ο.Α.",16.5,0]
["14-33707","ΡΑΪΟΥ ΒΑΣΙΛΙΚΗΣ","Α.Σ.Α.ΛΑΡΙΣΑΣ",16.5,0]
["14-32222","ΣΤΑΜΟΥΛΟΥ ΑΝΝΑ-ΜΑΡΙΑ","Ο.Α.ΧΑΝΙΩΝ",16.5,0]
["14-30394","ΠΟΛΙΟΥΔΑΚΗ ΑΝΝΑ-ΜΑΡΙΑ","Α.Ο.Α.ΡΕΘΥΜΝΟ Τ.Κ.",15.5,0]
["14-32292","ΣΠΕΝΤΖΑ ΕΛΕΝΗ","Α.Α.ΑΙΓΑΛΕΩ",15.5,0]
["14-32473","ΑΓΓΕΛΟΠΟΥΛΟΥ ΧΡΙΣΤΙΝΑ-ΠΑΡΑΣΚΕΥΗ","Γ.Ο.ΠΕΡΙΣΤΕΡΙΟΥ Γ.ΠΑΛΑΣΚΑΣ",15,0]
["14-30847","ΓΕΡΟΜΑΡΚΑΚΗ ΑΝΑΣΤΑΣΙΑ","Α.Ο.Α.ΣΤΑΥΡΟΥΠΟΛΗΣ ΙΦΙΤΟΣ",15,0]
["14-29464","ΖΑΓΑΡΗ ΦΡΕΙΔΕΡΙΚΗ","Ο.Α.ΒΙΚΕΛΑΣ ΒΕΡΟΙΑΣ",15,0]
["14-33708","ΚΩΝΣΤΑΝΤΙΝΟΥ ΙΩΑΝΝΑ","Α.Σ.Α.ΛΑΡΙΣΑΣ",14.5,0]
["14-29671","ΕΞΑΡΧΟΥ ΘΕΟΔΩΡΑ","Α.Γ.Ο.ΦΙΛΙΠΠΙΑΔΑΣ",14,0]
["14-30544","ΔΕΣΚΟΥΛΙΔΟΥ ΙΩΑΝΝΑ","ΦΙΛΙΑ Τ.Κ.",13.5,0]
["14-32603","ΚΛΑΔΟΥ ΑΜΑΛΙΑ","ΗΡΑΚΛΕΙΟ Ο.Α.& Α.",13.5,0]
["14-28476","ΚΑΡΑΒΑΝΑ ΙΩΑΝΝΑ","Α.Ο.ΒΑΡΗΣ ΑΝΑΓΥΡΟΥΣ",13,0]
["14-32158","ΔΙΟΛΗ ΣΤΑΜΑΤΙΝΑ","Ο.Α.ΣΑΛΑΜΙΝΑΣ",12.5,0]
["14-33525","ΠΑΡΑΣΚΕΥΑ ΑΝΤΩΝΙΑ","Α.Ο.Α.ΠΑΠΑΓΟΥ",12.5,0]
["14-32054","ΠΙΕΤΑ ΜΑΡΙΑ","Γ.Ε.ΠΡΕΒΕΖΑΣ",12.5,0]
["14-33585","ΤΖΩΡΤΖΗ-ΝΤΕ-ΠΑΘ ΙΣΑΒΕΛΛΑ","Α.Σ.Α.ΛΑΡΙΣΑΣ",12.5,0]
["14-33187","ΤΟΜΑΖΑΝΗ ΜΑΡΙΑ-ΜΑΓΔΑΛΗΝΗ","Α.Σ.ΣΠΑΡΤΑΚΟΣ ΓΛΥΦΑΔΑΣ",12.5,0]
["14-32596","ΜΑΝΩΛΑΚΗ ΓΕΩΡΓΙΑ-ΕΛΕΝΗ","Ο.Α.ΜΑΓΝΗΣΙΑΣ",12,0]
["14-31261","ΜΕΛΛΟΥ ΑΝΑΣΤΑΣΙΑ","ΝΑΥΠΛΙΑΚΟΣ Ο.Α.",12,0]
["14-32851","ΜΗΤΣΟΥ ΚΥΡΙΑΚΗ","Α.Ο.Α.ΗΛΙΟΥΠΟΛΗΣ",12,0]
["14-33581","ΤΖΟΚΑ ΜΥΡΤΩ-ΙΩΑΝΝΑ","Γ.Ε.ΠΡΕΒΕΖΑΣ",12,0]
["14-30907","ΑΤΜΑΤΣΙΔΟΥ ΑΙΚΑΤΕΡΙΝΗ","Α.Ο.Α.ΣΤΑΥΡΟΥΠΟΛΗΣ ΙΦΙΤΟΣ",11.5,0]
["14-32256","ΤΖΙΒΕΛΕΚΗ ΕΛΕΝΗ-ΘΕΟΔΩΡΑ","Ο.Α.ΚΕΡΑΤΣΙΝΙΟΥ",11.5,0]
["14-29732","ΚΩΝΣΤΑΝΤΟΠΟΥΛΟΥ ΓΕΩΡΓΙΑ","ΑΙΟΛΟΣ Α.Λ.ΙΛΙΟΥ",11,0]
["14-33382","ΠΙΤΤΑΡΑ ΑΡΤΕΜΙΣ","Ο.Α.ΓΟΥΔΙΟΥ",10.5,0]
["14-29531","ΓΚΑΜΠΑΕΡΙΔΟΥ ΑΝΝΑ-ΜΑΡΙΑ","Ο.Α.ΑΛΕΞΑΝΔΡΟΥΠΟΛΗΣ",10,0]
["14-31298","ΚΑΡΑΓΕΩΡΓΙΟΥ ΑΝΝΑ","Ο.Α.ΚΕΡΑΤΣΙΝΙΟΥ",10,0]
["14-33411","ΚΟΚΑΛΗ ΕΙΡΗΝΗ","Α.Γ.Ο.ΦΙΛΙΠΠΙΑΔΑΣ",10,0]
["14-29070","ΜΟΥΡΒΑΤΗ ΡΩΜΥΛΙΑ","Ο.Α.ΞΑΝΘΗΣ",10,0]
["14-33408","ΣΤΑΜΑΤΗ ΔΗΜΗΤΡΑ-ΝΕΦΕΛΗ","Α.Γ.Ο.ΦΙΛΙΠΠΙΑΔΑΣ",10,0]
["14-31896","ΣΤΕΡΓΙΟΠΟΥΛΟΥ ΑΘΗΝΑ","Ο.Α.ΑΓΙΑΣ ΠΑΡΑΣΚΕΥΗΣ",10,0]
["14-33629","ΣΥΡΙΝΟΓΛΟΥ ΚΑΛΛΙΡΟΗ","Α.Α.ΑΙΓΑΛΕΩ",10,0]
["14-24364","ΨΑΡΑΚΗ ΑΜΑΛΙΑ-ΜΑΡΙΝΑ","Α.Ε.Κ.ΤΡΙΠΟΛΗΣ",10,0]
["14-32742","ΒΕΡΓΟΥ ΕΥΑΓΓΕΛΙΑ","Α.Ο.Α.ΠΑΠΑΓΟΥ",9.5,0]
["14-27264","ΔΟΥΚΑ ΜΑΡΙΑ","Α.Α.ΑΙΓΑΛΕΩ",9.5,0]
["14-31364","ΣΑΜΑΡΑ ΒΑΣΙΛΙΚΗ-ΜΑΓΔΑΛΗΝΗ","ΠΑΝΘΡΑΚΙΚΟΣ Ο.Α.ΚΟΜΟΤΗΝΗΣ",9.5,0]
["14-34607","ΦΟΥΝΤΟΥΛΗ ΑΛΕΞΑΝΔΡΑ","ΗΡΑΚΛΕΙΟ Ο.Α.& Α.",9.5,0]
["14-30146","ΓΚΕΚΑ ΒΑΣΙΛΙΚΗ","Α.Ε.Κ.ΤΡΙΠΟΛΗΣ",9,0]
["14-29863","ΛΑΝΤΖΗ ΛΟΥΙΖΑ","Ο.Α.ΓΛΥΦΑΔΑΣ",9,0]
["14-29442","ΜΑΚΡΥΝΑΚΗ ΜΕΛΙΝΑ","Α.Κ.Α.ΜΑΡΑΘΩΝΑ",9,0]
["14-31371","ΣΚΟΥΤΕΛΗ ΣΕΡΑΦΕΙΝΑ","ΡΟΔΙΑΚΗ ΑΚΑΔ.ΑΝΤΙΣΦ.",9,0]
["14-28303","ΤΣΕΠΛΕΤΙΔΟΥ ΜΑΡΙΑ","Μ.Γ.Σ.ΑΠΟΛΛΩΝ ΚΑΛΑΜΑΡΙΑΣ",8,0]
["14-29461","ΧΑΪΖΙΝΧΑ ΕΛΙΖΑ","ΑΙΟΛΟΣ Α.Λ.ΙΛΙΟΥ",6,0]
["14-34481","ΓΑΡΕΦΗ ΣΟΦΙΑ","Σ.Α.ΘΕΣΣΑΛΟΝΙΚΗΣ",8.5,0]
["14-34295","ΜΑΥΡΙΔΟΥ ΜΑΡΙΝΑ","Σ.Α.ΘΕΣΣΑΛΟΝΙΚΗΣ",8.5,0]
["14-31661","ΠΡΙΤΣΚΑ ΙΩΑΝΝΑ","Ο.Α.ΑΡΙΔΑΙΑΣ",8.5,0]
["14-33409","ΑΝΔΡΕΑΝΙΔΗ ΒΑΣΙΛΙΚΗ","Α.Γ.Ο.ΦΙΛΙΠΠΙΑΔΑΣ",8,0]
["14-32415","ΑΡΑΜΠΑΤΖΗ ΑΝΝΑ-ΝΕΚΤΑΡΙΑ","Ο.Α.ΞΑΝΘΗΣ",8,0]
["14-31777","ΑΡΒΑΝΙΤΙΔΟΥ ΕΛΕΝΗ","Α.Ο.Α.ΠΡΩΤΑΘΛ.ΚΑΒΑΛΑΣ",8,0]
["14-31939","ΚΑΛΛΕΡΓΗ ΑΡΤΕΜΗ","ΗΡΑΚΛΕΙΟ Ο.Α.& Α.",8,0]
["14-33431","ΜΑΛΤΕΖΟΥ ΣΟΦΙΑ-ΠΑΝΑΓΙΩΤΑ","Α.Γ.Ο.ΦΙΛΙΠΠΙΑΔΑΣ",8,0]
["14-31386","ΜΕΡΕΤΟΥΔΗ ΙΩΑΝΝΑ","Σ.Α.ΣΕΡΡΩΝ",8,0]
["14-32823","ΜΠΕΡΗ ΣΤΑΥΡΙΝΑ","Ο.Α.ΣΑΛΑΜΙΝΑΣ",8,0]
["14-27102","ΠΑΠΑΗΛΙΟΥ ΒΑΣΙΛΙΚΗ","Α.Ε.Κ.ΤΡΙΠΟΛΗΣ",8,0]
["14-29548","ΠΑΥΛΙΔΗ ΝΙΚΟΛΕΤΑ","ΗΡΑΚΛΕΙΟ Ο.Α.& Α.",7,0]
["14-32772","ΒΕΡΓΕΤΗ ΕΛΕΝΗ","Ο.Α.ΧΕΡΣΟΝΗΣΟΥ",7.5,0]
["14-33342","ΓΕΙΤΩΝΑ ΑΝΘΗ","Α.Γ.Ο.ΦΙΛΙΠΠΙΑΔΑΣ",7.5,0]
["14-29067","ΠΑΛΤΟΓΛΟΥ ΕΛΙΣΣΑΒΕΤ","Α.Ο.ΚΑΒΑΛΑΣ ΜΑΚΕΔΟΝΙΚΟΣ",7,0]
["14-32566","ΠΛΑΤΣΑ ΜΑΡΙΑΝΘΗ-ΗΛΙΑΝΑ","Α.Ο.Α.ΗΛΙΟΥΠΟΛΗΣ",2.5,0]
["14-31374","ΣΠΥΡΟΠΟΥΛΟΥ ΜΑΡΙΑΝΘΗ","Α.Σ.ΑΚΡΟΠΟΛΙΣ",7.5,0]
["14-30853","ΦΑΚΑ ΔΗΜΗΤΡΑ","Ο.Α.ΚΟΥΦΑΛΙΩΝ ΘΕΣΣΑΛΟΝΙΚΗΣ",7.5,0]
["14-33648","ΑΔΑΜΟΠΟΥΛΟΥ ΑΝΑΣΤΑΣΙΑ","Α.Ο.Α.ΧΑΪΔΑΡΙΟΥ",7,0]
["14-31297","ΒΑΦΕΙΑΔΟΥ ΣΤΥΑΡΟΥΛΑ","Ο.Α.ΓΙΑΝΝΙΤΣΩΝ",7,0]
["14-34048","ΕΥΘΥΜΙΟΥ ΒΑΣΙΛΙΚΗ-ΑΝΑΣΤΑΣΙΑ","ΦΘΙΩΤΙΚΟΣ Ο.Α.",7,0]
["14-31258","ΚΑΤΣΟΜΑΛΛΟΥ ΛΥΔΙΑ-ΔΗΜΗΤΡΑ","Α.Ο.ΚΑΒΑΛΑΣ ΜΑΚΕΔΟΝΙΚΟΣ",7,0]
["14-30562","ΚΟΡΝΑΡΟΥ ΒΑΣΙΛΙΚΗ","Α.Ε.Τ.ΝΙΚΗ ΠΑΤΡΩΝ",7,0]
["14-32732","ΜΟΥΡΤΙΔΟΥ ΔΕΣΠΟΙΝΑ","Α.Ο.Α.ΑΙΓΑΛΕΩ 92",7,0]
["14-32807","ΠΑΝΤΕΛΙΔΗ ΕΛΕΥΘΕΡΙΑ","Α.Ο.Α.ΑΤΤΙΚΟΣ ΗΛΙΟΣ",7,0]
["14-27436","ΠΑΠΑΔΟΠΟΥΛΟΥ ΕΥΘΥΜΙΑ-ΜΑΡΙΑ","Α.Ο.ΚΑΒΑΛΑΣ ΜΑΚΕΔΟΝΙΚΟΣ",7,0]
["14-29771","ΡΙΖΟΠΟΥΛΟΥ ΜΑΡΙΑ-ΙΩΑΝΝΑ","Ο.Α.ΚΑΒΑΛΑΣ ΑΛΕΞΑΝΔΡΟΣ",7,0]
["14-30047","ΣΤΑΜΑΤΗ ΕΝΑΤΙΝΑ-ΑΘΗΝΑ","Α.Ο.Α.ΗΛΙΟΥΠΟΛΗΣ",7,0]
["14-32547","ΧΑΤΖΗΜΠΑΤΖΑΚΗ ΑΝΝΑ","Ο.Α.ΠΕΤΡΟΥΠΟΛΗΣ",7,0]
["14-33694","ΓΕΩΡΓΑΝΤΖΕΛΗ ΚΩΝΣΤΑΝΤΙΝΑ-ΚΥΡΙΑΚΗ","Φ.Ο.Α.ΝΕΑΠΟΛΗΣ",6.5,0]
["14-29080","ΚΡΗΤΙΚΟΥ ΑΓΑΠΗ-ΕΛΕΝΗ","Ο.Α.ΓΛΥΦΑΔΑΣ",6.5,0]
["14-30844","ΚΥΡΙΤΣΗ ΠΑΡΑΣΚΕΥΗ","Α.Α.ΑΛΜΠΑΤΡΟΣ",6.5,0]
["14-32656","ΠΑΝΤΑΒΟΥ-ΚΛΑΔΗ ΙΩΑΝΝΑ","Α.Α.ΑΙΓΑΛΕΩ",6.5,0]
["14-33406","ΠΑΠΠΑ ΕΥΓΕΝΙΑ","Α.Γ.Ο.ΦΙΛΙΠΠΙΑΔΑΣ",6.5,0]
["14-33498","ΤΖΙΟΒΑ ΜΑΡΙΑ-ΑΝΝΕΤΑ","Ο.Α.ΣΥΡΟΥ",6.5,0]
["14-32027","ΧΡΥΣΟΥΛΑΚΗ ΕΥΑΓΓΕΛΙΑ","Γ.Σ.ΛΙΒΥΚΟΣ ΙΕΡΑΠΕΤΡΑΣ",6.5,0]
["14-30852","ΓΚΟΓΚΙΔΟΥ ΙΣΙΔΩΡΑ","Ο.Α.ΚΟΥΦΑΛΙΩΝ ΘΕΣΣΑΛΟΝΙΚΗΣ",6,0]
["14-33208","ΖΙΩΓΑ ΑΝΔΡΟΜΑΧΗ","Ο.Α.ΙΩΑΝΝΙΝΩΝ",6,0]
["14-31430","ΚΑΚΑΡΙΔΗ ΜΑΡΙΑ-ΖΑΝΑ","Σ.Α.ΣΕΡΡΩΝ",6,0]
["14-32765","ΚΑΝΙΑΡΗ ΕΛΕΝΑ","Α.Ο.Α.ΧΑΪΔΑΡΙΟΥ",6,0]
["14-32683","ΚΟΥΛΑ ΙΣΜΗΝΗ","Α.Ο.Α.ΠΑΠΑΓΟΥ",6,0]
["14-29292","ΛΑΖΑΡΟΠΟΥΛΟΥ ΜΑΡΙΑ-ΦΩΤΕΙΝΗ","Ο.Α.ΚΕΡΑΤΣΙΝΙΟΥ",5,0]
["14-29261","ΠΕΤΙΜΕΖΑΚΗ ΕΛΕΥΘΕΡΙΑ-ΕΛΕΝΗ","ΗΡΑΚΛΕΙΟ Ο.Α.& Α.",6,0]
["14-33759","ΣΕΡΠΑΝΟΥ ΓΕΩΡΓΙΑ","Ο.Α.ΡΙΟΥ",6,0]
["14-30021","ΣΤΑΥΡΟΠΟΥΛΟΥ ΣΤΥΛΙΑΝΗ","Α.Κ.Α.ΜΑΡΑΘΩΝΑ",6,0]
["14-31418","ΑΓΓΕΛΟΠΟΥΛΟΥ ΙΩΑΝΝΑ","Γ.Σ.ΛΙΒΥΚΟΣ ΙΕΡΑΠΕΤΡΑΣ",5.5,0]
["14-32155","ΒΑΓΓΕΛΑΤΟΥ ΕΥΑΓΓΕΛΙΑ","ΚΕΦΑΛΛΗΝΙΑΚΟΣ Ο.Α.",5.5,0]
["14-29672","ΕΞΑΡΧΟΥ ΠΑΝΑΓΙΩΤΑ","Α.Γ.Ο.ΦΙΛΙΠΠΙΑΔΑΣ",5.5,0]
["14-34287","ΚΑΚΑΒΑ ΛΑΜΠΡΙΝΗ","Α.Ο.Α.ΗΛΙΟΥΠΟΛΗΣ",5.5,0]
["14-33367","ΚΑΤΣΟΥΔΑ ΑΣΠΑΣΙΑ","Ο.Α.ΣΥΡΟΥ",5.5,0]
["14-34880","ΚΟΥΤΕΛΕΚΟΥ ΚΑΣΣΙΑΝΗ","ΑΙΟΛΟΣ Α.Λ.ΙΛΙΟΥ",5.5,0]
["14-32625","ΚΩΣΤΟΥΣΗ ΜΑΡΙΑ","Α.Γ.Ο.ΦΙΛΙΠΠΙΑΔΑΣ",5.5,0]
["14-32951","ΜΑΡΚΟΥΤΣΑ ΕΛΕΝΗ-ΑΝΝΑ","ΖΑΚΥΝΘΙΝΟΣ Α.Ο.Α",5.5,0]
["14-31416","ΠΕΤΑΣΗ ΣΤΕΛΛΑ","Γ.Σ.ΛΙΒΥΚΟΣ ΙΕΡΑΠΕΤΡΑΣ",5.5,0]
["14-29772","ΡΑΠΤΗ ΕΥΘΥΜΙΑ","Ο.Α.ΚΑΒΑΛΑΣ ΑΛΕΞΑΝΔΡΟΣ",5.5,0]
["14-31545","ΧΡΗΣΤΟΥ ΒΑΣΙΛΙΚΗ","Ο.Α.ΘΕΣΠΡΩΤΙΑΣ ΤΙΤΑΝΗ",5.5,0]
["14-29972","ΕΠΑΓΓΕΛΗ ΓΕΩΡΓΙΑ","Ο.Α.ΚΑΣΤΟΡΙΑΣ ΚΕΛΕΤΡΟΝ",4,0]
["14-32077","ΚΟΛΑΪΤΗ ΜΑΡΙΑΝΝΑ","ΚΕΦΑΛΛΗΝΙΑΚΟΣ Ο.Α.",5,0]
["14-34220","ΚΟΥΜΕΡΤΑ ΝΕΡΑΤΖΙΑ","Α.Ν.Σ.ΕΛΛΗΝΙΚΙΩΤΩΝ",5,0]
["14-28785","ΚΟΥΤΣΙΚΟΠΟΥΛΟΥ ΜΑΡΙΑΝΘΗ","Ο.Α.ΝΙΚΑΙΑ ΛΑΡΙΣΑΣ",5,0]
["14-32958","ΚΩΝΣΤΑΝΤΙΝΙΔΗ ΧΡΙΣΤΙΝΑ","ΖΑΚΥΝΘΙΝΟΣ Α.Ο.Α",5,0]
["14-33702","ΜΗΤΡΟΠΟΥΛΟΥ ΧΡΙΣΤΙΑΝΝΑ-ΕΥΑΓΓΕΛΙΑ","Α.Ν.Ο.ΓΛΥΦΑΔΑΣ",5,0]
["14-31475","ΜΥΛΩΝΑ ΛΗΔΑ-ΣΤΥΛΙΑΝΗ","Ο.Α.ΓΛΥΦΑΔΑΣ",5,0]
["14-30316","ΠΑΡΜΕΝΙΔΟΥ ΑΙΚΑΤΕΡΙΝΗ","Ο.Α.ΚΑΒΑΛΑΣ ΑΛΕΞΑΝΔΡΟΣ",5,0]
["14-33209","ΠΙΣΤΙΟΛΑ ΑΝΝΑ","Ο.Α.ΙΩΑΝΝΙΝΩΝ",5,0]
["14-32698","ΠΟΝΤΙΚΑΚΗ ΑΙΚΑΤΕΡΙΝΗ","Ο.Α.ΣΟΥΔΑΣ",5,0]
["14-32457","ΡΑΠΤΗ ΞΑΝΘΗ","ΦΙΛΑΘΛΗΤ.ΣΥΛ.ΛΑΜΙΑΣ",5,0]
["14-29842","ΡΕΜΜΑ ΑΙΚΑΤΕΡΙΝΗ","Ο.Α.ΚΟΡΙΝΘΟΥ",4.5,0]
["14-32521","ΦΑΪΣΤ ΕΛΕΝΗ-ΛΕΟΚΑΝΤΙΑ","Α.Ο.Α.ΑΙΓΑΛΕΩ 92",5,0]
["14-30850","ΦΡΑΓΓΟΠΟΥΛΟΥ ΧΡΙΣΤΙΝΑ","Ο.Α.ΚΟΥΦΑΛΙΩΝ ΘΕΣΣΑΛΟΝΙΚΗΣ",5,0]
["14-34688","ΨΩΜΑΚΑ ΙΩΑΝΝΑ","Ο.Α.ΧΟΛΑΡΓΟΥ",5,0]
["14-31437","ΒΑΡΔΑ ΑΝΝΑ - ΜΑΡΙΑ","Α.Ο.ΛΑΤΩ ΑΓ.ΝΙΚΟΛΑΟΥ",4.5,0]
["14-90141","ΚΕΝΤΕΡ ΜΑΡΙΑ-ΛΟΥΙΖΑ","Σ.Α.ΡΑΦΗΝΑΣ",4.5,0]
["14-34319","ΚΛΑΔΕΥΤΗΡΑ ΔΑΝΑΗ","Ο.Α.ΠΕΤΡΟΥΠΟΛΗΣ",4.5,0]
["14-32726","ΣΤΡΑΝΤΖΙΑ ΑΝΑΣΤΑΣΙΑ","Ο.Α.ΝΕΣΤΩΡΑΣ ΓΙΑΝΝΙΤΣΩΝ",4.5,0]
["14-32091","ΧΑΤΖΗΑΠΟΣΤΟΛΟΥ ΕΛΕΝΗ","Ο.Α.ΞΑΝΘΗΣ",4.5,0]
["14-31561","ΑΝΔΡΙΟΛΑ ΜΑΡΙΑ","Γ.Σ.ΛΙΒΥΚΟΣ ΙΕΡΑΠΕΤΡΑΣ",4,0]
["14-34588","ΓΚΟΥΛΗ ΣΤΑΥΡΟΥΛΑ","Α.Α.ΑΙΓΑΛΕΩ",4,0]
["14-32878","ΘΕΟΧΑΡΗ ΜΑΡΙΑ","Α.Ν.Ο.ΓΛΥΦΑΔΑΣ",4,0]
["14-34284","ΚΑΛΟΚΥΡΗ ΜΑΡΙΑ","Α.Ο.ΜΕΓΑΣ ΑΛΕΞΑΝΔΡΟΣ",4,0]
["14-24351","ΚΟΥΤΗ ΕΙΡΗΝΗ","Ο.Α.ΣΟΦΑΔΩΝ ΚΑΡΔΙΤΣΑΣ",4,0]
["14-31662","ΛΟΥΓΚΑ ΜΑΡΙΑ","Ο.Α.ΑΡΙΔΑΙΑΣ",4,0]
["14-32193","ΜΑΡΑΓΚΟΥ ΜΑΡΓΑΡΙΤΑ","Ο.Α.ΣΥΡΟΥ",4,0]
["14-32192","ΜΑΡΑΓΚΟΥ ΝΙΚΟΛΕΤΤΑ","Ο.Α.ΣΥΡΟΥ",4,0]
["14-28698","ΜΑΡΓΕΛΗ ΟΛΓΑ","Ο.Α.ΚΑΛΑΜΑΤΑΣ",4,0]
["14-31436","ΝΙΚΗΤΑΚΗ ΜΑΡΙΑ","Α.Ο.ΛΑΤΩ ΑΓ.ΝΙΚΟΛΑΟΥ",4,0]
["14-31290","ΝΙΚΟΛΑΪΔΟΥ ΡΑΦΑΕΛΛΑ","Γ.Α.Σ.ΚΑΡΑΤΕ ΕΡΜΗΣ",4,0]
["14-35121","ΠΑΠΑΔΕΑ ΔΗΜΗΤΡΑ","Ο.Α.ΡΙΟΥ",4,0]
["14-33402","ΠΑΠΑΪΩΑΝΝΟΥ ΑΝΑΣΤΑΣΙΑ","Α.Γ.Ο.ΦΙΛΙΠΠΙΑΔΑΣ",4,0]
["14-27800","ΠΑΠΑΦΙΛΙΠΠΟΥ ΠΑΡΑΣΚΕΥΗ-ΙΩΑΝΝΑ","Ο.Α.ΚΑΣΤΟΡΙΑΣ ΚΕΛΕΤΡΟΝ",4,0]
["14-33757","ΠΑΠΠΑ ΑΘΑΝΑΣΙΑ","Ο.Α.ΡΙΟΥ",4,0]
["14-31415","ΠΕΤΑΣΗ ΕΛΠΙΔΑ","Γ.Σ.ΛΙΒΥΚΟΣ ΙΕΡΑΠΕΤΡΑΣ",4,0]
["14-32474","ΠΟΙΜΕΝΙΔΟΥ ΔΕΣΠΟΙΝΑ","Ο.Α.ΞΑΝΘΗΣ",4,0]
["14-29297","ΠΟΝΗΡΙΔΗ ΗΛΕΚΤΡΑ","Α.Ο.ΜΕΓΑΣ ΑΛΕΞΑΝΔΡΟΣ",4,0]
["14-31797","ΣΕΡΓΟΥΛΟΠΟΥΛΟΥ ΜΑΡΙΑ-ΕΛΕΝΗ","Α.Ο.Α.ΠΑΠΑΓΟΥ",4,0]
["14-29799","ΣΤΕΦΑΝΙΔΟΥ ΑΝΘΙΑ","Ο.Α.ΒΕΡΟΙΑΣ",4,0]
["14-28483","ΣΩΤΗΡΑ ΚΛΕΟΠΑΤΡΑ","Α.Ε.Κ.ΤΡΙΠΟΛΗΣ",4,0]
["14-33993","ΤΖΙΟΥΜΗ ΓΕΩΡΓΙΑ","Α.Ε.Κ.ΤΡΙΠΟΛΗΣ",4,0]
["14-30597","ΤΖΩΡΤΖΟΠΟΥΛΟΥ ΕΛΕΥΘΕΡΙΑ","ΗΡΑΚΛΕΙΟ Ο.Α.& Α.",4,0]
["14-32806","ΑΜΑΝΑΤΙΔΗ ΕΛΙΣΑΒΕΤ","Α.Ο.Α.ΑΤΤΙΚΟΣ ΗΛΙΟΣ",3.5,0]
["14-29417","ΑΝΤΩΝΙΑΔΟΥ ΑΡΙΑΔΝΗ","Α.Σ.Α.ΠΑΝΟΡΑΜΑΤΟΣ",3.5,0]
["14-30088","ΒΑΡΑΜΠΟΥΤΗ ΦΩΤΕΙΝΗ","Α.Ο.Α.ΧΑΪΔΑΡΙΟΥ",3.5,0]
["14-31717","ΒΑΣΙΛΕΙΑΔΟΥ ΡΑΦΑΗΛΙΑ-ΓΕΩΡΓΙΑ","Ο.Α.ΝΕΣΤΩΡΑΣ ΓΙΑΝΝΙΤΣΩΝ",3.5,0]
["14-31474","ΓΙΑΝΝΑΤΟΥ ΑΓΓΕΛΙΚΗ","ΚΕΦΑΛΛΗΝΙΑΚΟΣ Ο.Α.",3.5,0]
["14-31632","ΚΑΜΠΟΥΡΙΔΟΥ ΑΙΚΑΤΕΡΙΝΗ","Α.Ο.ΚΑΒΑΛΑΣ ΜΑΚΕΔΟΝΙΚΟΣ",3.5,0]
["14-29839","ΚΑΡΑΝΤΩΝΗ ΣΟΦΙΑ-ΑΙΚΑΤΕΡΙΝΗ","Ο.Α.ΚΟΡΙΝΘΟΥ",3.5,0]
["14-31385","ΚΙΟΦΕΝΤΖΟΓΛΟΥ ΔΕΣΠΟΙΝΑ","Σ.Α.ΣΕΡΡΩΝ",3.5,0]
["14-31342","ΜΕΡΤΖΑΝΙΔΟΥ ΙΩΑΝΝΑ","Α.Ο.Α.ΝΕΑΣ ΠΕΡΑΜΟΥ ΟΙ ΤΙΤΑΝΕΣ",3.5,0]
["14-34585","ΜΗΛΙΟΠΟΥΛΟΥ ΣΟΦΙΑ","Ο.Α.ΒΙΚΕΛΑΣ ΒΕΡΟΙΑΣ",3.5,0]
["14-33542","ΜΟΥΖΑΚΗ ΑΝΑΣΤΑΣΙΑ","Σ.Α.ΡΑΦΗΝΑΣ",3.5,0]
["14-33496","ΜΠΑΖΙΓΟΥ ΕΛΕΥΘΕΡΙΑ-ΧΡΙΣΤΙΝΑ","ΚΕΦΑΛΛΗΝΙΑΚΟΣ Ο.Α.",3.5,0]
["14-34473","ΜΠΟΥΡΑ-ΒΑΛΛΙΑΝΑΤΟΥ ΔΕΣΠΟΙΝΑ","ΚΕΦΑΛΛΗΝΙΑΚΟΣ Ο.Α.",3.5,0]
["14-31338","ΝΑΛΜΠΑΝΤΗ ΝΙΚΟΛΕΤΤΑ-ΙΣΜΗΝΗ","Α.Ο.Α.ΝΕΑΣ ΠΕΡΑΜΟΥ ΟΙ ΤΙΤΑΝΕΣ",3.5,0]
["14-34049","ΞΕΝΑΚΗ ΙΩΑΝΝΑ","Ο.Α.ΚΕΡΑΤΣΙΝΙΟΥ",3.5,0]
["14-34884","ΠΑΠΑΔΑΤΟΥ ΚΑΤΕΡΙΝΑ","ΚΕΦΑΛΛΗΝΙΑΚΟΣ Ο.Α.",3.5,0]
["14-34890","ΣΤΑΒΕΡΗ ΑΡΤΕΜΗ","ΚΕΦΑΛΛΗΝΙΑΚΟΣ Ο.Α.",3.5,0]
["14-33874","ΣΤΕΛΛΙΑΤΟΥ ΕΥΡΟΣΥΝΗ-ΓΕΩΡΓΙΑ","Α.Ο.ΜΕΓΑΣ ΑΛΕΞΑΝΔΡΟΣ",3.5,0]
["14-33383","ΤΣΟΜΠΑΝΙΔΟΥ ΝΙΚΟΛΕΤΑ","Σ.Α.ΔΡΑΜΑΣ",3.5,0]
["14-28188","ΓΑΛΑΝΑΚΗ ΖΑΧΑΡΕΝΙΑ","Γ.Σ.ΛΙΒΥΚΟΣ ΙΕΡΑΠΕΤΡΑΣ",3,0]
["14-31638","ΓΑΝΙΤΗ ΚΑΛΛΙΟΠΗ","Ν.Ο.Ν.Α.Μ",3,0]
["14-33502","ΚΑΚΑΚΗ ΚΟΜΗΣΑ-ΣΤΑΥΡΟΥΛΑ","ΡΟΔΙΑΚΟΣ Ο.Α.",3,0]
["14-29704","ΚΑΡΚΑΛΕΤΣΗ ΕΡΜΙΟΝΗ-ΘΕΟΠΟΥΛΑ","Σ.Ο.Α.ΚΑΡΔΙΤΣΑΣ ΦΩΚΙΑΝΟΣ",3,0]
["14-34201","ΚΑΤΣΗ ΒΑΣΙΛΙΚΗ","Φ.Ο.Α.ΝΕΑΠΟΛΗΣ",3,0]
["14-33338","ΚΑΤΩΠΟΔΗ ΣΟΦΙΑ","Γ.Ε.ΠΡΕΒΕΖΑΣ",3,0]
["14-27579","ΚΟΓΙΑ ΜΕΛΙΝΑ","Α.Ο.ΒΑΡΗΣ ΑΝΑΓΥΡΟΥΣ",3,0]
["14-32201","ΚΟΚΚΟΡΗ ΕΙΡΗΝΗΥ-ΕΛΕΝΗ","Ο.Α.ΣΥΡΟΥ",3,0]
["14-25380","ΚΟΤΡΩΤΣΙΟΥ ΣΤΕΦΑΝΙΑ","Α.Σ.Α.ΛΑΡΙΣΑΣ",3,0]
["14-34273","ΚΩΣΤΟΠΟΥΛΟΥ ΧΡΙΣΤΙΝΑ","Α.Σ.Α.ΛΑΡΙΣΑΣ",3,0]
["14-27110","ΛΑΝΤΖΗ ΛΟΥΙΖΑ","Ο.Α.ΑΘΗΝΩΝ",3,0]
["14-34565","ΛΥΤΡΑ ΕΛΕΝΗ","Φ.Σ.ΚΑΛΛΙΘΕΑΣ",3,0]
["14-32504","ΜΑΚΡΗ ΜΥΡΣΙΝΗ","Α.Ο.Α.ΧΑΪΔΑΡΙΟΥ",2,0]
["14-29118","ΜΠΙΖΟΠΟΥΛΟΥ ΠΕΛΑΓΙΑ","Ο.Α.ΤΟΥΜΠΑΣ",3,0]
["14-33279","ΜΠΟΥΡΙΚΑ ΚΑΛΛΙΟΠΗ","ΝΑΥΠΛΙΑΚΟΣ Ο.Α.",3,0]
["14-31696","ΞΑΝΘΟΠΟΥΛΟΥ ΚΩΝΣΤΑΝΤΙΝΑ","Α.Σ.Ε.ΘΗΣΕΑΣ ΑΓΙΟΥ ΔΗΜΗΤΡΙΟΥ",2,0]
["14-29867","ΠΑΛΙΕΡΑΚΗ ΧΡΥΣΑ","Ο.Α.ΡΕΘΥΜΝΟΥ",3,0]
["14-30438","ΠΟΠΗ ΔΕΣΠΟΙΝΑ","Ο.Α.ΚΑΣΤΟΡΙΑΣ ΚΕΛΕΤΡΟΝ",3,0]
["14-33524","ΠΟΡΙΑΖΗ ΕΥΑΝΘΙΑ","Ο.Α.ΠΑΝΟΡΑΜΑΤΟΣ",3,0]
["14-32327","ΣΙΑ ΑΝΑΣΤΑΣΙΑ","Ο.Α.ΤΟΥΜΠΑΣ",3,0]
["14-32904","ΣΙΟΝΤΗ ΜΕΛΙΝΑ","Ο.Α.ΙΩΑΝΝΙΝΩΝ",3,0]
["14-25108","ΣΤΑΜΠΟΥΛΗ ΒΑΣΙΛΙΚΗ","Ο.Α.ΕΥΟΣΜΟΥ ΘΕΣΣΑΛΟΝΙΚΗΣ",3,0]
["14-28111","ΧΑΡΑΛΑΜΠΟΠΟΥΛΟΥ ΙΩΑΝΝΑ","Α.Ε.Κ.ΤΡΙΠΟΛΗΣ",3,0]
["14-31370","ΧΟΡΒΑΛΗ ΜΥΡΤΩ","Φ.Σ.ΚΑΛΛΙΘΕΑΣ",3,0]
["14-29847","ΧΡΟΝΙΔΟΥ ΕΛΕΝΗ","Ο.Α.ΚΑΙΣΑΡΙΑΝΗΣ",3,0]
["14-29848","ΧΡΟΝΙΔΟΥ ΕΥΡΙΔΙΚΗ","Ο.Α.ΚΑΙΣΑΡΙΑΝΗΣ",3,0]
["14-34878","ΓΕΙΤΟΝΑ ΒΑϊΑ","Α.Γ.Ο.ΦΙΛΙΠΠΙΑΔΑΣ",2.5,0]
["14-33803","ΓΕΩΡΓΑΝΤΖΕΛΗ ΑΝΝΑ","Α.Σ.Α.ΠΑΝΟΡΑΜΑΤΟΣ",2.5,0]
["14-34488","ΓΙΑΛΕΛΗ ΝΙΚΟΛΙΤΣΑ","Α.Ο.Α.ΑΙΓΑΛΕΩ 92",2.5,0]
["14-33970","ΓΙΑΝΝΕΤΟΥ ΑΜΑΛΙΑ","Ο.Α.ΠΕΤΡΟΥΠΟΛΗΣ",2.5,0]
["14-29675","ΔΗΜΗΤΡΙΟΥ ΕΥΣΤΡΑΤΙΑ","Α.Γ.Ο.ΦΙΛΙΠΠΙΑΔΑΣ",2.5,0]
["14-30433","ΚΑΒΑΣΑΚΑΛΗ ΜΑΡΙΑ","Ο.Α.ΞΑΝΘΗΣ",2.5,0]
["14-32564","ΚΑΡΑΒΙΩΤΗ ΕΛΕΝΗ","Φ.Σ.ΚΑΛΛΙΘΕΑΣ",2.5,0]
["14-25329","ΚΑΡΙΠΙΔΟΥ ΕΛΕΝΗ","Ο.Α.ΠΟΛΥΚΑΣΤΡΟΥ",2.5,0]
["14-32859","ΚΟΥΚΟΥΡΑΚΗ ΜΕΛΙΝΑ","Α.Ο.Α.ΠΑΠΑΓΟΥ",2.5,0]
["14-34098","ΜΑΪΣΤΡΟΥ ΜΟΣΧΑ","Ο.Α.ΧΟΛΑΡΓΟΥ",2.5,0]
["14-34289","ΜΕΡΤΖΑΝΗ ΣΤΥΛΙΑΝΗ","Α.Σ.ΣΠΑΡΤΑΚΟΣ ΓΛΥΦΑΔΑΣ",2.5,0]
["14-33484","ΜΕΤΑΛΛΗΝΟΥ ΤΕΡΕΖΑ","ΚΕΡΚΥΡΑΪΚΗ Λ.Τ.",2.5,0]
["14-32545","ΜΙΧΑΛΑΚΗ ΑΓΓΕΛΙΚΗ","Ο.Α.ΣΑΛΑΜΙΝΑΣ",1.5,0]
["14-29280","ΜΠΟΥΜΠΟΥΛΗ ΑΛΕΞΑΝΔΡΑ","Α.Ο.Α.ΣΤΑΥΡΟΥΠΟΛΗΣ ΙΦΙΤΟΣ",2.5,0]
["14-26980","ΝΟΤΑΚΗ ΕΥΑΓΓΕΛΙΑ","Γ.Σ.ΛΙΒΥΚΟΣ ΙΕΡΑΠΕΤΡΑΣ",2.5,0]
["14-34949","ΝΤΕΛΛΑ ΧΑϊΔΩ","Ο.Α.ΒΙΚΕΛΑΣ ΒΕΡΟΙΑΣ",2.5,0]
["14-33407","ΠΑΠΑΧΡΗΣΤΟΥ ΜΑΡΙΑ","Ο.Α.ΑΡΤΑΣ",2.5,0]
["14-31429","ΠΟΛΥΡΑΒΑ ΣΩΤΗΡΙΑ","Σ.Α.ΣΕΡΡΩΝ",2.5,0]
["14-34308","ΣΤΥΛΙΑΝΟΥ ΜΑΡΙΑ-ΕΛΕΝΗ","Ο.Α.ΑΓΙΑΣ ΠΑΡΑΣΚΕΥΗΣ",2.5,0]
["14-32388","ΒΕΡΓΟΥ ΑΦΡΟΔΙΤΗ","Α.Γ.Ο.ΦΙΛΙΠΠΙΑΔΑΣ",2,0]
["14-33896","ΒΟΥΡΚΟΥΤΙΩΤΗ ΝΕΦΕΛΗ","Α.Ε.ΠΟΡΤΟ ΡΑΦΤΗ",2,0]
["14-33880","ΓΩΓΟΥΛΟΥ ΜΑΡΙΑ-ΕΥΣΤΡΑΤΙΑ","Ο.Α.ΑΓΙΩΝ ΑΝΑΡΓΥΡΩΝ",2,0]
["14-32857","ΖΗΚΟΠΟΥΛΟΥ ΝΕΦΕΛΗ","Α.Α.ΑΛΜΠΑΤΡΟΣ",2,0]
["14-30954","ΚΑΠΕΤΑΝΙΚΟΛΑ ΡΑΦΑΕΛΑ-ΜΑΡΙΑ","Ο.Α.ΣΤΑΥΡΟΥ ΑΣΠΡΟΒΑΛΤΑΣ",2,0]
["14-30485","ΚΑΡΑΔΗΜΑ ΕΛΕΥΘΕΡΙΑ","Α.Ο.Α.ΑΤΤΙΚΟΣ ΗΛΙΟΣ",2,0]
["14-30124","ΚΕΦΑΛΙΑΚΟΥ ΝΑΤΑΛΙΑ","Α.Ο.Α.ΠΑΠΑΓΟΥ",0,0]
["14-31572","ΚΙΤΣΗ ΑΘΗΝΑ","Σ.Α.ΕΛΑΣΣΟΝΑΣ",2,0]
["14-29865","ΚΡΗΤΙΚΟΥ ΑΓΑΠΗ","Ο.Α.ΓΛΥΦΑΔΑΣ",2,0]
["14-31233","ΚΩΝΣΤΑΝΤΙΝΙΔΟΥ ΝΑΤΑΛΙΑ","Ο.Α.ΞΑΝΘΗΣ",2,0]
["14-34045","ΛΑΓΟΥ ΧΡΙΣΤΙΝΑ","Ο.Α.ΙΩΑΝΝΙΝΩΝ",2,0]
["14-29891","ΛΙΟΛΙΟΠΟΥΛΟΥ ΕΥΔΟΞΙΑ","Ο.Α.ΒΕΡΟΙΑΣ",2,0]
["14-34373","ΜΑΓΟΓΙΑΝΝΗ ΡΑΦΑΕΛΑ","Α.Ο.Α.ΧΑΪΔΑΡΙΟΥ",2,0]
["14-29324","ΜΗΝΑΔΑΚΗ ΕΥΑ","Α.Ε.Κ.ΤΡΙΠΟΛΗΣ",2,0]
["14-34979","ΝΑΟΥΜ ΝΕΦΕΛΗ","Ο.Α.ΑΓΙΑΣ ΠΑΡΑΣΚΕΥΗΣ",2,0]
["14-29463","ΝΤΑΓΚΑ ΑΡΤΕΜΙΣ","Α.Α.ΑΛΜΠΑΤΡΟΣ",2,0]
["14-34398","ΠΑΠΑΕΥΘΥΜΙΟΥ ΕΥΑΓΓΕΛΙΑ-ΦΑΙΔΡΑ","Α.Σ.ΟΡΦΕΑΣ ΛΑΡΙΣΑΣ",2,0]
["14-34549","ΠΑΤΕΛΗ ΕΛΙΣΑΒΕΤ","Ο.Α.ΠΑΡΟΥ",2,0]
["14-32348","ΠΕΠΕΛΙΔΟΥ ΑΙΚΑΤΕΡΙΝΗ","Φ.Ο.Α.ΝΕΑΠΟΛΗΣ",2,0]
["14-33743","ΠΛΑΚΑΚΗ ΑΙΚΑΤΕΡΙΝΗ","Α.Α.ΑΙΓΑΛΕΩ",2,0]
["14-33274","ΠΛΑΤΑΝΙΤΗ ΕΛΕΝΗ","ΝΑΥΠΛΙΑΚΟΣ Ο.Α.",2,0]
["14-34639","ΠΟΥΛΚΑ ΜΑΡΙΑ-ΕΛΕΝΗ","Α.Ο.Α.ΣΤΑΥΡΟΥΠΟΛΗΣ ΙΦΙΤΟΣ",2,0]
["14-34363","ΣΟΥΔΗ ΜΑΡΙΑ","Ο.Α.ΑΡΙΔΑΙΑΣ",2,0]
["14-27105","ΣΟΥΡΛΙΓΚΑ ΔΗΜΗΤΡΑ","Α.Ε.Κ.ΤΡΙΠΟΛΗΣ",2,0]
["14-31663","ΤΣΙΤΣΟΥ ΣΤΑΥΡΟΥΛΑ","Ο.Α.ΑΡΙΔΑΙΑΣ",2,0]
["14-34909","ΧΡΙΣΤΟΔΟΥΛΟΥ ΙΩΑΝΝΑ","Ο.Α.ΣΑΛΑΜΙΝΑΣ",2,0]
["14-33120","ΨΥΡΡΗ ΔΙΟΝΥΣΙΑ","Α.Ε.Τ.ΝΙΚΗ ΠΑΤΡΩΝ",2,0]
["14-33681","ΑΛΕΞΟΠΟΥΛΟΥ ΜΑΡΙΑ","Ο.Α.ΙΩΑΝΝΙΝΩΝ",1.5,0]
["14-34213","ΑΛΕΞΟΥΔΗ ΦΑΝΗ","Α.Σ.ΟΡΦΕΑΣ ΛΑΡΙΣΑΣ",1.5,0]
["14-33532","ΑΝΤΖΟΥΛΑΚΟΥ ΑΛΙΚΗ","Α.Σ.ΟΡΦΕΑΣ ΛΑΡΙΣΑΣ",1.5,0]
["14-32335","ΓΑΤΟΥ ΜΑΡΙΑ","Ο.Α.ΒΕΡΟΙΑΣ",1.5,0]
["14-34911","ΓΕΩΡΓΙΑΔΟΥ ΜΑΡΙΑ","Ο.Α.ΑΡΙΔΑΙΑΣ",1.5,0]
["14-33278","ΔΗΜΑΡΑΚΗ ΒΑΣΙΛΙΚΗ","ΝΑΥΠΛΙΑΚΟΣ Ο.Α.",1.5,0]
["14-35159","ΕΥΘΥΜΙΑΔΟΥ ΝΤΟΡΙΑΝΝΑ","Α.Ο.Α.ΑΤΤΙΚΟΣ ΗΛΙΟΣ",1.5,0]
["14-34237","ΚΑΔΟΓΛΟΥ ΔΕΣΠΟΙΝΑ","Σ.Α.ΔΡΑΜΑΣ",1.5,0]
["14-33458","ΚΑΛΛΙΑΡΙΔΟΥ ΟΛΓΑ-ΜΑΡΙΑ","Ο.Α.ΒΙΚΕΛΑΣ ΒΕΡΟΙΑΣ",1.5,0]
["14-34679","ΚΑΛΟΓΡΑ ΒΑΣΙΛΙΚΗ","Σ.Α.ΣΕΡΡΩΝ",1.5,0]
["14-34673","ΚΑΛΦΑΝΤΗ ΔΗΜΗΤΡΑ","Α.Ο.ΚΑΛΛΙΤΕΧΝΟΥΠΟΛΗΣ",1.5,0]
["14-32783","ΚΑΜΠΑ ΒΑΣΙΛΙΚΗ","Ο.Α.ΓΟΥΔΙΟΥ",1.5,0]
["14-32079","ΚΑΡΑΛΗ ΟΥΡΑΝΙΑ","Ο.Α.ΙΩΑΝΝΙΝΩΝ",1.5,0]
["14-34967","ΚΑΤΣΙΜΑΡΔΟΥ ΕΛΕΝΗ","Γ.Ο.ΠΕΡΙΣΤΕΡΙΟΥ Γ.ΠΑΛΑΣΚΑΣ",1.5,0]
["14-32797","ΛΟΥΚΑ ΒΙΡΓΙΝΙΑ","Ο.Α.ΑΛΕΞΑΝΔΡΟΣ ΒΕΡΟΙΑΣ",1.5,0]
["14-29953","ΜΗΤΡΟΠΟΥΛΟΥ ΔΑΝΑΗ","Ο.Α.ΚΑΛΑΜΑΤΑΣ",1.5,0]
["14-34409","ΠΑΝΑΓΙΩΤΟΠΟΥΛΟΥ ΖΑΧΑΡΟΥΛΑ","Α.Σ.ΟΡΦΕΑΣ ΛΑΡΙΣΑΣ",1.5,0]
["14-35149","ΠΑΝΑΚΑ ΝΕΦΕΛΗ","Ο.Α.ΘΕΣΣΑΛΟΝΙΚΗΣ",1.5,0]
["14-32565","ΠΑΝΤΕΛΙΔΟΥ ΕΛΕΥΘΕΡΙΑ","Φ.Σ.ΚΑΛΛΙΘΕΑΣ",1.5,0]
["14-34826","ΠΡΟΔΡΟΜΙΔΗ ΕΛΕΥΘΕΡΙΑ","Γ.Ε.ΠΡΕΒΕΖΑΣ",1.5,0]
["14-34586","ΡΑΠΑΤΖΙΚΟΥ ΘΕΟΦΑΝΙΑ","Ο.Α.ΣΑΛΑΜΙΝΑΣ",1.5,0]
["14-34429","ΡΑΠΤΗ ΣΤΑΥΡΟΥΛΑ-ΜΑΡΙΝΑ","Γ.Ε.ΠΡΕΒΕΖΑΣ",1.5,0]
["14-33456","ΣΑΡΡΗ ΑΜΑΛΙΑ-ΜΑΡΙΑ","Ο.Α.ΠΕΤΡΟΥΠΟΛΗΣ",1.5,0]
["14-33121","ΤΙΜΠΙΛΗ ΒΑΣΙΛΙΚΗ","Α.Ε.Τ.ΝΙΚΗ ΠΑΤΡΩΝ",1.5,0]
["14-31059","ΤΣΟΥΡΟΥ ΣΟΦΙΑ","Ο.Α.ΑΓΙΩΝ ΑΝΑΡΓΥΡΩΝ",1.5,0]
["14-34005","ΧΑΤΖΗΣΑΒΒΑ ΕΛΙΣΑΒΕΤ","Ε.Α.Σ.ΟΛΥΜΠΙΑΔΑ",1.5,0]
["14-34919","ΧΙΩΤΙΝΗ ΑΝΝΑ-ΜΑΡΙΑ","Α.Ο.ΠΟΣΕΙΔΩΝ ΛΟΥΤΡΑΚΙΟΥ",1.5,0]
["14-34868","ΑΒΡΑΜΙΔΟΥ ΠΑΝΑΓΙΩΤΑ","Α.Ο.Α.ΣΤΑΥΡΟΥΠΟΛΗΣ ΙΦΙΤΟΣ",1,0]
["14-29986","ΑΝΔΡΟΥΛΑΚΗ ΙΩΑΝΝΑ-ΜΕΛΙΤΙΝΗ","Ο.Α.ΚΑΙΣΑΡΙΑΝΗΣ",1,0]
["14-31358","ΑΡΓΥΡΟΠΟΥΛΟΥ ΔΕΣΠΟΙΝΑ","Ο.Α.ΚΕΡΑΤΣΙΝΙΟΥ",0,0]
["14-32798","ΓΕΩΡΓΟΠΟΥΛΟΥ ΝΑΤΑΛΙΑ","Ο.Α.ΑΛΕΞΑΝΔΡΟΣ ΒΕΡΟΙΑΣ",1,0]
["14-33148","ΓΙΑΝΝΑΚΟΒΙΤΗ ΕΥΦΡΟΣΙΝΗ","Α.Α.ΝΑΟΥΣΑΣ",1,0]
["14-34105","ΓΙΑΝΝΟΥΣΗ ΜΑΡΙΑ ΕΙΡΗΝΗ","Α.Σ.ΑΚΑΔΗΜΙΕΣ ΠΡΩΤΑΘΛΗΤΩΝ ΠΕΥΚΩΝ",1,0]
["14-33747","ΓΚΙΤΕΡΣΟΥ ΑΙΚΑΤΕΡΙΝΗ","Α.Σ.ΑΚΑΔΗΜΙΕΣ ΠΡΩΤΑΘΛΗΤΩΝ ΠΕΥΚΩΝ",1,0]
["14-34677","ΔΗΜΑΔΗ ΚΑΤΕΡΙΝΑ","Σ.Α.ΣΕΡΡΩΝ",1,0]
["14-30718","ΔΗΜΟΠΟΥΛΟΥ ΖΗΝΟΒΙΑ","Α.Ε.Τ.ΝΙΚΗ ΠΑΤΡΩΝ",1,0]
["14-33655","ΔΡΑΓΟΜΑΝΟΒΙΤΣ ΕΛΙΣΑΒΕΤ","Α.Ο.ΜΕΓΑΣ ΑΛΕΞΑΝΔΡΟΣ",0,0]
["14-32582","ΖΑΠΡΟΥ ΒΙΚΤΩΡΙΑ","Ο.Α.ΩΡΑΙΟΚΑΣΤΡΟΥ Ο ΑΝΤΑΙΟΣ",1,0]
["14-32358","ΖΕΡΒΟΥ ΚΥΡΑΝΗ","Ο.Α.ΚΕΡΑΤΣΙΝΙΟΥ",1,0]
["14-29968","ΖΟΥΜΑ ΕΥΑΓΓΕΛΙΑ","Α.Ο.ΣΙΚΥΩΝΟΣ ΚΙΑΤΟΥ",1,0]
["14-30132","ΚΑΛΦΑΟΓΛΟΥ ΑΘΗΝΑ","Α.Ο.ΚΑΛΛΙΤΕΧΝΟΥΠΟΛΗΣ",1,0]
["14-33777","ΚΑΡΑΓΙΑΝΝΑΚΙΔΟΥ ΜΑΡΙΑ","Α.Σ.Α.ΠΑΝΟΡΑΜΑΤΟΣ",1,0]
["14-33359","ΚΑΨΑΛΗ ΑΝΘΗ","Α.Ν.Ο.ΓΛΥΦΑΔΑΣ",1,0]
["14-29722","ΚΟΝΤΟΜΙΧΑΛΟΥ ΣΟΦΙΑ-ΧΑΡΤ","Ο.Α.ΑΘΗΝΩΝ",1,0]
["14-33280","ΚΥΡΙΑΚΙΔΟΥ ΑΛΕΞΑΝΔΡΑ","ΝΑΥΠΛΙΑΚΟΣ Ο.Α.",1,0]
["14-34630","ΜΑΝΙΚΑΚΗ ΑΝΝΑ ΜΑΡΙΑ","Σ.Α.ΣΕΡΡΩΝ",1,0]
["14-34631","ΜΑΝΙΚΑΚΗ ΧΡΙΣΤΙΝΑ","Σ.Α.ΣΕΡΡΩΝ",1,0]
["14-34564","ΜΑΥΡΟΜΑΤΗ ΝΑΤΑΛΙΑ-ΧΡΙΣΤΙΝΑ","Α.Ο.ΜΕΓΑΣ ΑΛΕΞΑΝΔΡΟΣ",1,0]
["14-34482","ΜΠΑΛΛΗ ΓΕΩΡΓΙΑ","Ο.Α.ΓΙΑΝΝΙΤΣΩΝ",1,0]
["14-34483","ΜΠΑΛΛΗ ΔΑΦΝΗ","Ο.Α.ΓΙΑΝΝΙΤΣΩΝ",1,0]
["14-35207","ΜΠΑΛΟΥΜΗ ΒΑΣΙΛΙΚΗ-ΚΩΝΣΤΑΝΤΙΝΑ","Α.Ο.Α.ΧΑΪΔΑΡΙΟΥ",1,0]
["14-35137","ΜΠΟΥΡΝΟΥΞΟΥΖΗ ΑΝΑΣΤΑΣΙΑ","Ο.Π.ΘΕΣΣΑΛΟΝΙΚΗΣ ΜΑΚΕΔΟΝΙΑ 92",1,0]
["14-32142","ΝΙΚΟΛΑϊΔΟΥ ΝΙΚΟΛΕΤΑ","Α.Α.ΑΛΜΠΑΤΡΟΣ",1,0]
["14-32720","ΝΤΟΥΝΗ ΑΙΓΛΗ","Ο.Α.ΠΕΙΡΑΙΑ",1,0]
["14-31566","ΞΕΝΟΥ-ΓΑΒΡΙΕΛΗ ΑΘΗΝΑ","Α.Ο.Ν.ΣΜΥΡΝΗΣ Ο ΜΙΛΩΝ",1,0]
["14-30233","ΠΑΠΑΓΕΩΡΓΙΟΥ ΜΥΡΤΩ","Α.Σ.ΑΚΑΔΗΜΙΕΣ ΠΡΩΤΑΘΛΗΤΩΝ ΠΕΥΚΩΝ",1,0]
["14-32347","ΠΑΠΑΓΡΗΓΟΡΙΟΥ ΠΑΣΧΑΛΙΤΣΑ","Ο.Π.ΘΕΣΣΑΛΟΝΙΚΗΣ ΜΑΚΕΔΟΝΙΑ 92",1,0]
["14-34882","ΠΑΠΑΔΡΕΑΔΗ ΒΑΣΙΛΙΚΗ","Γ.Σ.ΚΗΦΙΣΙΑΣ",1,0]
["14-34401","ΡΑΛΛΗ ΚΑΤΕΡΙΝΑ","Ο.Α.ΠΤΟΛΕΜΑΪΔΑΣ",1,0]
["14-33322","ΣΑΚΕΤΑ ΔΗΜΗΤΡΑ","Α.Ο.ΑΡΓΥΡΟΥΠΟΛΗΣ",1,0]
["14-31664","ΣΙΩΠΗ ΑΡΙΑΔΝΗ","Ο.Α.ΑΡΙΔΑΙΑΣ",1,0]
["14-33910","ΣΠΥΡΟΠΟΥΛΟΥ ΙΡΙΔΑ","Α.Ν.Ο.ΓΛΥΦΑΔΑΣ",0,0]
["14-34267","ΣΤΙΓΚΑ ΚΩΝΣΤΑΝΤΙΝΑ","Α.Σ.Α.ΑΓΡΙΝΙΟΥ",1,0]
["14-35177","ΤΟΠΑΤΣΗ ΑΝΔΡΙΑΝΑ","Σ.Α.ΣΕΡΡΩΝ",1,0]
["14-34310","ΤΣΟΛΟΥΔΗ ΧΡΙΣΤΙΝΑ","Σ.Α.ΓΑΛΑΤΣΙΟΥ",1,0]
["14-34918","ΧΙΩΤΙΝΗ ΜΑΡΙΝΑ","Α.Ο.ΠΟΣΕΙΔΩΝ ΛΟΥΤΡΑΚΙΟΥ",1,0]
["14-29564","ΑΝΑΣΤΑΣΟΠΟΥΛΟΥ ΗΡΩ","Α.Ο.Ν.Φ.ΑΤΤΑΛΟΣ",0,0]
["14-29484","ΙΩΑΝΝΙΔΟΥ ΣΤΕΛΛΑ","Ο.Α.ΚΙΛΚΙΣ",0.5,0]
["14-30875","ΛΑΜΠΡΟΥ ΜΑΡΙΑ-ΑΓΓΕΛΙΚΗ","Α.Ο.Π.ΦΑΛΗΡΟΥ",0.5,0]
["14-30775","ΜΑΓΓΙΝΑ ΚΩΝΣΤΑΝΤΙΝΑ","Α.Κ.Α.ΜΑΡΑΘΩΝΑ",0.5,0]
["14-34224","ΜΙΓΚΑΚΗ ΔΕΣΠΟΙΝΑ","Α.Ο.Ν.Φ.ΑΤΤΑΛΟΣ",0,0]
["14-29959","ΠΡΑΤΣΟΥΛΑΚΗ ΑΘΗΝΑ","Ο.Α.ΒΙΚΕΛΑΣ ΒΕΡΟΙΑΣ",0.5,0]
["14-34711","ΤΡΙΑΝΤΑΦΥΛΛΙΔΟΥ ΜΑΡΙΑ","Ο.Α.ΚΙΛΚΙΣ",0.5,0]
["14-33909","ΤΣΟΥΚΑΛΑ ΝΑΝΣΥ-ΔΕΣΠΟΙΝΑ","Ο.Α.ΑΝΑΦΛΥΣΤΟΣ ΣΑΡΩΝΙΔΑΣ",0.5,0]
["14-33494","ΑΓΙΑΝΝΙΔΟΥ ΕΛΕΝΗ","Ο.Α.ΓΙΑΝΝΙΤΣΩΝ",0,0]
["14-30442","ΑΝΤΩΝΟΠΟΥΛΟΥ ΠΗΝΕΛΟΠΗ","Σ.Φ.Α.ΜΕΛΙΣΣΙΩΝ Ο ΦΟΙΒΟΣ",0,0]
["14-30576","ΑΡΒΑΝΙΤΗ ΣΟΦΙΑ","Α.Ν.Ο.ΓΛΥΦΑΔΑΣ",0,0]
["14-32682","ΖΑΡΓΙΑΝΝΑΚΗ ΝΑΤΑΛΙΑ","Α.Ο.Α.ΗΛΙΟΥΠΟΛΗΣ",0,0]
["14-90129","ΙΓΚΝΙΑΤΟΒΙΤΣ ΑΝΙΑ","Σ.Α.ΓΑΛΑΤΣΙΟΥ",0,0]
["14-30677","ΚΑΛΑΝΤΖΗ ΝΕΚΤΑΡΙΑ","Ο.Α.ΜΑΓΝΗΣΙΑΣ",0,0]
["14-29687","ΚΑΣΣΑΡΗ ΜΕΛΙΝΑ","Σ.Φ.Α.ΜΕΛΙΣΣΙΩΝ Ο ΦΟΙΒΟΣ",0,0]
["14-31902","ΚΟΡΑΪΔΟΥ ΔΗΜΗΤΡΑ","Φ.Ο.Α.ΝΕΑΠΟΛΗΣ",0,0]
["14-31901","ΚΟΡΑΪΔΟΥ ΜΑΓΔΑΛΗΝΗ","Φ.Ο.Α.ΝΕΑΠΟΛΗΣ",0,0]
["14-26737","ΚΟΤΡΩΤΣΙΟΥ ΝΙΚΗ","Σ.Ο.Α.ΚΑΡΔΙΤΣΑΣ ΦΩΚΙΑΝΟΣ",0,0]
["14-32907","ΚΟΥΚΟΥΒΙΤΑΚΗ ΕΛΕΝΗ","ΑΙΟΛΟΣ Α.Λ.ΙΛΙΟΥ",0,0]
["14-26412","ΚΟΥΜΠΑΡΟΥ ΜΑΡΙΝΑ","Α.Ο.Α.ΠΡΩΤΑΘΛ.ΚΑΒΑΛΑΣ",0,0]
["14-32667","ΚΩΣΤΑ ΔΗΜΗΤΡΑ","Ο.Α.ΝΕΣΤΩΡΑΣ ΓΙΑΝΝΙΤΣΩΝ",0,0]
["14-34288","ΜΟΣΤΙΟΓΛΟΥ ΙΟΛΗ","Α.Σ.ΠΕΡΑ",0,0]
["14-31698","ΜΠΡΚΟΒΙΤΣ ΜΑΡΙΑ","ΑΙΟΛΟΣ Α.Λ.ΙΛΙΟΥ",0,0]
["14-28458","ΠΑΥΛΙΔΟΥ ΕΛΕΝΗ-ΜΑΡΙΑ","ΠΕΥΚΗ Γ.ΚΑΛΟΒΕΛΩΝΗΣ",0,0]
["14-34297","ΠΙΤΣΙΛΗ ΔΑΝΑΗ-ΣΩΣΑΝΑ","Α.Ο.Ν.Φ.ΑΤΤΑΛΟΣ",0,0]
["14-34317","ΦΩΤΗ ΦΩΤΕΙΝΗ","Α.Σ.ΑΚΑΔΗΜΙΕΣ ΠΡΩΤΑΘΛΗΤΩΝ ΠΕΥΚΩΝ",0,0]
["14-33448","ΧΑΪΖΙΝΧΑ ΣΕΛΙΝ","ΑΙΟΛΟΣ Α.Λ.ΙΛΙΟΥ",0,0]
["16-24938","ΑΥΓΕΡΗ ΑΣΠΑΣΙΑ","Α.Ο.Α.ΗΛΙΟΥΠΟΛΗΣ",1310,0]
["16-24422","ΧΡΙΣΤΟΦΗ ΕΛΕΝΗ","Α.Ο.Α.ΦΙΛΟΘΕΗΣ",1070,0]
["16-27381","ΣΟΛΔΑΤΟΥ ΘΕΟΔΩΡΑ","Ο.Α.ΠΕΤΡΟΥΠΟΛΗΣ",780,0]
["16-25287","ΜΠΟΤΣΑ ΠΑΡΑΣΚΕΥΗ","Α.Ο.Α.ΗΛΙΟΥΠΟΛΗΣ",704,0]
["16-25501","ΝΤΑΝΙΕΛΙΑΝΤΣ ΑΝΝΑ-ΜΑΡΙΑ","Ο.Α.ΦΟΙΒΟΣ ΛΑΡΙΣΑΣ",596,0]
["16-27688","ΝΙΚΟΛΟΠΟΥΛΟΥ ΝΑΤΑΛΙΑ","Α.Ο.ΒΟΥΛΙΑΓΜΕΝΗΣ",576,0]
["16-28387","ΚΑΡΒΟΥΝΗ ΒΑΣΙΛΙΚΗ","Α.Ο.Α.ΦΙΛΟΘΕΗΣ",540,0]
["16-27401","ΠΕΤΡΙΔΟΥ ΗΛΕΚΤΡΑ","Ο.Α.ΑΘΗΝΩΝ",536,0]
["16-22576","ΖΑΧΟΠΟΥΛΟΥ ΑΘΑΝΑΣΙΑ","Ο.Α.ΦΟΙΒΟΣ ΛΑΡΙΣΑΣ",522,0]
["16-30673","ΠΕΤΡΟΥΛΑ ΔΑΝΑΗ","Α.Π.Ο.ΣΑΝΝΥ ΣΠΟΡΤΣ ΚΛΑΜΠ",416,0]
["16-22833","ΑΔΑΛΟΓΛΟΥ ΜΑΓΔΑΛΗΝΗ","Ε.Σ.Ο.ΕΠΙΚΟΥΡΟΣ ΠΟΛΙΧΝΗΣ",410,0]
["16-26455","ΝΑΟΥΜ ΜΑΡΙΑ","Ο.Α.ΧΑΝΙΩΝ",352,0]
["16-25497","ΠΑΛΑΣΚΑ ΑΝΑΣΤΑΣΙΑ-ΜΑΡΙΑ","Ο.Α.ΜΑΓΝΗΣΙΑΣ",346,0]
["16-29315","ΠΟΤΣΗ ΜΑΡΙΑ","Ο.Α.ΑΘΗΝΩΝ",335,0]
["16-27054","ΛΟΥΚΟΓΙΩΡΓΑΚΗ ΝΙΚΗ","Ο.Α.ΠΕΤΡΟΥΠΟΛΗΣ",341,0]
["16-24335","ΚΑΦΦΕ ΖΩΗ","Ο.Α.ΝΙΚΑΙΑ ΛΑΡΙΣΑΣ",320,0]
["16-24142","ΔΕΜΕΝΕΓΑ ΔΑΦΝΗ","Α.Κ.Α.ΜΑΡΑΘΩΝΑ",316,0]
["16-25047","ΧΑΡΣΟΥΛΑ ΑΙΚΑΤΕΡΙΝΗ","Α.Ο.Α.ΣΤΑΥΡΟΥΠΟΛΗΣ ΙΦΙΤΟΣ",274,0]
["16-28631","ΓΡΙΒΑ ΒΑΡΒΑΡΑ","ΑΙΟΛΟΣ Α.Λ.ΙΛΙΟΥ",267,0]
["16-25641","ΤΣΕΚΟΥΡΑ ΚΩΝΣΤΑΝΤΙΝΑ","Α.Ο.Α.ΗΛΙΟΥΠΟΛΗΣ",262,0]
["16-26824","ΚΟΛΟΥΤΣΟΥ ΜΑΡΙΑ-ΕΥΑΓΓΕΛΙΑ","Α.Ο.Α.ΧΑΪΔΑΡΙΟΥ",254,0]
["16-25599","ΜΑΘΙΟΥΔΑΚΗ ΠΑΝΑΓΙΩΤΑ-ΕΛΕΝΗ","Ο.Α.ΧΑΝΙΩΝ",254,0]
["16-26107","ΑΝΤΩΝΑΚΗ ΕΜΜΑΝΟΥΕΛΑ","Α.Ο.Α.ΑΤΤΙΚΟΣ ΗΛΙΟΣ",250,0]
["16-26059","ΓΚΟΓΚΟΥ ΚΩΝΣΤΑΝΤΙΝΑ","Ο.Α.ΣΟΥΔΑΣ",242,0]
["16-26622","ΘΩΔΗ ΝΙΚΗ","Α.Γ.Ο.ΦΙΛΙΠΠΙΑΔΑΣ",233,0]
["16-25728","ΝΤΟΥΜΑ ΔΑΦΝΗ","Α.Ο.Α.ΦΙΛΟΘΕΗΣ",222,0]
["16-27857","ΚΟΚΚΙΝΑΚΗ ΕΥΑΓΓΕΛΙΑ","Ο.Α.ΧΑΝΙΩΝ",217,0]
["16-27858","ΚΟΚΚΙΝΑΚΗ ΕΥΓΕΝΙΑ","Ο.Α.ΧΑΝΙΩΝ",214,0]
["16-29616","ΝΙΚΟΛΑΚΟΠΟΥΛΟΥ ΜΑΡΙΑ","Ο.Α.ΠΕΤΡΟΥΠΟΛΗΣ",212,0]
["16-26506","ΜΑΓΚΛΑΡΑ ΣΤΑΥΡΟΥΛΑ","Α.Γ.Ο.ΦΙΛΙΠΠΙΑΔΑΣ",209,0]
["16-25091","ΜΑΡΚΑΚΗ ΜΑΡΓΑΡΙΤΑ","ΗΡΑΚΛΕΙΟ Ο.Α.& Α.",206,0]
["16-26308","ΜΑΛΑΜΟΥ ΜΑΡΙΑ","Ο.Α.ΙΩΑΝΝΙΝΩΝ",202,0]
["16-25973","ΤΣΙΑΡΑ ΙΩΑΝΝΑ","Ο.Α.ΠΕΤΡΟΥΠΟΛΗΣ",188,0]
["16-90069","ΜΤΣΕΝΤΛΙΤΖΕ ΕΛΕΝΗ","Α.Ο.Α.ΣΤΑΥΡΟΥΠΟΛΗΣ ΙΦΙΤΟΣ",185,0]
["16-28007","ΚΑΪΡΗ ΗΛΕΚΤΡΑ","Ο.Α.ΑΘΗΝΩΝ",181,0]
["16-26307","ΜΑΛΑΜΟΥ ΚΡΙΝΑ","Ο.Α.ΙΩΑΝΝΙΝΩΝ",178,0]
["16-25299","ΣΩΤΗΡΟΠΟΥΛΟΥ ΡΕΓΓΙΝΑ","Ο.Α.ΑΘΗΝΩΝ",176,0]
["16-28936","ΕΥΘΥΜΙΑΔΟΥ ΜΑΓΔΑΛΗΝΗ","Ο.Α.ΙΩΛΚΟΣ ΒΟΛΟΥ",174,0]
["16-24169","ΛΑΘΟΥΡΗ ΙΩΑΝΝΑ","Α.Ο.ΑΡΓΥΡΟΥΠΟΛΗΣ",172,0]
["16-28104","ΠΑΠΑΔΗΜΗΤΡΙΟΥ ΑΘΑΝΑΣΙΑ","Ο.Α.ΠΕΤΡΟΥΠΟΛΗΣ",172,0]
["16-28094","ΓΚΟΓΚΟΥ ΕΛΕΥΘΕΡΙΑ","Ο.Α.ΣΟΥΔΑΣ",169,0]
["16-26982","ΚΑΝΕΛΛΟΠΟΥΛΟΥ ΜΑΡΙΛΗ","Α.Ο.ΤΑΤΟΪΟΥ",169,0]
["16-25833","ΤΖΙΑΝΗ ΟΥΡΑΝΙΑ","Ο.Α.ΜΑΓΝΗΣΙΑΣ",168,0]
["16-28170","ΤΣΕΛΟΥ ΑΘΑΝΑΣΙΑ","Α.Ο.Α.ΠΑΠΑΓΟΥ",166,0]
["16-28284","ΓΚΟΥΣΚΟΥ ΚΑΛΛΙΟΠΗ","Α.Ο.Α.ΦΙΛΟΘΕΗΣ",163,0]
["16-24977","ΜΑΔΕΝΛΙΔΟΥ ΕΛΕΝΗ","Ο.Α.ΒΙΚΕΛΑΣ ΒΕΡΟΙΑΣ",158,0]
["16-31211","ΑΝΤΩΝΙΟΥ-ΚΑΡΑΔΕΜΗΤΡΟΥ ΝΙΚΟΛΕΤΑ","Ο.Α.ΒΟΛΟΥ",155,0]
["16-27014","ΤΖΑΝΟΠΟΥΛΟΥ ΑΦΡΟΔΙΤΗ","Γ.Ο.ΠΕΡΙΣΤΕΡΙΟΥ Γ.ΠΑΛΑΣΚΑΣ",154,0]
["16-24764","ΣΤΑΜΑΤΙΑΔΟΥ ΕΛΕΝΑ","Ο.Α.ΘΕΣΣΑΛΟΝΙΚΗΣ",152,0]
["16-27016","ΓΕΩΡΓΟΠΟΥΛΟΥ ΑΝΑΣΤΑΣΙΑ","Ο.Α.ΠΕΤΡΟΥΠΟΛΗΣ",148,0]
["16-26489","ΠΟΔΑΡΑ ΙΩΑΝΝΑ-ΜΑΡΙΑ","Α.Ο.Α.ΗΛΙΟΥΠΟΛΗΣ",146,0]
["16-27657","ΝΑΣΙΟΠΟΥΛΟΥ ΑΓΓΕΛΙΚΗ","Ο.Α.ΑΘΗΝΩΝ",144,0]
["16-25517","ΧΑΤΖΗ ΚΩΝΣΤΑΝΤΙΝΑ","Ο.Α.ΧΑΛΚΙΔΑΣ",140,0]
["16-28404","ΚΑΜΠΙΩΤΗ ΑΘΗΝΑ","ΖΑΚΥΝΘΙΝΟΣ Α.Ο.Α",139,0]
["16-28092","ΚΑΡΠΟΥΖΗ ΟΛΥΜΠΙΑ","Α.Ο.Α.ΑΤΤΙΚΟΣ ΗΛΙΟΣ",138,0]
["16-25137","ΚΡΟΥΣΤΑΛΑΚΗ ΑΣΠΑΣΙΑ","ΗΡΑΚΛΕΙΟ Ο.Α.& Α.",130,0]
["16-25972","ΤΣΙΑΡΑ ΕΥΘΥΜΙΑ","Ο.Α.ΠΕΤΡΟΥΠΟΛΗΣ",130,0]
["16-29449","ΔΑΛΙΑΝΗ ΔΗΜΗΤΡΑ","Α.Ο.Α.ΗΛΙΟΥΠΟΛΗΣ",126,0]
["16-29038","ΓΑΚΗ ΕΛΕΝΑ","Ο.Α.ΠΕΤΡΟΥΠΟΛΗΣ",125,0]
["16-28386","ΖΟΥΡΙΔΗ ΕΛΕΝΗ","Α.Π.Ο.ΣΑΝΝΥ ΣΠΟΡΤΣ ΚΛΑΜΠ",123,0]
["16-25681","ΑΓΓΕΛΑΤΟΥ-ΡΑΦΤΟΠΟΥΛΟΥ ΑΝΑΣΤΑΣΙΑ","Α.Ο.Α.ΗΛΙΟΥΠΟΛΗΣ",119,0]
["16-30184","ΣΑΛΛΗ ΣΤΑΜΑΤΙΝΑ-ΜΑΡΙΑ","Ο.Α.ΧΑΛΚΙΔΑΣ",117,0]
["16-22707","ΠΑΠΑΚΑΝΕΛΛΟΥ ΤΑΤΙΑΝΑ","Ο.Α.ΓΛΥΦΑΔΑΣ",116,0]
["16-29942","ΑΛΦΑΝΤΗ ΑΝΑΣΤΑΣΙΑ","Ο.Α.ΠΕΤΡΟΥΠΟΛΗΣ",114,0]
["16-26696","ΔΙΓΑΛΑΚΗ ΚΟΡΙΝΑ","Ο.Α.ΧΑΝΙΩΝ",114,0]
["16-29589","ΤΣΕΡΕΓΚΟΥΝΗ ΑΝΑΣΤΑΣΙΑ-ΑΓΑΘΗ","Α.Ο.Α.ΠΑΠΑΓΟΥ",113,0]
["16-27408","ΤΣΑΓΚΑΡΑΚΗ ΑΘΗΝΑ","ΗΡΑΚΛΕΙΟ Ο.Α.& Α.",111,0]
["16-24871","ΑΡΒΑΝΙΤΗ ΑΙΚΑΤΕΡΙΝΗ","Ο.Α.ΚΟΡΙΝΘΟΥ",110,0]
["16-27472","ΚΑΣΣΙΔΟΥ ΧΑΡΙΚΛΕΙΑ","Ο.Α.ΓΙΑΝΝΙΤΣΩΝ",109,0]
["16-28937","ΑΝΤΩΝΙΟΥ ΘΕΟΔΩΡΑ","Ο.Α.ΜΑΓΝΗΣΙΑΣ",104,0]
["16-27840","ΤΟΠΟΥΖΙΔΟΥ ΕΛΕΝΗ","Ο.Α.ΕΥΟΣΜΟΥ ΘΕΣΣΑΛΟΝΙΚΗΣ",104,0]
["16-27702","ΚΑΜΠΑΝΤΑΗ ΕΛΕΝΗ","Α.Σ.ΠΕΡΑ",103,0]
["16-27674","ΔΡΥΜΑΛΙΤΗ ΚΥΡΙΑΚΗ","Α.Ο.Α.ΠΑΠΑΓΟΥ",96,0]
["16-28279","ΖΕΡΒΑ ΕΥΘΑΛΙΑ","Ο.Α.ΤΟΥΜΠΑΣ",96,0]
["16-29201","ΚΙΖΙΡΑΚΟΥ ΔΗΜΗΤΡΑ","Ο.Α.ΑΘΗΝΩΝ",96,0]
["16-29223","ΜΕΤΑΞΟΠΟΥΛΟΥ ΣΤΕΦΑΝΙΑ-ΕΛΕΝΑ","Σ.Α.ΡΑΦΗΝΑΣ",96,0]
["16-32719","ΖΑΡΑΡΗ ΚΥΡΙΑΚΗ","ΡΟΔΙΑΚΟΣ Ο.Α.",94,0]
["16-26602","ΜΑΝΑΟΥ-ΓΙΑΝΝΟΥΣΗ ΑΛΚΥΟΝΗ-ΜΑΡΙΑ","Ο.Α.ΦΟΙΒΟΣ ΛΑΡΙΣΑΣ",93,0]
["16-25992","ΤΟΥΛΗ ΕΥΑΓΓΕΛΙΑ-ΖΑΧΑΡΟΥΛΑ","Ο.Α.ΕΥΟΣΜΟΥ ΘΕΣΣΑΛΟΝΙΚΗΣ",93,0]
["16-28070","ΜΑΡΝΕΛΛΟΥ ΜΑΡΙΑ","ΗΡΑΚΛΕΙΟ Ο.Α.& Α.",92,0]
["16-29695","ΜΕΤΑΞΑ ΚΛΕΙΩ","Α.Σ.ΚΟΛΛΕΓΙΟΥ ΝΤΕΡΗ",92,0]
["16-28466","ΑΣΗΜΑΚΗ ΜΑΡΙΝΑ","Ο.Α.ΑΘΛΗΤ.ΠΑΙΔΕΙΑ",90,0]
["16-27416","ΤΟΛΗ ΚΛΕΙΩ-ΝΙΚΟΛΕΤΑ","Α.Ο.ΒΑΡΗΣ ΑΝΑΓΥΡΟΥΣ",88,0]
["16-29694","ΜΕΤΑΞΑ ΔΙΟΝΥΣΙΑ-ΜΥΡΤΩ","Α.Σ.ΚΟΛΛΕΓΙΟΥ ΝΤΕΡΗ",85,0]
["16-25028","ΣΙΓΑΛΑ ΑΘΗΝΑ","Α.Ο.Π.ΦΑΛΗΡΟΥ",84,0]
["16-28935","ΤΖΙΦΑ-ΚΡΑΤΗΡΑ ΖΩΗ","Ο.Α.ΜΑΓΝΗΣΙΑΣ",82,0]
["16-28780","ΚΑΛΑΤΖΗ ΜΑΡΙΛΕΝΑ","Α.Ο.Α.ΗΛΙΟΥΠΟΛΗΣ",80,0]
["16-28995","ΜΠΟΜΠΟΛΑΚΗ ΙΩΑΝΝΑ","Γ.Ο.ΠΕΡΙΣΤΕΡΙΟΥ Γ.ΠΑΛΑΣΚΑΣ",79,0]
["16-28674","ΣΠΥΡΟΠΟΥΛΟΥ ΒΑΣΙΛΕΙΑ","Α.Ο.Α.ΦΙΛΟΘΕΗΣ",79,0]
["16-29208","ΣΤΑΜΟΥΛΗ ΦΡΕΙΔΕΡΙΚΗ","Ο.Α.ΜΑΓΝΗΣΙΑΣ",78,0]
["16-29710","ΚΥΡΙΑΚΟΠΟΥΛΟΥ ΘΕΟΔΩΡΑ-ΖΩΗ","ΡΟΔΙΑΚΟΣ Ο.Α.",76,0]
["16-32227","ΣΚΑΝΔΑΛΗ ΠΑΝΑΓΙΩΤΑ-ΡΑΦΑΗΛΙΑ","ΑΚΑΔ.ΑΝΤΙΣΦ.ΙΩΑΝΝΙΝΩΝ",76,0]
["16-24980","ΔΑΜΙΑΝΙΔΟΥ ΜΑΡΙΑΝΝΑ","Ο.Α.ΒΙΚΕΛΑΣ ΒΕΡΟΙΑΣ",74,0]
["16-30033","ΜΑΜΑΗ ΕΒΕΛΙΝΑ","Α.Μ.Ε.Σ.Ν.ΕΡΥΘΡΑΙΑΣ",74,0]
["16-25624","ΞΗΡΟΓΙΑΝΝΗ ΣΤΑΜΑΤΙΑ","Ο.Α.ΧΑΝΙΩΝ",74,0]
["16-30045","ΣΙΑ ΕΛΕΝΗ","Ο.Α.ΤΟΥΜΠΑΣ",72,0]
["16-29136","ΠΑΠΑΔΟΠΟΥΛΟΥ ΔΑΝΑΗ","Α.Ο.Α.ΣΤΑΥΡΟΥΠΟΛΗΣ ΙΦΙΤΟΣ",70,0]
["16-28341","ΜΙΧΑΗΛΙΔΟΥ ΚΩΝΣΤΑΝΤΙΝΑ","Ο.Α.ΕΥΟΣΜΟΥ ΘΕΣΣΑΛΟΝΙΚΗΣ",69,0]
["16-28813","ΓΡΙΝΕΖΟΥ ΣΟΦΙΑ-ΕΥΘΥΜΙΑ","ΡΗΓΑΣ Α.Ο.Α.ΑΡΓΟΛΙΔΑΣ",68,0]
["16-29194","ΚΑΡΑΒΑ ΖΩΗ","Ο.Α.ΤΟΥΜΠΑΣ",68,0]
["16-28686","ΚΑΡΒΟΥΝΑ ΜΑΡΙΑΝΝΑ","Γ.Ο.ΠΕΡΙΣΤΕΡΙΟΥ Γ.ΠΑΛΑΣΚΑΣ",67,0]
["16-30709","ΣΜΥΡΛΟΓΛΟΥ ΧΡΙΣΤΙΝΑ-ΙΩΑΝΝΑ","Σ.Α.ΡΑΦΗΝΑΣ",67,0]
["16-22532","ΤΕΖΑΨΙΔΟΥ ΜΑΡΙΑ-ΡΑΦΑΕΛΛΑ","Μ.Α.Σ.ΑΕΤΟΣ ΘΕΣΣΑΛΟΝΙΚΗΣ",66,0]
["16-29887","ΚΟΤΡΙΔΟΥ ΜΑΡΙΑ","Α.Σ.ΤΕΝΙΣ ΚΛΑΜΠ ΚΟΖΑΝΗΣ",65,0]
["16-29764","ΖΩΓΡΑΦΟΥ ΕΛΕΝΗ","Α.Ο.Α.ΧΑΪΔΑΡΙΟΥ",64,0]
["16-26463","ΛΟΓΟΘΕΤΙΔΟΥ ΜΑΡΙΑ","Σ.Α.ΣΕΡΡΩΝ",64,0]
["16-27030","ΠΕΡΔΙΚΟΥΡΗ ΜΑΡΙΑ","Ο.Α.ΣΑΛΑΜΙΝΑΣ",64,0]
["16-26831","ΜΑΝΟΥΡΗ ΜΑΡΙΑ","Γ.Ο.ΠΕΡΙΣΤΕΡΙΟΥ Γ.ΠΑΛΑΣΚΑΣ",63,0]
["16-28137","ΧΑΤΖΗΣΤΟΥΓΙΑΝΝΗ ΣΟΦΙΑ-ΜΑΡΙΑ","Σ.Α.ΣΕΡΡΩΝ",62,0]
["16-29089","ΑΡΒΑΝΙΤΟΠΟΥΛΟΥ ΒΑΣΙΛΙΚΗ","Α.Ο.Α.ΠΑΤΡΩΝ",59,0]
["16-32095","ΒΛΑΧΟΠΟΥΛΟΥ ΑΝΑΣΤΑΣΙΑ","ΚΕΡΚΥΡΑΪΚΗ Λ.Τ.",58,0]
["16-29210","ΑΓΙΩΤΗ ΕΛΕΝΗ","Ο.Α.ΜΑΓΝΗΣΙΑΣ",58,0]
["16-28455","ΑΝΔΡΕΟΠΟΥΛΟΥ ΝΕΦΕΛΗ","Α.Ο.Α.ΠΑΠΑΓΟΥ",56,0]
["16-24411","ΚΟΡΡΕ ΜΑΡΙΑ","Α.Κ.Α.ΜΑΡΑΘΩΝΑ",56,0]
["16-27017","ΜΠΕΛΤΖΕΝΙΤΗ ΜΑΡΙΑ","Ο.Α.ΠΕΤΡΟΥΠΟΛΗΣ",54,0]
["16-28523","ΤΡΙΑΝΤΑΦΥΛΙΔΟΥ-ΚΟΥΛΟΥΡΙΩΤΟΥ ΚΑΛΛΙΟΠΗ","Ε.Σ.Ο.ΕΠΙΚΟΥΡΟΣ ΠΟΛΙΧΝΗΣ",53,0]
["16-30158","ΧΕΛΙΔΩΝΗ ΚΑΛΛΙΟΠΗ","ΗΡΑΚΛΕΙΟ Ο.Α.& Α.",53,0]
["16-27414","ΔΕΤΣΗ ΜΑΡΙΑΝ","Α.Ο.ΒΑΡΗΣ ΑΝΑΓΥΡΟΥΣ",52,0]
["16-28761","ΔΟΪΡΑΝΛΗ ΦΑΝΗ","Α.Ο.Α.ΣΤΑΥΡΟΥΠΟΛΗΣ ΙΦΙΤΟΣ",52,0]
["16-22533","ΤΕΖΑΨΙΔΟΥ ΔΗΜΗΤΡΑ","Μ.Α.Σ.ΑΕΤΟΣ ΘΕΣΣΑΛΟΝΙΚΗΣ",52,0]
["16-27349","ΤΖΙΑΡΛΗ ΔΗΜΗΤΡΑ","Ο.Α.ΕΥΟΣΜΟΥ ΘΕΣΣΑΛΟΝΙΚΗΣ",49,0]
["16-28699","ΒΡΥΩΝΗ ΒΑΣΙΛΙΚΗ","Ο.Α.ΚΑΛΑΜΑΤΑΣ",48,0]
["16-27665","ΚΑΒΑΓΙΟΥ ΒΑΛΕΝΤΙΝΗ","Ο.Α.ΚΕΡΑΤΣΙΝΙΟΥ",48,0]
["16-22546","ΑΝΤΩΝΙΟΥ ΑΝΑΣΤΑΣΙΑ","Α.Ε.Κ.ΤΡΙΠΟΛΗΣ",47,0]
["16-29250","ΓΙΤΣΟΠΟΥΛΟΥ ΜΑΡΙΑ-ΕΛΕΝΗ","Ο.Α.ΦΟΙΒΟΣ ΛΑΡΙΣΑΣ",47,0]
["16-28088","ΜΠΑΡΜΠΑΡΗ ΑΡΙΣΤΕΑ","Α.Κ.Α.ΜΑΡΑΘΩΝΑ",47,0]
["16-26298","ΝΑΤΣΗ ΚΩΝΣΤΑΝΤΙΝΑ","Σ.Α.ΡΑΦΗΝΑΣ",46,0]
["16-32365","ΣΤΑΥΡΑΚΗ ΚΩΝΣΤΑΝΤΙΝΑ","Α.Ο.ΒΑΡΗΣ ΑΝΑΓΥΡΟΥΣ",46,0]
["16-25359","ΚΑΡΒΟΥΝΗ ΧΑΡΑΛΑΜΠΙΑ","Ο.Α.ΛΙΒΑΔΕΙΑΣ",45,0]
["16-23605","ΤΑΣΗ ΟΡΣΑΛΙΑ","Α.Ο.Α.ΑΙΓΑΛΕΩ 92",44,0]
["16-29590","ΧΑΛΑΡΗ ΑΝΝΑ","Σ.Α.ΡΑΦΗΝΑΣ",44,0]
["16-31348","ΧΡΙΣΤΟΠΟΥΛΟΥ ΧΡΙΣΤΙΝΑ","ΡΗΓΑΣ Α.Ο.Α.ΑΡΓΟΛΙΔΑΣ",42,0]
["16-28420","ΣΙΑΪΝΗ ΑΘΑΝΑΣΙΑ","Σ.Α.ΡΑΦΗΝΑΣ",41,0]
["16-29137","ΠΑΠΑΔΟΠΟΥΛΟΥ ΕΛΕΥΘΕΡΙΑ","Ο.Α.ΕΥΟΣΜΟΥ ΘΕΣΣΑΛΟΝΙΚΗΣ",40,0]
["16-26058","ΖΟΥΜΠΑ ΔΕΣΠΟΙΝΑ","Ο.Α.ΣΟΥΔΑΣ",38,0]
["16-27599","ΛΟΓΑΡΙΔΟΥ ΑΡΙΑΔΝΗ","Α.Ε.ΠΟΡΤΟ ΡΑΦΤΗ",38,0]
["16-26658","ΜΑΓΕΙΡΟΠΟΥΛΟΥ ΑΘΗΝΑ-ΛΥΔΙΑ","Α.Ο.Α.ΠΑΤΡΩΝ",38,0]
["16-28454","ΜΑΥΡΙΑΝΟΥ ΧΡΙΣΤΙΝΑ","Α.Ο.Α.ΠΑΠΑΓΟΥ",37,0]
["16-30390","ΝΙΚΟΛΑΪΔΟΥ ΕΛΕΝΗ","Φ.Ο.Α.ΝΕΑΠΟΛΗΣ",37,0]
["16-26160","ΒΙΡΒΙΔΑΚΗ ΧΡΥΣΟΥΛΑ","Α.Ο.Α.ΠΑΠΑΓΟΥ",36,0]
["16-29186","ΓΕΡΟΥΣΗ ΑΛΕΞΑΝΔΡΑ","Α.Ο.Α.ΣΤΑΥΡΟΥΠΟΛΗΣ ΙΦΙΤΟΣ",36,0]
["16-25733","ΚΑΛΟΥΤΣΙΚΙΔΟΥ ΧΡΥΣΗ","Ο.Α.ΤΟΥΜΠΑΣ",30,0]
["16-27505","ΚΑΜΠΟΣΙΩΡΑ ΚΩΝΣΤΑΝΤΙΝΑ","Α.Ε.Τ.ΝΙΚΗ ΠΑΤΡΩΝ",30,0]
["16-28956","ΠΑΝΗ ΒΑΣΙΛΙΚΗ","Ο.Α.ΙΩΛΚΟΣ ΒΟΛΟΥ",36,0]
["16-28687","ΠΑΛΛΗ ΧΡΙΣΤΙΝΑ","Γ.Ο.ΠΕΡΙΣΤΕΡΙΟΥ Γ.ΠΑΛΑΣΚΑΣ",35,0]
["16-32328","ΑΝΤΩΝΙΑΔΟΥ-ΣΑΜΑΡΤΖΙΔΟΥ ΣΟΦΙΑ-ΜΑΡΤΙΝΑ","Ο.Α.ΤΟΥΜΠΑΣ",34,0]
["16-28991","ΚΑΡΑΜΑΝΛΗ ΜΑΡΙΑ","Ο.Α.ΙΩΛΚΟΣ ΒΟΛΟΥ",34,0]
["16-28136","ΚΙΜΟΓΛΟΥ ΜΑΡΙΑ-ΑΝΝΑ","Σ.Α.ΣΕΡΡΩΝ",33,0]
["16-29604","ΔΡΟΥΓΚΑ ΕΛΕΥΘΕΡΙΑ","Α.Ο.Α.ΠΑΠΑΓΟΥ",33,0]
["16-28593","ΜΑΓΓΙΝΑ ΔΗΜΗΤΡΑ","Α.Κ.Α.ΜΑΡΑΘΩΝΑ",33,0]
["16-31330","ΧΡΗΣΤΟΥ ΚΩΝΣΤΑΝΤΙΝΑ","Ο.Α.ΙΩΛΚΟΣ ΒΟΛΟΥ",33,0]
["16-32400","ΔΡΑΚΟΥ ΑΝΔΡΙΑΝΝΑ","Α.Ο.ΒΑΡΗΣ ΑΝΑΓΥΡΟΥΣ",32,0]
["16-26817","ΛΟΥΠΑ ΣΤΕΛΛΑ","Α.Ο.Π.ΦΑΛΗΡΟΥ",32,0]
["16-25783","ΜΠΟΥΡΤΣΟΥΚΛΗ ΠΑΝΑΓΙΩΤΑ-ΡΑΦΑΗΛΙΑ","Α.Ε.Κ.ΤΡΙΠΟΛΗΣ",30,0]
["16-32876","ΜΟΡΣΙ ΡΑΝΙΑ","Ο.Α.ΚΑΙΣΑΡΙΑΝΗΣ",24,0]
["16-25883","ΤΡΟΥΓΚΟΥ ΚΛΕΙΩ","Α.Ο.Α.ΠΑΠΑΓΟΥ",30,0]
["16-31407","ΚΑΜΠΟΥΡΗ ΓΡΑΜΜΑΤΙΚΗ","ΡΟΔΙΑΚΟΣ Ο.Α.",29,0]
["16-31870","ΝΤΟΥΡΟΥ ΔΟΜΝΙΚΗ","ΡΗΓΑΣ Α.Ο.Α.ΑΡΓΟΛΙΔΑΣ",29,0]
["16-29807","ΠΑΠΑΔΟΠΟΥΛΟΥ ΙΩΑΝΝΑ","Ο.Α.ΓΛΥΦΑΔΑΣ",29,0]
["16-27060","ΚΟΛΛΙΟΥ ΜΑΡΙΑ","Ο.Α.ΑΓΙΑΣ ΠΑΡΑΣΚΕΥΗΣ",28,0]
["16-30990","ΓΚΙΘΚΟΠΟΥΛΟΥ ΕΛΕΝΗ","Ο.Α.ΚΑΛΑΜΑΚΙΟΥ",27,0]
["16-32007","ΚΑΛΟΥΜΕΝΟΥ ΜΑΡΙΑ-ΘΗΡΕΣΙΑ","Α.Κ.Α.ΜΑΡΑΘΩΝΑ",27,0]
["16-26529","ΣΑΠΟΥΝΤΖΗ ΠΑΣΧΑΛΙΝΑ","Ο.Α.ΑΡΙΔΑΙΑΣ",27,0]
["16-32570","ΣΤΕΡΓΙΟΠΟΥΛΟΥ ΖΩΗ","Ο.Α.ΑΓΙΑΣ ΠΑΡΑΣΚΕΥΗΣ",27,0]
["16-31347","ΜΗΤΣΑΝΟΥ ΚΩΝΣΤΑΝΤΙΝΑ","ΡΗΓΑΣ Α.Ο.Α.ΑΡΓΟΛΙΔΑΣ",26,0]
["16-26219","ΚΩΣΤΑ ΑΓΓΕΛΙΚΗ","ΚΕΦΑΛΛΗΝΙΑΚΟΣ Ο.Α.",25,0]
["16-33511","ΣΤΑΘΗ ΣΤΥΛΙΑΝΗ","Ε.Α.Σ.ΟΛΥΜΠΙΑΔΑ",25,0]
["16-26568","ΜΟΥΡΤΖΙΟΥ ΜΑΡΙΑ-ΑΝΝΑ","Α.Ο.ΚΑΒΑΛΑΣ ΜΑΚΕΔΟΝΙΚΟΣ",24,0]
["16-26717","ΓΕΡΑΚΙΝΗ ΙΩΑΝΝΑ-ΣΜΑΡΩ","Α.Ο.ΚΑΒΑΛΑΣ ΜΑΚΕΔΟΝΙΚΟΣ",23,0]
["16-31104","ΑΣΤΡΕΙΝΙΔΗ ΑΛΕΞΑΝΔΡΑ","Α.Ο.Α.ΠΑΠΑΓΟΥ",22,0]
["16-29706","ΚΑΡΑΓΕΩΡΓΟΥ ΜΑΡΙΑ","Ο.Α.ΑΡΤΑΣ",21,0]
["16-30932","ΑΜΠΑΤΖΙΔΗ ΝΑΤΑΛΙΑ","Α.Ο.ΛΑΤΩ ΑΓ.ΝΙΚΟΛΑΟΥ",20,0]
["16-28673","ΒΕΡΓΟΥ ΣΤΑΥΡΟΥΛΑ","Α.Ο.Α.ΠΑΠΑΓΟΥ",20,0]
["16-28328","ΕΥΜΟΡΦΙΔΟΥ ΘΕΟΔΟΤΑ","Ο.Α.ΝΕΣΤΩΡΑΣ ΓΙΑΝΝΙΤΣΩΝ",20,0]
["16-29731","ΚΩΝΣΤΑΝΤΟΠΟΥΛΟΥ ΗΛΙΑΝΑ","ΑΙΟΛΟΣ Α.Λ.ΙΛΙΟΥ",20,0]
["16-32710","ΜΟΥΡΤΖΑΚΗ ΧΑΡΙΚΛΕΙΑ","Ο.Α.ΧΕΡΣΟΝΗΣΟΥ",20,0]
["16-28816","ΒΛΑΧΟΥΤΣΗ ΠΕΤΡΟΥΛΑ","ΡΗΓΑΣ Α.Ο.Α.ΑΡΓΟΛΙΔΑΣ",19,0]
["16-30352","ΓΕΩΡΓΟΥΣΗ ΠΑΝΑΓΙΩΤΑ","ΦΙΛΑΘΛΗΤ.ΣΥΛ.ΛΑΜΙΑΣ",19,0]
["16-30043","ΔΟΥΡΟΥ ΑΝΑΣΤΑΣΙΑ","Ο.Α.ΤΟΥΜΠΑΣ",19,0]
["16-34428","ΝΟΥΛΑ ΣΟΦΙΑ","Γ.Ε.ΠΡΕΒΕΖΑΣ",19,0]
["16-29536","ΧΑΪΔΗ ΜΑΡΙΝΑ-ΚΩΝΣΤΑΝΤΙΝΑ","ΦΘΙΩΤΙΚΟΣ Ο.Α.",18,0]
["16-32471","ΓΙΑΝΝΟΠΟΥΛΟΥ ΦΩΤΕΙΝΗ","Γ.Ο.ΠΕΡΙΣΤΕΡΙΟΥ Γ.ΠΑΛΑΣΚΑΣ",18,0]
["16-28452","ΜΑΡΤΑΚΟΥ-ΓΑΛΙΑΤΣΑΤΟΥ ΚΑΤΕΡΙΝΑ","Α.Ο.Α.ΠΑΠΑΓΟΥ",18,0]
["16-32366","ΦΡΑΓΚΙΣΤΑ ΙΖΑΜΠΕΛΛΑ","Α.Ο.ΜΕΓΑΣ ΑΛΕΞΑΝΔΡΟΣ",18,0]
["16-30903","ΑΣΗΜΟΠΟΥΛΟΥ ΑΙΚΑΤΕΡΙΝΗ","Α.Σ.Α.ΠΑΝΟΡΑΜΑΤΟΣ",17,0]
["16-29858","ΔΑΝΙΗΛ ΑΡΓΥΡΩ","ΦΘΙΩΤΙΚΟΣ Ο.Α.",17,0]
["16-29296","ΛΑΜΠΡΟΥ ΕΛΕΝΗ","Α.Ο.ΜΕΓΑΣ ΑΛΕΞΑΝΔΡΟΣ",17,0]
["16-30117","ΜΠΑΖΟΥ ΕΥΑΓΓΕΛΙΑ","ΝΑΥΠΛΙΑΚΟΣ Ο.Α.",17,0]
["16-33447","ΤΣΕΣΜΕΤΖΗ ΜΑΡΙΑΝΘΗ","Ο.Α.ΛΕΣΒΟΥ",17,0]
["16-28397","ΧΑΤΖΗΚΥΡΙΑΚΟΥ ΙΩΑΝΝΑ","Ο.Α.ΑΡΙΔΑΙΑΣ",17,0]
["16-32473","ΑΓΓΕΛΟΠΟΥΛΟΥ ΧΡΙΣΤΙΝΑ-ΠΑΡΑΣΚΕΥΗ","Γ.Ο.ΠΕΡΙΣΤΕΡΙΟΥ Γ.ΠΑΛΑΣΚΑΣ",15,0]
["16-29464","ΖΑΓΑΡΗ ΦΡΕΙΔΕΡΙΚΗ","Ο.Α.ΒΙΚΕΛΑΣ ΒΕΡΟΙΑΣ",15,0]
["16-27043","ΚΑΡΑΒΙΩΤΗ ΑΘΗΝΑ","Ο.Α.ΤΟΥΜΠΑΣ",14,0]
["16-28476","ΚΑΡΑΒΑΝΑ ΙΩΑΝΝΑ","Α.Ο.ΒΑΡΗΣ ΑΝΑΓΥΡΟΥΣ",13,0]
["16-29497","ΔΕΜΕΛΙΔΗ ΑΝΑΣΤΑΣΙΑ","Α.Ο.ΒΑΡΗΣ ΑΝΑΓΥΡΟΥΣ",12,0]
["16-22813","ΚΩΝΣΤΑΝΤΑΚΗ ΙΩΑΝΝΑ","Γ.Σ.ΛΙΒΥΚΟΣ ΙΕΡΑΠΕΤΡΑΣ",12,0]
["16-29732","ΚΩΝΣΤΑΝΤΟΠΟΥΛΟΥ ΓΕΩΡΓΙΑ","ΑΙΟΛΟΣ Α.Λ.ΙΛΙΟΥ",11,0]
["16-29531","ΓΚΑΜΠΑΕΡΙΔΟΥ ΑΝΝΑ-ΜΑΡΙΑ","Ο.Α.ΑΛΕΞΑΝΔΡΟΥΠΟΛΗΣ",10,0]
["16-28622","ΛΙΑΝΙΔΟΥ ΑΝΤΩΝΙΑ","Ο.Α.ΒΙΚΕΛΑΣ ΒΕΡΟΙΑΣ",10,0]
["16-24601","ΜΙΧΑΗΛΑΚΗ ΛΟΥΙΖΑ-ΑΝΑΤΟΛΗ","Α.Ο.Α.ΝΕΑΣ ΠΕΡΑΜΟΥ ΟΙ ΤΙΤΑΝΕΣ",10,0]
["16-26449","ΠΑΠΑΝΙΚΟΛΑΟΥ ΔΗΜΗΤΡΑ","Ο.Α.ΑΝΑΤΟΛΙΚΗΣ ΦΘΙΩΤΙΔΑΣ",10,0]
["16-33714","ΣΠΥΡΑΚΟΥ ΣΠΥΡΙΔΟΥΛΑ","ΑΙΟΛΟΣ Α.Λ.ΙΛΙΟΥ",10,0]
["16-33629","ΣΥΡΙΝΟΓΛΟΥ ΚΑΛΛΙΡΟΗ","Α.Α.ΑΙΓΑΛΕΩ",10,0]
["16-30891","ΤΑΒΛΑ ΕΛΕΝΗ","Α.Ο.ΛΑΤΩ ΑΓ.ΝΙΚΟΛΑΟΥ",10,0]
["16-30146","ΓΚΕΚΑ ΒΑΣΙΛΙΚΗ","Α.Ε.Κ.ΤΡΙΠΟΛΗΣ",9,0]
["16-29863","ΛΑΝΤΖΗ ΛΟΥΙΖΑ","Ο.Α.ΓΛΥΦΑΔΑΣ",9,0]
["16-29442","ΜΑΚΡΥΝΑΚΗ ΜΕΛΙΝΑ","Α.Κ.Α.ΜΑΡΑΘΩΝΑ",9,0]
["16-31371","ΣΚΟΥΤΕΛΗ ΣΕΡΑΦΕΙΝΑ","ΡΟΔΙΑΚΗ ΑΚΑΔ.ΑΝΤΙΣΦ.",9,0]
["16-29461","ΧΑΪΖΙΝΧΑ ΕΛΙΖΑ","ΑΙΟΛΟΣ Α.Λ.ΙΛΙΟΥ",6,0]
["16-34563","ΒΕΛΙΣΣΑΡΗ ΜΕΛΠΟΜΕΝΗ","Σ.Α.ΤΡΙΠΟΛΗΣ",8,0]
["16-28655","ΓΙΑΚΟΥΜΑΚΗ ΑΦΡΟΔΙΤΗ","Ο.Α.ΡΕΘΥΜΝΟΥ",8,0]
["16-29333","ΚΑΖΑΜΙΑ ΚΑΤΕΡΙΝΑ","Α.Ο.Α.ΣΤΑΥΡΟΥΠΟΛΗΣ ΙΦΙΤΟΣ",8,0]
["16-26208","ΚΑΣΙΟΥΡΑ ΓΕΩΡΓΙΑ-ΝΕΦΕΛΗ","Γ.Σ.ΚΗΦΙΣΙΑΣ",8,0]
["16-31121","ΚΟΥΜΠΑΤΗ ΚΩΝΣΤΑΝΤΙΝΑ","Ε.Α.Σ.ΟΛΥΜΠΙΑΔΑ",8,0]
["16-28779","ΜΑΡΙΝΟΠΟΥΛΟΥ ΧΡΙΣΤΙΝΑ","Ο.Α.ΑΘΗΝΩΝ",8,0]
["16-29784","ΜΠΙΤΣΙΟΥ ΓΕΩΡΓΙΑ","Α.Α.ΑΙΓΑΛΕΩ",8,0]
["16-33470","ΜΥΛΩΝΑ ΑΙΚΑΤΕΡΙΝΗ","Ο.Α.ΒΕΡΟΙΑΣ",8,0]
["16-29609","ΠΙΝΑΚΑ ΜΑΡΙΑ","Ο.Α.ΜΑΓΝΗΣΙΑΣ",8,0]
["16-28628","ΠΟΥΤΟΥ ΑΝΝΑ","Ο.Α.ΣΑΛΑΜΙΝΑΣ",8,0]
["16-32906","ΣΙΟΝΤΗ ΗΡΩ","Ο.Α.ΙΩΑΝΝΙΝΩΝ",8,0]
["16-34298","ΣΚΟΙΝΙΩΤΗ ΣΤΑΥΡΙΕΛΑ","Α.Ε.Τ.ΝΙΚΗ ΠΑΤΡΩΝ",8,0]
["16-33692","ΔΙΑΚΟΥ-ΚΟΝΤΕ ΜΥΡΤΩ","Α.Ο.Α.ΗΛΙΟΥΠΟΛΗΣ",7,0]
["16-30562","ΚΟΡΝΑΡΟΥ ΒΑΣΙΛΙΚΗ","Α.Ε.Τ.ΝΙΚΗ ΠΑΤΡΩΝ",7,0]
["16-34873","ΚΥΡΙΑΚΟΠΟΥΛΟΥ ΣΤΕΛΛΑ-ΠΗΓΗ","Ο.Α.ΠΕΤΑΛΟΥΔΩΝ",6,0]
["16-29771","ΡΙΖΟΠΟΥΛΟΥ ΜΑΡΙΑ-ΙΩΑΝΝΑ","Ο.Α.ΚΑΒΑΛΑΣ ΑΛΕΞΑΝΔΡΟΣ",7,0]
["16-30047","ΣΤΑΜΑΤΗ ΕΝΑΤΙΝΑ-ΑΘΗΝΑ","Α.Ο.Α.ΗΛΙΟΥΠΟΛΗΣ",7,0]
["16-24755","ΑΓΓΕΛΑΚΗ ΑΝΝΑ","Α.Σ.Α.ΛΑΡΙΣΑΣ",6,0]
["16-33096","ΕΛΕΥΘΕΡΙΑΔΟΥ ΕΛΕΝΗ","Ο.Α.ΤΟΥΜΠΑΣ",6,0]
["16-28672","ΚΟΡΔΕΑ ΙΩΑΝΝΑ","Σ.Φ.Φ.Α.Η ΑΜΙΛΛΑ",6,0]
["16-34330","ΠΕΧΛΙΒΑΝΗ ΜΑΡΙΑΝΝΑ","Α.Σ.ΟΛΥΜΠΙΑΚΟΥ ΧΩΡΙΟΥ Ο ΦΟΙΒΟΣ",6,0]
["16-27044","ΣΜΥΡΛΗ ΧΡΙΣΤΙΑΝΑ","Ο.Α.ΘΕΣΣΑΛΟΝΙΚΗΣ",6,0]
["16-30021","ΣΤΑΥΡΟΠΟΥΛΟΥ ΣΤΥΛΙΑΝΗ","Α.Κ.Α.ΜΑΡΑΘΩΝΑ",6,0]
["16-27409","ΦΟΥΚΑ ΕΥΜΟΡΦΙΑ","Α.Ο.Α.ΑΙΓΑΛΕΩ 92",6,0]
["16-33205","ΚΑΡΑΓΚΙΑΟΥΡΗ ΣΤΥΛΙΑΝΗ","Α.Ο.Α.ΚΑΒΑΛΑΣ",5,0]
["16-30892","ΚΟΥΤΟΥΛΑΚΗ ΜΑΡΙΑ","Α.Ο.ΛΑΤΩ ΑΓ.ΝΙΚΟΛΑΟΥ",5,0]
["16-28785","ΚΟΥΤΣΙΚΟΠΟΥΛΟΥ ΜΑΡΙΑΝΘΗ","Ο.Α.ΝΙΚΑΙΑ ΛΑΡΙΣΑΣ",5,0]
["16-32958","ΚΩΝΣΤΑΝΤΙΝΙΔΗ ΧΡΙΣΤΙΝΑ","ΖΑΚΥΝΘΙΝΟΣ Α.Ο.Α",5,0]
["16-31475","ΜΥΛΩΝΑ ΛΗΔΑ-ΣΤΥΛΙΑΝΗ","Ο.Α.ΓΛΥΦΑΔΑΣ",5,0]
["16-30316","ΠΑΡΜΕΝΙΔΟΥ ΑΙΚΑΤΕΡΙΝΗ","Ο.Α.ΚΑΒΑΛΑΣ ΑΛΕΞΑΝΔΡΟΣ",5,0]
["16-33209","ΠΙΣΤΙΟΛΑ ΑΝΝΑ","Ο.Α.ΙΩΑΝΝΙΝΩΝ",5,0]
["16-32698","ΠΟΝΤΙΚΑΚΗ ΑΙΚΑΤΕΡΙΝΗ","Ο.Α.ΣΟΥΔΑΣ",5,0]
["16-28436","ΣΑΡΗ ΣΤΑΥΡΟΥΛΑ","Ο.Α.ΠΑΡΟΥ",3,0]
["16-28868","ΣΤΙΝΗ ΕΙΡΗΝΗ-ΜΑΡΙΑ","Ο.Α.ΚΕΡΚΥΡΑΣ",5,0]
["16-28869","ΣΤΙΝΗ ΠΑΝΑΓΙΩΤΑ","Ο.Α.ΚΕΡΚΥΡΑΣ",5,0]
["16-31646","ΚΑΤΣΙΓΙΑΝΝΗ ΑΘΗΝΑ","Α.Ε.Τ.ΝΙΚΗ ΠΑΤΡΩΝ",4,0]
["16-24351","ΚΟΥΤΗ ΕΙΡΗΝΗ","Ο.Α.ΣΟΦΑΔΩΝ ΚΑΡΔΙΤΣΑΣ",4,0]
["16-28698","ΜΑΡΓΕΛΗ ΟΛΓΑ","Ο.Α.ΚΑΛΑΜΑΤΑΣ",4,0]
["16-27934","ΜΑΥΡΗ ΔΟΜΙΝΙΚΗ-ΤΑΤΙΑΝΗ","Ο.Α.ΠΑΡΟΥ",4,0]
["16-32849","ΜΙΟΥΜΠΗ ΚΩΝΣΤΑΝΤΙΝΑ-ΓΙΑΣΜΙΝ","Ο.Α.ΧΑΝΙΩΝ",4,0]
["16-31290","ΝΙΚΟΛΑΪΔΟΥ ΡΑΦΑΕΛΛΑ","Γ.Α.Σ.ΚΑΡΑΤΕ ΕΡΜΗΣ",4,0]
["16-28630","ΝΙΚΟΛΑΟΥ ΠΑΝΩΡΑΙΑ","ΑΙΟΛΟΣ Α.Λ.ΙΛΙΟΥ",4,0]
["16-35121","ΠΑΠΑΔΕΑ ΔΗΜΗΤΡΑ","Ο.Α.ΡΙΟΥ",4,0]
["16-33402","ΠΑΠΑΪΩΑΝΝΟΥ ΑΝΑΣΤΑΣΙΑ","Α.Γ.Ο.ΦΙΛΙΠΠΙΑΔΑΣ",4,0]
["16-33757","ΠΑΠΠΑ ΑΘΑΝΑΣΙΑ","Ο.Α.ΡΙΟΥ",4,0]
["16-29297","ΠΟΝΗΡΙΔΗ ΗΛΕΚΤΡΑ","Α.Ο.ΜΕΓΑΣ ΑΛΕΞΑΝΔΡΟΣ",4,0]
["16-30511","ΣΑΜΑΡΑ ΧΡΥΣΑΥΓΗ","Ο.Α.ΑΡΙΔΑΙΑΣ",4,0]
["16-31797","ΣΕΡΓΟΥΛΟΠΟΥΛΟΥ ΜΑΡΙΑ-ΕΛΕΝΗ","Α.Ο.Α.ΠΑΠΑΓΟΥ",4,0]
["16-29799","ΣΤΕΦΑΝΙΔΟΥ ΑΝΘΙΑ","Ο.Α.ΒΕΡΟΙΑΣ",4,0]
["16-28483","ΣΩΤΗΡΑ ΚΛΕΟΠΑΤΡΑ","Α.Ε.Κ.ΤΡΙΠΟΛΗΣ",4,0]
["16-33993","ΤΖΙΟΥΜΗ ΓΕΩΡΓΙΑ","Α.Ε.Κ.ΤΡΙΠΟΛΗΣ",4,0]
["16-32756","ΤΖΟΥΡΑ ΕΥΑΓΓΕΛΙΑ","Α.Ο.ΑΙΓΙΟΥ ΜΟΡΕΑΣ",4,0]
["16-28068","ΤΣΙΤΟΥΡΗ ΕΛΕΝΑ","Α.Σ.Α.ΑΓΡΙΝΙΟΥ",4,0]
["16-27178","ΦΕΤΣΙΟΥ ΚΑΤΕΡΙΝΑ","ΠΑΝΘΡΑΚΙΚΟΣ Ο.Α.ΚΟΜΟΤΗΝΗΣ",4,0]
["16-28453","ΧΑΤΖΗΙΩΑΝΝΟΥ ΠΕΡΣΕΦΟΝΗ","Ο.Α.ΞΑΝΘΗΣ",2,0]
["16-32038","ΑΝΤΩΝΟΠΟΥΛΟΥ ΚΩΝΣΤΑΝΤΙΝΑ","Ε.Σ.Ο.ΕΠΙΚΟΥΡΟΣ ΠΟΛΙΧΝΗΣ",3,0]
["16-28188","ΓΑΛΑΝΑΚΗ ΖΑΧΑΡΕΝΙΑ","Γ.Σ.ΛΙΒΥΚΟΣ ΙΕΡΑΠΕΤΡΑΣ",3,0]
["16-31638","ΓΑΝΙΤΗ ΚΑΛΛΙΟΠΗ","Ν.Ο.Ν.Α.Μ",3,0]
["16-33502","ΚΑΚΑΚΗ ΚΟΜΗΣΑ-ΣΤΑΥΡΟΥΛΑ","ΡΟΔΙΑΚΟΣ Ο.Α.",3,0]
["16-30447","ΚΙΛΙΓΚΑΡΙΔΟΥ ΙΩΑΝΝΑ","Ε.Α.Σ.ΟΛΥΜΠΙΑΔΑ",3,0]
["16-27579","ΚΟΓΙΑ ΜΕΛΙΝΑ","Α.Ο.ΒΑΡΗΣ ΑΝΑΓΥΡΟΥΣ",3,0]
["16-32201","ΚΟΚΚΟΡΗ ΕΙΡΗΝΗΥ-ΕΛΕΝΗ","Ο.Α.ΣΥΡΟΥ",3,0]
["16-25380","ΚΟΤΡΩΤΣΙΟΥ ΣΤΕΦΑΝΙΑ","Α.Σ.Α.ΛΑΡΙΣΑΣ",3,0]
["16-27110","ΛΑΝΤΖΗ ΛΟΥΙΖΑ","Ο.Α.ΑΘΗΝΩΝ",3,0]
["16-32223","ΛΟΥΠΑ ΧΑΡΙΣ","Σ.Α.ΕΛΑΣΣΟΝΑΣ",3,0]
["16-28969","ΜΟΡΦΟΝΙΟΥ ΑΙΚΑΤΕΡΙΝΗ","Ο.Α.ΑΘΗΝΩΝ",3,0]
["16-29118","ΜΠΙΖΟΠΟΥΛΟΥ ΠΕΛΑΓΙΑ","Ο.Α.ΤΟΥΜΠΑΣ",3,0]
["16-29867","ΠΑΛΙΕΡΑΚΗ ΧΡΥΣΑ","Ο.Α.ΡΕΘΥΜΝΟΥ",3,0]
["16-34652","ΠΑΠΑΘΑΝΑΣΙΟΥ ΔΗΜΗΤΡΑ","Σ.Α.ΕΛΑΣΣΟΝΑΣ",3,0]
["16-25108","ΣΤΑΜΠΟΥΛΗ ΒΑΣΙΛΙΚΗ","Ο.Α.ΕΥΟΣΜΟΥ ΘΕΣΣΑΛΟΝΙΚΗΣ",3,0]
["16-28471","ΤΡΟΥΛΟΥ ΧΡΙΣΤΙΝΑ","Ο.Α.ΤΟΥΜΠΑΣ",1,0]
["16-28111","ΧΑΡΑΛΑΜΠΟΠΟΥΛΟΥ ΙΩΑΝΝΑ","Α.Ε.Κ.ΤΡΙΠΟΛΗΣ",3,0]
["16-31370","ΧΟΡΒΑΛΗ ΜΥΡΤΩ","Φ.Σ.ΚΑΛΛΙΘΕΑΣ",3,0]
["16-29847","ΧΡΟΝΙΔΟΥ ΕΛΕΝΗ","Ο.Α.ΚΑΙΣΑΡΙΑΝΗΣ",3,0]
["16-29848","ΧΡΟΝΙΔΟΥ ΕΥΡΙΔΙΚΗ","Ο.Α.ΚΑΙΣΑΡΙΑΝΗΣ",3,0]
["16-28316","ΑΝΔΡΕΑΔΟΥ ΜΕΛΙΝΑ","Μ.Γ.Σ.ΑΠΟΛΛΩΝ ΚΑΛΑΜΑΡΙΑΣ",2,0]
["16-34698","ΒΑΡΣΑΜΟΥ ΑΙΚΑΤΕΡΙΝΗ","ΠΑΝΕΛΛΗΝΙΟΣ Γ.Σ.",2,0]
["16-30124","ΚΕΦΑΛΙΑΚΟΥ ΝΑΤΑΛΙΑ","Α.Ο.Α.ΠΑΠΑΓΟΥ",1,0]
["16-34933","ΚΟΝΤΕ ΠΑΡΑΣΚΕΥΗ","Α.Ο.ΒΑΡΗΣ ΑΝΑΓΥΡΟΥΣ",2,0]
["16-24482","ΚΟΝΤΟΓΕΩΡΓΑ ΧΡΙΣΤΙΝΑ","Σ.Φ.Α.ΜΕΛΙΣΣΙΩΝ Ο ΦΟΙΒΟΣ",2,0]
["16-26453","ΜΕΓΑΓΙΑΝΝΗ ΚΩΝΣΤΑΝΤΙΝΑ","Σ.Φ.Α.ΜΕΛΙΣΣΙΩΝ Ο ΦΟΙΒΟΣ",2,0]
["16-34291","ΠΑΠΑΔΙΑΜΑΝΤΗ ΖΩΗ","Α.Σ.ΠΕΡΑ",2,0]
["16-34398","ΠΑΠΑΕΥΘΥΜΙΟΥ ΕΥΑΓΓΕΛΙΑ-ΦΑΙΔΡΑ","Α.Σ.ΟΡΦΕΑΣ ΛΑΡΙΣΑΣ",2,0]
["16-32348","ΠΕΠΕΛΙΔΟΥ ΑΙΚΑΤΕΡΙΝΗ","Φ.Ο.Α.ΝΕΑΠΟΛΗΣ",2,0]
["16-34892","ΣΒΙΡΙΔΟΥ ΚΑΤΕΡΙΝΑ","Ο.Α.ΣΥΡΟΥ",2,0]
["16-31400","ΣΕΛΙΒΑΝΩΦ ΜΑΡΙΑ","Α.Σ.Α.ΠΑΝΟΡΑΜΑΤΟΣ",2,0]
["16-29986","ΑΝΔΡΟΥΛΑΚΗ ΙΩΑΝΝΑ-ΜΕΛΙΤΙΝΗ","Ο.Α.ΚΑΙΣΑΡΙΑΝΗΣ",1,0]
["16-30132","ΚΑΛΦΑΟΓΛΟΥ ΑΘΗΝΑ","Α.Ο.ΚΑΛΛΙΤΕΧΝΟΥΠΟΛΗΣ",1,0]
["16-29722","ΚΟΝΤΟΜΙΧΑΛΟΥ ΣΟΦΙΑ-ΧΑΡΤ","Ο.Α.ΑΘΗΝΩΝ",1,0]
["16-27063","ΠΑΠΑΔΟΠΟΥΛΟΥ ΠΑΝΑΓΙΩΤΑ-ΔΕΣΠΟΙΝΑ","Α.Ο.Α.ΗΛΙΟΥΠΟΛΗΣ",1,0]
["16-29588","ΑΛΕΞΟΠΟΥΛΟΥ ΙΩΑΝΝΑ","Ο.Α.ΒΕΡΟΙΑΣ",0,0]
["16-24447","ΑΛΜΠΑΝΙΔΟΥ ΕΛΕΝΗ","Ο.Α.ΑΛΕΞΑΝΔΡΟΣ ΒΕΡΟΙΑΣ",0,0]
["16-30576","ΑΡΒΑΝΙΤΗ ΣΟΦΙΑ","Α.Ν.Ο.ΓΛΥΦΑΔΑΣ",0,0]
["16-32899","ΑΡΓΥΡΙΟΥ ΑΙΚΑΤΕΡΙΝΗ","Α.Σ.Α.ΛΑΡΙΣΑΣ",0,0]
["16-31487","ΒΛΑΧΟΥ ΛΥΔΙΑ","ΦΘΙΩΤΙΚΟΣ Ο.Α.",0,0]
["16-30852","ΓΚΟΓΚΙΔΟΥ ΙΣΙΔΩΡΑ","Ο.Α.ΚΟΥΦΑΛΙΩΝ ΘΕΣΣΑΛΟΝΙΚΗΣ",0,0]
["16-26809","ΚΑΡΑΦΛΑ ΚΩΝΣΤΑΝΤΙΝΑ","Α.Ο.Α.ΑΙΓΑΛΕΩ 92",0,0]
["16-29438","ΚΑΡΙΠΙΔΟΥ ΘΕΟΔΩΡΑ","Ο.Α.ΠΤΟΛΕΜΑΪΔΑΣ",0,0]
["16-31879","ΚΑΣΣΙΔΟΥ ΚΩΝΣΤΑΝΤΙΝΑ","Ο.Α.ΓΙΑΝΝΙΤΣΩΝ",0,0]
["16-31547","ΚΑΤΣΙΜΑΝΗ ΠΟΛΥΞΕΝΗ","Ο.Α.ΘΕΣΠΡΩΤΙΑΣ ΤΙΤΑΝΗ",0,0]
["16-29130","ΚΟΥΚΟΥΔΑΚΗ ΝΙΚΟΛΕΤΑ","Α.Ο.Α.ΑΙΓΑΛΕΩ 92",0,0]
["16-26412","ΚΟΥΜΠΑΡΟΥ ΜΑΡΙΝΑ","Α.Ο.Α.ΠΡΩΤΑΘΛ.ΚΑΒΑΛΑΣ",0,0]
["16-32746","ΚΥΒΡΑΝΟΓΛΟΥ ΜΑΡΚΕΛΛΑ","Ο.Α.ΘΕΣΠΡΩΤΙΑΣ ΤΙΤΑΝΗ",0,0]
["16-34288","ΜΟΣΤΙΟΓΛΟΥ ΙΟΛΗ","Α.Σ.ΠΕΡΑ",0,0]
["16-28336","ΜΠΟΛΛΑ ΖΩΗ","Ο.Α.ΝΕΣΤΩΡΑΣ ΓΙΑΝΝΙΤΣΩΝ",0,0]
["16-34566","ΝΑΖΙΡΗ ΚΩΝΣΤΑΝΤΙΝΑ","Ο.Α.ΑΡΙΔΑΙΑΣ",0,0]
["16-31546","ΝΙΚΟΛΑΟΥ ΑΘΗΝΑ","Ο.Α.ΘΕΣΠΡΩΤΙΑΣ ΤΙΤΑΝΗ",0,0]
["16-90109","ΠΑΝΤΟΥΡΑΡΟΥ ΜΑΡΙΑ-ΛΟΥΙΖΑ","Ο.Α.ΑΘΗΝΩΝ",0,0]
["16-27102","ΠΑΠΑΗΛΙΟΥ ΒΑΣΙΛΙΚΗ","Α.Ε.Κ.ΤΡΙΠΟΛΗΣ",0,0]
["16-31551","ΠΑΠΑΚΩΝΣΤΑΝΤΙΝΟΥ ΕΛΕΝΑ-ΜΑΡΙΑ","ΦΘΙΩΤΙΚΟΣ Ο.Α.",0,0]
["16-30385","ΠΑΠΠΑ ΑΝΝΑ-ΜΑΡΙΑ","Ο.Α.ΚΑΙΣΑΡΙΑΝΗΣ",0,0]
["16-30765","ΠΑΡΑΣΚΕΥΟΥΔΗ ΑΝΑΣΤΑΣΙΑ","Φ.Ο.Α.ΝΕΑΠΟΛΗΣ",0,0]
["16-28458","ΠΑΥΛΙΔΟΥ ΕΛΕΝΗ-ΜΑΡΙΑ","ΠΕΥΚΗ Γ.ΚΑΛΟΒΕΛΩΝΗΣ",0,0]
["16-29060","ΠΑΥΛΙΔΟΥ ΠΑΡΘΕΝΑ","Ο.Α.ΒΕΡΟΙΑΣ",0,0]
["16-29370","ΠΑΥΛΟΥ ΙΩΑΝΝΑ","Γ.Σ.ΚΗΦΙΣΙΑΣ",0,0]
["16-29795","ΠΙΚΟΥΛΑ ΜΑΡΙΑ","Ο.Α.ΚΑΙΣΑΡΙΑΝΗΣ",0,0]
["16-34297","ΠΙΤΣΙΛΗ ΔΑΝΑΗ-ΣΩΣΑΝΑ","Α.Ο.Ν.Φ.ΑΤΤΑΛΟΣ",0,0]
["16-30955","ΠΟΣΤΑΝΤΖΙΑΝ ΜΑΡΚΕΛΛΑ","Ο.Α.ΠΕΤΡΟΥΠΟΛΗΣ",0,0]
["16-30774","ΡΕΝΤΟΥΜΗ ΜΑΡΙΑ","Α.Κ.Α.ΜΑΡΑΘΩΝΑ",0,0]
["16-34427","ΣΑΚΕΛΛΑΡΙΔΗ ΣΑΠΦΩ","Ο.Α.ΑΓΙΑΣ ΠΑΡΑΣΚΕΥΗΣ",0,0]
["16-31672","ΣΙΔΗΡΟΠΟΥΛΟΥ ΚΥΡΙΑΚΗ","Ο.Α.ΑΡΙΔΑΙΑΣ",0,0]
["16-30873","ΣΠΥΡΟΠΟΥΛΟΥ ΗΡΩ-ΧΡΙΣΤΙΝΑ","Α.Ο.Π.ΦΑΛΗΡΟΥ",0,0]
["16-28688","ΣΤΑΜΑΤΟΓΙΑΝΝΟΠΟΥΛΟΥ ΒΑΣΙΛΙΚΗ","Γ.Ο.ΠΕΡΙΣΤΕΡΙΟΥ Γ.ΠΑΛΑΣΚΑΣ",0,0]
["16-30318","ΤΣΑΔΑΡΗ ΙΩΑΝΝΑ","Ο.Α.ΠΕΤΡΟΥΠΟΛΗΣ",0,0]
["16-31998","ΤΣΕΡΕΓΚΟΥΝΗ ΜΑΡΙΑ","Α.Σ.ΚΟΛΛΕΓΙΟΥ ΝΤΕΡΗ",0,0]
["16-30853","ΦΑΚΑ ΔΗΜΗΤΡΑ","Ο.Α.ΚΟΥΦΑΛΙΩΝ ΘΕΣΣΑΛΟΝΙΚΗΣ",0,0]
["16-30850","ΦΡΑΓΓΟΠΟΥΛΟΥ ΧΡΙΣΤΙΝΑ","Ο.Α.ΚΟΥΦΑΛΙΩΝ ΘΕΣΣΑΛΟΝΙΚΗΣ",0,0]
["18-24938","ΑΥΓΕΡΗ ΑΣΠΑΣΙΑ","Α.Ο.Α.ΗΛΙΟΥΠΟΛΗΣ",910,0]
["18-24422","ΧΡΙΣΤΟΦΗ ΕΛΕΝΗ","Α.Ο.Α.ΦΙΛΟΘΕΗΣ",750,0]
["18-23650","ΡΕΝΤΟΥΛΗ ΑΝΑΣΤΑΣΙΑ","Α.Ο.Α.ΗΛΙΟΥΠΟΛΗΣ",712.5,0]
["18-23222","ΜΠΟΤΣΑ ΜΑΡΙΑ-ΣΤΥΛΙΑΝΗ","Ο.Α.ΓΛΥΦΑΔΑΣ",640,0]
["18-23021","ΚΑΠΕΛΛΑ ΑΛΙΚΗ","Α.Ο.Α.ΗΛΙΟΥΠΟΛΗΣ",602.5,0]
["18-27381","ΣΟΛΔΑΤΟΥ ΘΕΟΔΩΡΑ","Ο.Α.ΠΕΤΡΟΥΠΟΛΗΣ",560,0]
["18-25287","ΜΠΟΤΣΑ ΠΑΡΑΣΚΕΥΗ","Α.Ο.Α.ΗΛΙΟΥΠΟΛΗΣ",526,0]
["18-21943","ΣΙΔΕΡΗ ΒΑΣΙΛΙΚΗ","Α.Ο.ΒΑΡΗΣ ΑΝΑΓΥΡΟΥΣ",467.5,0]
["18-25501","ΝΤΑΝΙΕΛΙΑΝΤΣ ΑΝΝΑ-ΜΑΡΙΑ","Ο.Α.ΦΟΙΒΟΣ ΛΑΡΙΣΑΣ",445,0]
["18-24664","ΚΩΤΣΑΚΗ ΑΙΚΑΤΕΡΙΝΗ","Ο.Α.ΠΕΤΡΟΥΠΟΛΗΣ",438,0]
["18-21937","ΚΑΪΡΗ ΑΓΓΕΛΙΚΗ","Ο.Α.ΑΘΗΝΩΝ",375,0]
["18-24332","ΡΑΠΤΟΠΟΥΛΟΥ ΜΑΡΙΑ-ΧΡΙΣΤΙΝΑ","Ο.Α.ΝΙΚΑΙΑ ΛΑΡΙΣΑΣ",372.5,0]
["18-27688","ΝΙΚΟΛΟΠΟΥΛΟΥ ΝΑΤΑΛΙΑ","Α.Ο.ΒΟΥΛΙΑΓΜΕΝΗΣ",366,0]
["18-27401","ΠΕΤΡΙΔΟΥ ΗΛΕΚΤΡΑ","Ο.Α.ΑΘΗΝΩΝ",366,0]
["18-28387","ΚΑΡΒΟΥΝΗ ΒΑΣΙΛΙΚΗ","Α.Ο.Α.ΦΙΛΟΘΕΗΣ",350,0]
["18-22576","ΖΑΧΟΠΟΥΛΟΥ ΑΘΑΝΑΣΙΑ","Ο.Α.ΦΟΙΒΟΣ ΛΑΡΙΣΑΣ",323.5,0]
["18-23838","ΜΑΤΟΥΛΑ ΜΑΡΘΑ","Ο.Α.ΤΟΥΜΠΑΣ",306,0]
["18-26287","ΒΑΣΙΛΕΙΑΔΗ ΕΥΑΓΓΕΛΙΑ","Ο.Α.ΑΘΗΝΩΝ",297,0]
["18-30673","ΠΕΤΡΟΥΛΑ ΔΑΝΑΗ","Α.Π.Ο.ΣΑΝΝΥ ΣΠΟΡΤΣ ΚΛΑΜΠ",296,0]
["18-22007","ΒΑΣΙΛΕΙΟΥ ΑΝΑΣΤΑΣΙΑ","Α.Ο.Α.ΗΛΙΟΥΠΟΛΗΣ",282.5,0]
["18-22833","ΑΔΑΛΟΓΛΟΥ ΜΑΓΔΑΛΗΝΗ","Ε.Σ.Ο.ΕΠΙΚΟΥΡΟΣ ΠΟΛΙΧΝΗΣ",280,0]
["18-22914","ΓΕΝΝΗΜΑΤΑ ΜΑΡΙΝΑ","Α.Κ.Α.ΜΑΡΑΘΩΝΑ",258,0]
["18-24142","ΔΕΜΕΝΕΓΑ ΔΑΦΝΗ","Α.Κ.Α.ΜΑΡΑΘΩΝΑ",258,0]
["18-23033","ΚΟΥΚΟΥΒΙΤΑΚΗ ΕΛΕΝΗ-ΑΝΝΑ","Ο.Α.ΑΘΛΗΤ.ΠΑΙΔΕΙΑ",256,0]
["18-26455","ΝΑΟΥΜ ΜΑΡΙΑ","Ο.Α.ΧΑΝΙΩΝ",248,0]
["18-25497","ΠΑΛΑΣΚΑ ΑΝΑΣΤΑΣΙΑ-ΜΑΡΙΑ","Ο.Α.ΜΑΓΝΗΣΙΑΣ",246,0]
["18-27054","ΛΟΥΚΟΓΙΩΡΓΑΚΗ ΝΙΚΗ","Ο.Α.ΠΕΤΡΟΥΠΟΛΗΣ",241,0]
["18-24109","ΣΤΑΜΠΟΥΛΗ ΧΑΡΙΚΛΕΙΑ","Ο.Α.ΕΥΟΣΜΟΥ ΘΕΣΣΑΛΟΝΙΚΗΣ",234,0]
["18-29315","ΠΟΤΣΗ ΜΑΡΙΑ","Ο.Α.ΑΘΗΝΩΝ",230,0]
["18-25599","ΜΑΘΙΟΥΔΑΚΗ ΠΑΝΑΓΙΩΤΑ-ΕΛΕΝΗ","Ο.Α.ΧΑΝΙΩΝ",228,0]
["18-23280","ΥΦΑΝΤΗ ΣΕΒΑΣΤΗ","Ο.Α.ΑΘΗΝΩΝ",225,0]
["18-24335","ΚΑΦΦΕ ΖΩΗ","Ο.Α.ΝΙΚΑΙΑ ΛΑΡΙΣΑΣ",224,0]
["18-26960","ΠΟΖΙΔΟΥ ΕΠΙΣΤΗΜΗ","Α.Ο.Α.ΣΤΑΥΡΟΥΠΟΛΗΣ ΙΦΙΤΟΣ",224,0]
["18-22718","ΝΙΚΟΛΑΟΥ ΑΝΑΣΤΑΣΙΑ","Α.Ο.ΑΡΓΥΡΟΥΠΟΛΗΣ",210,0]
["18-25047","ΧΑΡΣΟΥΛΑ ΑΙΚΑΤΕΡΙΝΗ","Α.Ο.Α.ΣΤΑΥΡΟΥΠΟΛΗΣ ΙΦΙΤΟΣ",204,0]
["18-25272","ΒΟΥΓΑ ΜΥΡΤΩ","Α.Σ.ΑΚΡΟΠΟΛΙΣ",202,0]
["18-25641","ΤΣΕΚΟΥΡΑ ΚΩΝΣΤΑΝΤΙΝΑ","Α.Ο.Α.ΗΛΙΟΥΠΟΛΗΣ",202,0]
["18-28104","ΠΑΠΑΔΗΜΗΤΡΙΟΥ ΑΘΑΝΑΣΙΑ","Ο.Α.ΠΕΤΡΟΥΠΟΛΗΣ",183,0]
["18-24783","ΣΙΣΜΑΝΙΔΟΥ ΣΤΕΦΑΝΙΑ","Ο.Α.ΤΟΥΜΠΑΣ",179.5,0]
["18-28631","ΓΡΙΒΑ ΒΑΡΒΑΡΑ","ΑΙΟΛΟΣ Α.Λ.ΙΛΙΟΥ",178,0]
["18-26107","ΑΝΤΩΝΑΚΗ ΕΜΜΑΝΟΥΕΛΑ","Α.Ο.Α.ΑΤΤΙΚΟΣ ΗΛΙΟΣ",177,0]
["18-26824","ΚΟΛΟΥΤΣΟΥ ΜΑΡΙΑ-ΕΥΑΓΓΕΛΙΑ","Α.Ο.Α.ΧΑΪΔΑΡΙΟΥ",174,0]
["18-27857","ΚΟΚΚΙΝΑΚΗ ΕΥΑΓΓΕΛΙΑ","Ο.Α.ΧΑΝΙΩΝ",164,0]
["18-27691","ΚΡΙΕΖΗ ΦΩΤΕΙΝΗ","ΠΕΥΚΗ Γ.ΚΑΛΟΒΕΛΩΝΗΣ",164,0]
["18-26059","ΓΚΟΓΚΟΥ ΚΩΝΣΤΑΝΤΙΝΑ","Ο.Α.ΣΟΥΔΑΣ",162,0]
["18-24899","ΜΠΕΛΙΔΟΥ ΧΡΙΣΤΙΝΑ","Ο.Α.ΤΟΥΜΠΑΣ",160,0]
["18-26622","ΘΩΔΗ ΝΙΚΗ","Α.Γ.Ο.ΦΙΛΙΠΠΙΑΔΑΣ",158,0]
["18-25091","ΜΑΡΚΑΚΗ ΜΑΡΓΑΡΙΤΑ","ΗΡΑΚΛΕΙΟ Ο.Α.& Α.",158,0]
["18-29616","ΝΙΚΟΛΑΚΟΠΟΥΛΟΥ ΜΑΡΙΑ","Ο.Α.ΠΕΤΡΟΥΠΟΛΗΣ",158,0]
["18-26834","ΠΑΡΟΥΣΗ ΜΕΡΟΠΗ","Ο.Α.ΠΑΡΟΥ",157.5,0]
["18-24169","ΛΑΘΟΥΡΗ ΙΩΑΝΝΑ","Α.Ο.ΑΡΓΥΡΟΥΠΟΛΗΣ",152,0]
["18-23663","ΝΙΚΟΛΑΪΔΟΥ ΑΝΑΣΤΑΣΙΑ","Α.Σ.ΑΚΡΟΠΟΛΙΣ",151,0]
["18-25728","ΝΤΟΥΜΑ ΔΑΦΝΗ","Α.Ο.Α.ΦΙΛΟΘΕΗΣ",150,0]
["18-27858","ΚΟΚΚΙΝΑΚΗ ΕΥΓΕΝΙΑ","Ο.Α.ΧΑΝΙΩΝ",146,0]
["18-22867","ΠΕΤΡΟΥΛΑΚΗ ΑΡΧΟΝΤΟΥΛΑ","Ο.Α.ΞΥΛΟΚΑΣΤΡΟΥ ΣΥΘΑΣ",144.5,0]
["18-26506","ΜΑΓΚΛΑΡΑ ΣΤΑΥΡΟΥΛΑ","Α.Γ.Ο.ΦΙΛΙΠΠΙΑΔΑΣ",144,0]
["18-22974","ΒΑΣΙΛΑΚΗ ΧΡΙΣΤΙΝΑ","ΠΕΥΚΗ Γ.ΚΑΛΟΒΕΛΩΝΗΣ",142,0]
["18-25244","ΠΕΤΤΑ ΣΟΦΙΑ","Α.Ο.Α.ΠΑΤΡΩΝ",138,0]
["18-25973","ΤΣΙΑΡΑ ΙΩΑΝΝΑ","Ο.Α.ΠΕΤΡΟΥΠΟΛΗΣ",138,0]
["18-28007","ΚΑΪΡΗ ΗΛΕΚΤΡΑ","Ο.Α.ΑΘΗΝΩΝ",130,0]
["18-26307","ΜΑΛΑΜΟΥ ΚΡΙΝΑ","Ο.Α.ΙΩΑΝΝΙΝΩΝ",130,0]
["18-26308","ΜΑΛΑΜΟΥ ΜΑΡΙΑ","Ο.Α.ΙΩΑΝΝΙΝΩΝ",130,0]
["18-25299","ΣΩΤΗΡΟΠΟΥΛΟΥ ΡΕΓΓΙΝΑ","Ο.Α.ΑΘΗΝΩΝ",128,0]
["18-26982","ΚΑΝΕΛΛΟΠΟΥΛΟΥ ΜΑΡΙΛΗ","Α.Ο.ΤΑΤΟΪΟΥ",127,0]
["18-90069","ΜΤΣΕΝΤΛΙΤΖΕ ΕΛΕΝΗ","Α.Ο.Α.ΣΤΑΥΡΟΥΠΟΛΗΣ ΙΦΙΤΟΣ",127,0]
["18-28936","ΕΥΘΥΜΙΑΔΟΥ ΜΑΓΔΑΛΗΝΗ","Ο.Α.ΙΩΛΚΟΣ ΒΟΛΟΥ",122,0]
["18-25833","ΤΖΙΑΝΗ ΟΥΡΑΝΙΑ","Ο.Α.ΜΑΓΝΗΣΙΑΣ",121,0]
["18-24448","ΑΛΜΠΑΝΙΔΟΥ ΒΑΣΙΛΙΚΗ","Ο.Α.ΑΛΕΞΑΝΔΡΟΣ ΒΕΡΟΙΑΣ",120,0]
["18-24977","ΜΑΔΕΝΛΙΔΟΥ ΕΛΕΝΗ","Ο.Α.ΒΙΚΕΛΑΣ ΒΕΡΟΙΑΣ",120,0]
["18-28094","ΓΚΟΓΚΟΥ ΕΛΕΥΘΕΡΙΑ","Ο.Α.ΣΟΥΔΑΣ",119,0]
["18-28284","ΓΚΟΥΣΚΟΥ ΚΑΛΛΙΟΠΗ","Α.Ο.Α.ΦΙΛΟΘΕΗΣ",115,0]
["18-29038","ΓΑΚΗ ΕΛΕΝΑ","Ο.Α.ΠΕΤΡΟΥΠΟΛΗΣ",114,0]
["18-27016","ΓΕΩΡΓΟΠΟΥΛΟΥ ΑΝΑΣΤΑΣΙΑ","Ο.Α.ΠΕΤΡΟΥΠΟΛΗΣ",114,0]
["18-28170","ΤΣΕΛΟΥ ΑΘΑΝΑΣΙΑ","Α.Ο.Α.ΠΑΠΑΓΟΥ",113,0]
["18-28701","ΣΟΥΡΟΥΛΙΔΗ ΕΙΡΗΝΗ","Α.Ο.Α.ΦΙΛΟΘΕΗΣ",112.5,0]
["18-24655","ΣΤΑΜΑΤΟΓΙΑΝΝΟΠΟΥΛΟΥ ΠΑΝΑΓΙΩΤΑ","Γ.Ο.ΠΕΡΙΣΤΕΡΙΟΥ Γ.ΠΑΛΑΣΚΑΣ",112,0]
["18-22014","ΣΤΑΜΑΤΗ ΕΛΕΝΗ","Ο.Α.ΠΕΤΡΟΥΠΟΛΗΣ",111.5,0]
["18-27014","ΤΖΑΝΟΠΟΥΛΟΥ ΑΦΡΟΔΙΤΗ","Γ.Ο.ΠΕΡΙΣΤΕΡΙΟΥ Γ.ΠΑΛΑΣΚΑΣ",110,0]
["18-31211","ΑΝΤΩΝΙΟΥ-ΚΑΡΑΔΕΜΗΤΡΟΥ ΝΙΚΟΛΕΤΑ","Ο.Α.ΒΟΛΟΥ",109,0]
["18-25137","ΚΡΟΥΣΤΑΛΑΚΗ ΑΣΠΑΣΙΑ","ΗΡΑΚΛΕΙΟ Ο.Α.& Α.",108,0]
["18-26489","ΠΟΔΑΡΑ ΙΩΑΝΝΑ-ΜΑΡΙΑ","Α.Ο.Α.ΗΛΙΟΥΠΟΛΗΣ",108,0]
["18-27657","ΝΑΣΙΟΠΟΥΛΟΥ ΑΓΓΕΛΙΚΗ","Ο.Α.ΑΘΗΝΩΝ",106,0]
["18-24764","ΣΤΑΜΑΤΙΑΔΟΥ ΕΛΕΝΑ","Ο.Α.ΘΕΣΣΑΛΟΝΙΚΗΣ",104,0]
["18-25628","ΧΕΙΛΑΡΗ ΑΝΑΣΤΑΣΙΑ","Α.Ο.Π.ΦΑΛΗΡΟΥ",100,0]
["18-24979","ΔΑΜΙΑΝΙΔΟΥ ΕΛΕΝΗ","Ο.Α.ΒΙΚΕΛΑΣ ΒΕΡΟΙΑΣ",98,0]
["18-28092","ΚΑΡΠΟΥΖΗ ΟΛΥΜΠΙΑ","Α.Ο.Α.ΑΤΤΙΚΟΣ ΗΛΙΟΣ",98,0]
["18-25681","ΑΓΓΕΛΑΤΟΥ-ΡΑΦΤΟΠΟΥΛΟΥ ΑΝΑΣΤΑΣΙΑ","Α.Ο.Α.ΗΛΙΟΥΠΟΛΗΣ",97,0]
["18-28279","ΖΕΡΒΑ ΕΥΘΑΛΙΑ","Ο.Α.ΤΟΥΜΠΑΣ",96,0]
["18-28404","ΚΑΜΠΙΩΤΗ ΑΘΗΝΑ","ΖΑΚΥΝΘΙΝΟΣ Α.Ο.Α",95,0]
["18-29449","ΔΑΛΙΑΝΗ ΔΗΜΗΤΡΑ","Α.Ο.Α.ΗΛΙΟΥΠΟΛΗΣ",94,0]
["18-22707","ΠΑΠΑΚΑΝΕΛΛΟΥ ΤΑΤΙΑΝΑ","Ο.Α.ΓΛΥΦΑΔΑΣ",94,0]
["18-25972","ΤΣΙΑΡΑ ΕΥΘΥΜΙΑ","Ο.Α.ΠΕΤΡΟΥΠΟΛΗΣ",94,0]
["18-24871","ΑΡΒΑΝΙΤΗ ΑΙΚΑΤΕΡΙΝΗ","Ο.Α.ΚΟΡΙΝΘΟΥ",88,0]
["18-25456","ΚΑΒΑΛΙΕΡΑΤΟΥ ΤΕΡΕΖΑ","Ο.Α.ΣΑΛΑΜΙΝΑΣ",88,0]
["18-29942","ΑΛΦΑΝΤΗ ΑΝΑΣΤΑΣΙΑ","Ο.Α.ΠΕΤΡΟΥΠΟΛΗΣ",86,0]
["18-28386","ΖΟΥΡΙΔΗ ΕΛΕΝΗ","Α.Π.Ο.ΣΑΝΝΥ ΣΠΟΡΤΣ ΚΛΑΜΠ",83,0]
["18-25028","ΣΙΓΑΛΑ ΑΘΗΝΑ","Α.Ο.Π.ΦΑΛΗΡΟΥ",82,0]
["18-30184","ΣΑΛΛΗ ΣΤΑΜΑΤΙΝΑ-ΜΑΡΙΑ","Ο.Α.ΧΑΛΚΙΔΑΣ",81,0]
["18-27702","ΚΑΜΠΑΝΤΑΗ ΕΛΕΝΗ","Α.Σ.ΠΕΡΑ",80,0]
["18-25517","ΧΑΤΖΗ ΚΩΝΣΤΑΝΤΙΝΑ","Ο.Α.ΧΑΛΚΙΔΑΣ",80,0]
["18-23564","ΚΟΥΤΣΙΚΟΠΟΥΛΟΥ ΒΑΪΑ","Ο.Α.ΝΙΚΑΙΑ ΛΑΡΙΣΑΣ",79,0]
["18-29589","ΤΣΕΡΕΓΚΟΥΝΗ ΑΝΑΣΤΑΣΙΑ-ΑΓΑΘΗ","Α.Ο.Α.ΠΑΠΑΓΟΥ",79,0]
["18-24787","ΜΑΚΡΗ ΠΕΡΣΕΦΟΝΗ","Α.Ο.Α.ΧΑΪΔΑΡΙΟΥ",74.5,0]
["18-26696","ΔΙΓΑΛΑΚΗ ΚΟΡΙΝΑ","Ο.Α.ΧΑΝΙΩΝ",74,0]
["18-27674","ΔΡΥΜΑΛΙΤΗ ΚΥΡΙΑΚΗ","Α.Ο.Α.ΠΑΠΑΓΟΥ",74,0]
["18-28780","ΚΑΛΑΤΖΗ ΜΑΡΙΛΕΝΑ","Α.Ο.Α.ΗΛΙΟΥΠΟΛΗΣ",74,0]
["18-32719","ΖΑΡΑΡΗ ΚΥΡΙΑΚΗ","ΡΟΔΙΑΚΟΣ Ο.Α.",73,0]
["18-27472","ΚΑΣΣΙΔΟΥ ΧΑΡΙΚΛΕΙΑ","Ο.Α.ΓΙΑΝΝΙΤΣΩΝ",73,0]
["18-26602","ΜΑΝΑΟΥ-ΓΙΑΝΝΟΥΣΗ ΑΛΚΥΟΝΗ-ΜΑΡΙΑ","Ο.Α.ΦΟΙΒΟΣ ΛΑΡΙΣΑΣ",73,0]
["18-28937","ΑΝΤΩΝΙΟΥ ΘΕΟΔΩΡΑ","Ο.Α.ΜΑΓΝΗΣΙΑΣ",72,0]
["18-28466","ΑΣΗΜΑΚΗ ΜΑΡΙΝΑ","Ο.Α.ΑΘΛΗΤ.ΠΑΙΔΕΙΑ",72,0]
["18-27840","ΤΟΠΟΥΖΙΔΟΥ ΕΛΕΝΗ","Ο.Α.ΕΥΟΣΜΟΥ ΘΕΣΣΑΛΟΝΙΚΗΣ",71,0]
["18-27408","ΤΣΑΓΚΑΡΑΚΗ ΑΘΗΝΑ","ΗΡΑΚΛΕΙΟ Ο.Α.& Α.",71,0]
["18-29201","ΚΙΖΙΡΑΚΟΥ ΔΗΜΗΤΡΑ","Ο.Α.ΑΘΗΝΩΝ",70,0]
["18-29695","ΜΕΤΑΞΑ ΚΛΕΙΩ","Α.Σ.ΚΟΛΛΕΓΙΟΥ ΝΤΕΡΗ",70,0]
["18-29710","ΚΥΡΙΑΚΟΠΟΥΛΟΥ ΘΕΟΔΩΡΑ-ΖΩΗ","ΡΟΔΙΑΚΟΣ Ο.Α.",68,0]
["18-25624","ΞΗΡΟΓΙΑΝΝΗ ΣΤΑΜΑΤΙΑ","Ο.Α.ΧΑΝΙΩΝ",68,0]
["18-28674","ΣΠΥΡΟΠΟΥΛΟΥ ΒΑΣΙΛΕΙΑ","Α.Ο.Α.ΦΙΛΟΘΕΗΣ",68,0]
["18-30045","ΣΙΑ ΕΛΕΝΗ","Ο.Α.ΤΟΥΜΠΑΣ",66,0]
["18-28070","ΜΑΡΝΕΛΛΟΥ ΜΑΡΙΑ","ΗΡΑΚΛΕΙΟ Ο.Α.& Α.",65,0]
["18-26463","ΛΟΓΟΘΕΤΙΔΟΥ ΜΑΡΙΑ","Σ.Α.ΣΕΡΡΩΝ",64,0]
["18-29694","ΜΕΤΑΞΑ ΔΙΟΝΥΣΙΑ-ΜΥΡΤΩ","Α.Σ.ΚΟΛΛΕΓΙΟΥ ΝΤΕΡΗ",64,0]
["18-27416","ΤΟΛΗ ΚΛΕΙΩ-ΝΙΚΟΛΕΤΑ","Α.Ο.ΒΑΡΗΣ ΑΝΑΓΥΡΟΥΣ",63,0]
["18-24980","ΔΑΜΙΑΝΙΔΟΥ ΜΑΡΙΑΝΝΑ","Ο.Α.ΒΙΚΕΛΑΣ ΒΕΡΟΙΑΣ",62,0]
["18-28935","ΤΖΙΦΑ-ΚΡΑΤΗΡΑ ΖΩΗ","Ο.Α.ΜΑΓΝΗΣΙΑΣ",62,0]
["18-29764","ΖΩΓΡΑΦΟΥ ΕΛΕΝΗ","Α.Ο.Α.ΧΑΪΔΑΡΙΟΥ",60,0]
["18-28813","ΓΡΙΝΕΖΟΥ ΣΟΦΙΑ-ΕΥΘΥΜΙΑ","ΡΗΓΑΣ Α.Ο.Α.ΑΡΓΟΛΙΔΑΣ",58,0]
["18-29223","ΜΕΤΑΞΟΠΟΥΛΟΥ ΣΤΕΦΑΝΙΑ-ΕΛΕΝΑ","Σ.Α.ΡΑΦΗΝΑΣ",58,0]
["18-25455","ΠΕΤΑΛΟΥΔΗ ΕΥΑΓΓΕΛΙΑ","Ο.Α.ΣΑΛΑΜΙΝΑΣ",58,0]
["18-29208","ΣΤΑΜΟΥΛΗ ΦΡΕΙΔΕΡΙΚΗ","Ο.Α.ΜΑΓΝΗΣΙΑΣ",58,0]
["18-24411","ΚΟΡΡΕ ΜΑΡΙΑ","Α.Κ.Α.ΜΑΡΑΘΩΝΑ",56,0]
["18-28995","ΜΠΟΜΠΟΛΑΚΗ ΙΩΑΝΝΑ","Γ.Ο.ΠΕΡΙΣΤΕΡΙΟΥ Γ.ΠΑΛΑΣΚΑΣ",56,0]
["18-32227","ΣΚΑΝΔΑΛΗ ΠΑΝΑΓΙΩΤΑ-ΡΑΦΑΗΛΙΑ","ΑΚΑΔ.ΑΝΤΙΣΦ.ΙΩΑΝΝΙΝΩΝ",55,0]
["18-25992","ΤΟΥΛΗ ΕΥΑΓΓΕΛΙΑ-ΖΑΧΑΡΟΥΛΑ","Ο.Α.ΕΥΟΣΜΟΥ ΘΕΣΣΑΛΟΝΙΚΗΣ",55,0]
["18-29136","ΠΑΠΑΔΟΠΟΥΛΟΥ ΔΑΝΑΗ","Α.Ο.Α.ΣΤΑΥΡΟΥΠΟΛΗΣ ΙΦΙΤΟΣ",54,0]
["18-30033","ΜΑΜΑΗ ΕΒΕΛΙΝΑ","Α.Μ.Ε.Σ.Ν.ΕΡΥΘΡΑΙΑΣ",53,0]
["18-29089","ΑΡΒΑΝΙΤΟΠΟΥΛΟΥ ΒΑΣΙΛΙΚΗ","Α.Ο.Α.ΠΑΤΡΩΝ",52,0]
["18-28761","ΔΟΪΡΑΝΛΗ ΦΑΝΗ","Α.Ο.Α.ΣΤΑΥΡΟΥΠΟΛΗΣ ΙΦΙΤΟΣ",52,0]
["18-22532","ΤΕΖΑΨΙΔΟΥ ΜΑΡΙΑ-ΡΑΦΑΕΛΛΑ","Μ.Α.Σ.ΑΕΤΟΣ ΘΕΣΣΑΛΟΝΙΚΗΣ",52,0]
["18-30243","ΧΑΤΖΗΧΑΡΙΣΤΟΥ ΔΗΜΗΤΡΑ-ΑΛΕΞΙΑ","Α.Σ.ΑΚΑΔΗΜΙΕΣ ΠΡΩΤΑΘΛΗΤΩΝ ΠΕΥΚΩΝ",52,0]
["18-26113","ΕΜΜΑΝΟΥΗΛΙΔΟΥ ΕΛΕΝΗ-ΒΑΣΙΛΙΚΗ","Α.Ο.ΑΤΡΟΜΗΤΟΣ ΤΡΙΑΔΙΟΥ",50,0]
["18-28686","ΚΑΡΒΟΥΝΑ ΜΑΡΙΑΝΝΑ","Γ.Ο.ΠΕΡΙΣΤΕΡΙΟΥ Γ.ΠΑΛΑΣΚΑΣ",50,0]
["18-21368","ΜΠΟΥΡΛΑΚΟΥ ΑΝΑΣΤΑΣΙΑ","Α.Ο.Α.ΗΛΙΟΥΠΟΛΗΣ",50,0]
["18-25885","ΝΑΛΜΠΑΝΤΙΔΗ ΕΒΙΤΑ-ΣΕΒΑΣΤΗ","Α.Ο.Α.ΑΣΤΕΡΑΣ ΘΕΣΣΑΛΟΝΙΚΗΣ",50,0]
["18-27030","ΠΕΡΔΙΚΟΥΡΗ ΜΑΡΙΑ","Ο.Α.ΣΑΛΑΜΙΝΑΣ",50,0]
["18-23816","ΡΟΖΟΥ ΕΛΕΝΗ","Ο.Α.ΙΩΑΝΝΙΝΩΝ",50,0]
["18-28341","ΜΙΧΑΗΛΙΔΟΥ ΚΩΝΣΤΑΝΤΙΝΑ","Ο.Α.ΕΥΟΣΜΟΥ ΘΕΣΣΑΛΟΝΙΚΗΣ",49,0]
["18-32379","ΘΕΟΦΥΛΑΚΤΙΔΟΥ ΝΙΚΟΛΕΤΤΑ","Ε.Α.Σ.ΟΛΥΜΠΙΑΔΑ",48,0]
["18-30709","ΣΜΥΡΛΟΓΛΟΥ ΧΡΙΣΤΙΝΑ-ΙΩΑΝΝΑ","Σ.Α.ΡΑΦΗΝΑΣ",48,0]
["18-28137","ΧΑΤΖΗΣΤΟΥΓΙΑΝΝΗ ΣΟΦΙΑ-ΜΑΡΙΑ","Σ.Α.ΣΕΡΡΩΝ",47,0]
["18-30708","ΒΑΣΙΛΕΙΑΔΟΥ ΠΟΛΥΞΕΝΗ","Ε.Σ.Ο.ΕΠΙΚΟΥΡΟΣ ΠΟΛΙΧΝΗΣ",46,0]
["18-27349","ΤΖΙΑΡΛΗ ΔΗΜΗΤΡΑ","Ο.Α.ΕΥΟΣΜΟΥ ΘΕΣΣΑΛΟΝΙΚΗΣ",46,0]
["18-32095","ΒΛΑΧΟΠΟΥΛΟΥ ΑΝΑΣΤΑΣΙΑ","ΚΕΡΚΥΡΑΪΚΗ Λ.Τ.",45,0]
["18-28455","ΑΝΔΡΕΟΠΟΥΛΟΥ ΝΕΦΕΛΗ","Α.Ο.Α.ΠΑΠΑΓΟΥ",44,0]
["18-29194","ΚΑΡΑΒΑ ΖΩΗ","Ο.Α.ΤΟΥΜΠΑΣ",44,0]
["18-29887","ΚΟΤΡΙΔΟΥ ΜΑΡΙΑ","Α.Σ.ΤΕΝΙΣ ΚΛΑΜΠ ΚΟΖΑΝΗΣ",44,0]
["18-27017","ΜΠΕΛΤΖΕΝΙΤΗ ΜΑΡΙΑ","Ο.Α.ΠΕΤΡΟΥΠΟΛΗΣ",44,0]
["18-29210","ΑΓΙΩΤΗ ΕΛΕΝΗ","Ο.Α.ΜΑΓΝΗΣΙΑΣ",43,0]
["18-29281","ΠΑΝΤΕΛΑΚΗ ΒΙΟΛΕΤΑ","Γ.Σ.ΚΗΦΙΣΙΑΣ",43,0]
["18-30158","ΧΕΛΙΔΩΝΗ ΚΑΛΛΙΟΠΗ","ΗΡΑΚΛΕΙΟ Ο.Α.& Α.",43,0]
["18-27665","ΚΑΒΑΓΙΟΥ ΒΑΛΕΝΤΙΝΗ","Ο.Α.ΚΕΡΑΤΣΙΝΙΟΥ",42,0]
["18-26831","ΜΑΝΟΥΡΗ ΜΑΡΙΑ","Γ.Ο.ΠΕΡΙΣΤΕΡΙΟΥ Γ.ΠΑΛΑΣΚΑΣ",42,0]
["18-31348","ΧΡΙΣΤΟΠΟΥΛΟΥ ΧΡΙΣΤΙΝΑ","ΡΗΓΑΣ Α.Ο.Α.ΑΡΓΟΛΙΔΑΣ",42,0]
["18-26298","ΝΑΤΣΗ ΚΩΝΣΤΑΝΤΙΝΑ","Σ.Α.ΡΑΦΗΝΑΣ",40,0]
["18-23605","ΤΑΣΗ ΟΡΣΑΛΙΑ","Α.Ο.Α.ΑΙΓΑΛΕΩ 92",40,0]
["18-22533","ΤΕΖΑΨΙΔΟΥ ΔΗΜΗΤΡΑ","Μ.Α.Σ.ΑΕΤΟΣ ΘΕΣΣΑΛΟΝΙΚΗΣ",40,0]
["18-27414","ΔΕΤΣΗ ΜΑΡΙΑΝ","Α.Ο.ΒΑΡΗΣ ΑΝΑΓΥΡΟΥΣ",39,0]
["18-26058","ΖΟΥΜΠΑ ΔΕΣΠΟΙΝΑ","Ο.Α.ΣΟΥΔΑΣ",38,0]
["18-26658","ΜΑΓΕΙΡΟΠΟΥΛΟΥ ΑΘΗΝΑ-ΛΥΔΙΑ","Α.Ο.Α.ΠΑΤΡΩΝ",38,0]
["18-28523","ΤΡΙΑΝΤΑΦΥΛΙΔΟΥ-ΚΟΥΛΟΥΡΙΩΤΟΥ ΚΑΛΛΙΟΠΗ","Ε.Σ.Ο.ΕΠΙΚΟΥΡΟΣ ΠΟΛΙΧΝΗΣ",38,0]
["18-32634","ΑΧΤΑΡΙΔΟΥ ΚΥΡΙΑΚΗ","Α.Ο.ΑΤΡΟΜΗΤΟΣ ΤΡΙΑΔΙΟΥ",37.5,0]
["18-90084","ΓΙΑΝΣΕΝ ΒΕΡΑ","ΠΕΥΚΗ Γ.ΚΑΛΟΒΕΛΩΝΗΣ",37.5,0]
["18-29991","ΚΑΠΑΖΟΓΛΟΥ ΜΑΡΘΑ","Α.Ο.ΑΤΡΟΜΗΤΟΣ ΤΡΙΑΔΙΟΥ",37.5,0]
["18-32365","ΣΤΑΥΡΑΚΗ ΚΩΝΣΤΑΝΤΙΝΑ","Α.Ο.ΒΑΡΗΣ ΑΝΑΓΥΡΟΥΣ",37,0]
["18-26160","ΒΙΡΒΙΔΑΚΗ ΧΡΥΣΟΥΛΑ","Α.Ο.Α.ΠΑΠΑΓΟΥ",36,0]
["18-29186","ΓΕΡΟΥΣΗ ΑΛΕΞΑΝΔΡΑ","Α.Ο.Α.ΣΤΑΥΡΟΥΠΟΛΗΣ ΙΦΙΤΟΣ",36,0]
["18-34997","ΣΙΑΦΛΑ ΜΑΡΙΑ-ΕΛΕΝΗ","Α.Ο.ΑΙΓΙΟΥ ΜΟΡΕΑΣ",36,0]
["18-29528","ΣΚΑΡΤΣΙΛΑ ΕΛΕΝΗ-ΑΝΝΑ","Α.Ο.ΑΙΓΙΟΥ ΜΟΡΕΑΣ",36,0]
["18-22546","ΑΝΤΩΝΙΟΥ ΑΝΑΣΤΑΣΙΑ","Α.Ε.Κ.ΤΡΙΠΟΛΗΣ",35,0]
["18-29250","ΓΙΤΣΟΠΟΥΛΟΥ ΜΑΡΙΑ-ΕΛΕΝΗ","Ο.Α.ΦΟΙΒΟΣ ΛΑΡΙΣΑΣ",35,0]
["18-25053","ΠΑΝΑΓΟΥΛΗ ΠΑΝΑΓΙΩΤΑ","Ο.Α.ΝΙΚΑΙΑ ΛΑΡΙΣΑΣ",35,0]
["18-28956","ΠΑΝΗ ΒΑΣΙΛΙΚΗ","Ο.Α.ΙΩΛΚΟΣ ΒΟΛΟΥ",35,0]
["18-27599","ΛΟΓΑΡΙΔΟΥ ΑΡΙΑΔΝΗ","Α.Ε.ΠΟΡΤΟ ΡΑΦΤΗ",33,0]
["18-28088","ΜΠΑΡΜΠΑΡΗ ΑΡΙΣΤΕΑ","Α.Κ.Α.ΜΑΡΑΘΩΝΑ",33,0]
["18-28699","ΒΡΥΩΝΗ ΒΑΣΙΛΙΚΗ","Ο.Α.ΚΑΛΑΜΑΤΑΣ",32,0]
["18-23000","ΚΟΝΤΑΞΗ ΑΙΚΑΤΕΡΙΝΗ","Α.Γ.Ο.ΦΙΛΙΠΠΙΑΔΑΣ",32,0]
["18-28287","ΜΩΡΑΪΤΗ ΑΝΑΣΤΑΣΙΑ","Α.Ο.ΑΙΓΙΟΥ ΜΟΡΕΑΣ",32,0]
["18-29590","ΧΑΛΑΡΗ ΑΝΝΑ","Σ.Α.ΡΑΦΗΝΑΣ",32,0]
["18-28454","ΜΑΥΡΙΑΝΟΥ ΧΡΙΣΤΙΝΑ","Α.Ο.Α.ΠΑΠΑΓΟΥ",31,0]
["18-25733","ΚΑΛΟΥΤΣΙΚΙΔΟΥ ΧΡΥΣΗ","Ο.Α.ΤΟΥΜΠΑΣ",30,0]
["18-27505","ΚΑΜΠΟΣΙΩΡΑ ΚΩΝΣΤΑΝΤΙΝΑ","Α.Ε.Τ.ΝΙΚΗ ΠΑΤΡΩΝ",30,0]
["18-25359","ΚΑΡΒΟΥΝΗ ΧΑΡΑΛΑΜΠΙΑ","Ο.Α.ΛΙΒΑΔΕΙΑΣ",30,0]
["18-26817","ΛΟΥΠΑ ΣΤΕΛΛΑ","Α.Ο.Π.ΦΑΛΗΡΟΥ",30,0]
["18-28593","ΜΑΓΓΙΝΑ ΔΗΜΗΤΡΑ","Α.Κ.Α.ΜΑΡΑΘΩΝΑ",30,0]
["18-30390","ΝΙΚΟΛΑΪΔΟΥ ΕΛΕΝΗ","Φ.Ο.Α.ΝΕΑΠΟΛΗΣ",30,0]
["18-28420","ΣΙΑΪΝΗ ΑΘΑΝΑΣΙΑ","Σ.Α.ΡΑΦΗΝΑΣ",30,0]
["18-25883","ΤΡΟΥΓΚΟΥ ΚΛΕΙΩ","Α.Ο.Α.ΠΑΠΑΓΟΥ",30,0]
["18-31330","ΧΡΗΣΤΟΥ ΚΩΝΣΤΑΝΤΙΝΑ","Ο.Α.ΙΩΛΚΟΣ ΒΟΛΟΥ",30,0]
["18-28136","ΚΙΜΟΓΛΟΥ ΜΑΡΙΑ-ΑΝΝΑ","Σ.Α.ΣΕΡΡΩΝ",29,0]
["18-31870","ΝΤΟΥΡΟΥ ΔΟΜΝΙΚΗ","ΡΗΓΑΣ Α.Ο.Α.ΑΡΓΟΛΙΔΑΣ",29,0]
["18-29604","ΔΡΟΥΓΚΑ ΕΛΕΥΘΕΡΙΑ","Α.Ο.Α.ΠΑΠΑΓΟΥ",28,0]
["18-27060","ΚΟΛΛΙΟΥ ΜΑΡΙΑ","Ο.Α.ΑΓΙΑΣ ΠΑΡΑΣΚΕΥΗΣ",28,0]
["18-25783","ΜΠΟΥΡΤΣΟΥΚΛΗ ΠΑΝΑΓΙΩΤΑ-ΡΑΦΑΗΛΙΑ","Α.Ε.Κ.ΤΡΙΠΟΛΗΣ",28,0]
["18-29807","ΠΑΠΑΔΟΠΟΥΛΟΥ ΙΩΑΝΝΑ","Ο.Α.ΓΛΥΦΑΔΑΣ",28,0]
["18-31407","ΚΑΜΠΟΥΡΗ ΓΡΑΜΜΑΤΙΚΗ","ΡΟΔΙΑΚΟΣ Ο.Α.",27,0]
["18-28991","ΚΑΡΑΜΑΝΛΗ ΜΑΡΙΑ","Ο.Α.ΙΩΛΚΟΣ ΒΟΛΟΥ",27,0]
["18-26529","ΣΑΠΟΥΝΤΖΗ ΠΑΣΧΑΛΙΝΑ","Ο.Α.ΑΡΙΔΑΙΑΣ",27,0]
["18-31347","ΜΗΤΣΑΝΟΥ ΚΩΝΣΤΑΝΤΙΝΑ","ΡΗΓΑΣ Α.Ο.Α.ΑΡΓΟΛΙΔΑΣ",26,0]
["18-28687","ΠΑΛΛΗ ΧΡΙΣΤΙΝΑ","Γ.Ο.ΠΕΡΙΣΤΕΡΙΟΥ Γ.ΠΑΛΑΣΚΑΣ",26,0]
["18-29137","ΠΑΠΑΔΟΠΟΥΛΟΥ ΕΛΕΥΘΕΡΙΑ","Ο.Α.ΕΥΟΣΜΟΥ ΘΕΣΣΑΛΟΝΙΚΗΣ",26,0]
["18-32400","ΔΡΑΚΟΥ ΑΝΔΡΙΑΝΝΑ","Α.Ο.ΒΑΡΗΣ ΑΝΑΓΥΡΟΥΣ",25,0]
["18-24637","ΚΑΡΑΧΑΛΙΟΥ ΑΝΤΩΝΙΑ","Ο.Α.ΝΙΚΑΙΑ ΛΑΡΙΣΑΣ",25,0]
["18-33740","ΜΠΟΥΡΑΖΑ ΑΝΤΩΝΙΑ","Α.Ο.Α.ΗΛΙΟΥΠΟΛΗΣ",25,0]
["18-24786","ΣΤΡΑΤΑΚΟΥ ΑΘΑΝΑΣΙΑ","Α.Ο.Α.ΧΑΪΔΑΡΙΟΥ",25,0]
["18-32328","ΑΝΤΩΝΙΑΔΟΥ-ΣΑΜΑΡΤΖΙΔΟΥ ΣΟΦΙΑ-ΜΑΡΤΙΝΑ","Ο.Α.ΤΟΥΜΠΑΣ",24,0]
["18-34594","ΑΥΓΕΡΙΝΟΥ ΑΘΑΝΑΣΙΑ","Ε.Α.Σ.ΟΛΥΜΠΙΑΔΑ",24,0]
["18-26219","ΚΩΣΤΑ ΑΓΓΕΛΙΚΗ","ΚΕΦΑΛΛΗΝΙΑΚΟΣ Ο.Α.",24,0]
["18-32876","ΜΟΡΣΙ ΡΑΝΙΑ","Ο.Α.ΚΑΙΣΑΡΙΑΝΗΣ",24,0]
["18-26568","ΜΟΥΡΤΖΙΟΥ ΜΑΡΙΑ-ΑΝΝΑ","Α.Ο.ΚΑΒΑΛΑΣ ΜΑΚΕΔΟΝΙΚΟΣ",24,0]
["18-26717","ΓΕΡΑΚΙΝΗ ΙΩΑΝΝΑ-ΣΜΑΡΩ","Α.Ο.ΚΑΒΑΛΑΣ ΜΑΚΕΔΟΝΙΚΟΣ",23,0]
["18-29523","ΜΑΛΕΒΙΤΗ ΕΙΡΗΝΗ","Α.Ο.ΑΙΓΙΟΥ ΜΟΡΕΑΣ",22,0]
["18-33511","ΣΤΑΘΗ ΣΤΥΛΙΑΝΗ","Ε.Α.Σ.ΟΛΥΜΠΙΑΔΑ",22,0]
["18-30247","ΧΑΡΙΣΤΟΥ ΣΟΦΙΑ","Α.Σ.ΑΚΑΔΗΜΙΕΣ ΠΡΩΤΑΘΛΗΤΩΝ ΠΕΥΚΩΝ",22,0]
["18-29706","ΚΑΡΑΓΕΩΡΓΟΥ ΜΑΡΙΑ","Ο.Α.ΑΡΤΑΣ",21,0]
["18-30932","ΑΜΠΑΤΖΙΔΗ ΝΑΤΑΛΙΑ","Α.Ο.ΛΑΤΩ ΑΓ.ΝΙΚΟΛΑΟΥ",20,0]
["18-30334","ΓΙΑΝΝΟΥΤΣΟΥ ΜΥΡΤΩ","Α.Σ.Α.ΠΑΜΒΩΤΙΣ ΙΩΑΝΝΙΝΩΝ",20,0]
["18-28328","ΕΥΜΟΡΦΙΔΟΥ ΘΕΟΔΟΤΑ","Ο.Α.ΝΕΣΤΩΡΑΣ ΓΙΑΝΝΙΤΣΩΝ",20,0]
["18-32007","ΚΑΛΟΥΜΕΝΟΥ ΜΑΡΙΑ-ΘΗΡΕΣΙΑ","Α.Κ.Α.ΜΑΡΑΘΩΝΑ",20,0]
["18-29731","ΚΩΝΣΤΑΝΤΟΠΟΥΛΟΥ ΗΛΙΑΝΑ","ΑΙΟΛΟΣ Α.Λ.ΙΛΙΟΥ",20,0]
["18-32710","ΜΟΥΡΤΖΑΚΗ ΧΑΡΙΚΛΕΙΑ","Ο.Α.ΧΕΡΣΟΝΗΣΟΥ",20,0]
["18-32570","ΣΤΕΡΓΙΟΠΟΥΛΟΥ ΖΩΗ","Ο.Α.ΑΓΙΑΣ ΠΑΡΑΣΚΕΥΗΣ",20,0]
["18-31104","ΑΣΤΡΕΙΝΙΔΗ ΑΛΕΞΑΝΔΡΑ","Α.Ο.Α.ΠΑΠΑΓΟΥ",19,0]
["18-28816","ΒΛΑΧΟΥΤΣΗ ΠΕΤΡΟΥΛΑ","ΡΗΓΑΣ Α.Ο.Α.ΑΡΓΟΛΙΔΑΣ",19,0]
["18-30990","ΓΚΙΘΚΟΠΟΥΛΟΥ ΕΛΕΝΗ","Ο.Α.ΚΑΛΑΜΑΚΙΟΥ",19,0]
["18-34428","ΝΟΥΛΑ ΣΟΦΙΑ","Γ.Ε.ΠΡΕΒΕΖΑΣ",19,0]
["18-28673","ΒΕΡΓΟΥ ΣΤΑΥΡΟΥΛΑ","Α.Ο.Α.ΠΑΠΑΓΟΥ",18,0]
["18-29536","ΧΑΪΔΗ ΜΑΡΙΝΑ-ΚΩΝΣΤΑΝΤΙΝΑ","ΦΘΙΩΤΙΚΟΣ Ο.Α.",18,0]
["18-30903","ΑΣΗΜΟΠΟΥΛΟΥ ΑΙΚΑΤΕΡΙΝΗ","Α.Σ.Α.ΠΑΝΟΡΑΜΑΤΟΣ",17,0]
["18-29858","ΔΑΝΙΗΛ ΑΡΓΥΡΩ","ΦΘΙΩΤΙΚΟΣ Ο.Α.",17,0]
["18-29296","ΛΑΜΠΡΟΥ ΕΛΕΝΗ","Α.Ο.ΜΕΓΑΣ ΑΛΕΞΑΝΔΡΟΣ",17,0]
["18-28452","ΜΑΡΤΑΚΟΥ-ΓΑΛΙΑΤΣΑΤΟΥ ΚΑΤΕΡΙΝΑ","Α.Ο.Α.ΠΑΠΑΓΟΥ",17,0]
["18-30117","ΜΠΑΖΟΥ ΕΥΑΓΓΕΛΙΑ","ΝΑΥΠΛΙΑΚΟΣ Ο.Α.",17,0]
["18-33447","ΤΣΕΣΜΕΤΖΗ ΜΑΡΙΑΝΘΗ","Ο.Α.ΛΕΣΒΟΥ",17,0]
["18-32366","ΦΡΑΓΚΙΣΤΑ ΙΖΑΜΠΕΛΛΑ","Α.Ο.ΜΕΓΑΣ ΑΛΕΞΑΝΔΡΟΣ",17,0]
["18-28397","ΧΑΤΖΗΚΥΡΙΑΚΟΥ ΙΩΑΝΝΑ","Ο.Α.ΑΡΙΔΑΙΑΣ",17,0]
["18-30043","ΔΟΥΡΟΥ ΑΝΑΣΤΑΣΙΑ","Ο.Α.ΤΟΥΜΠΑΣ",16,0]
["18-24531","ΚΑΡΔΑΜΑΝΙΔΗ ΑΙΚΑΤΕΡΙΝΗ","Α.Ο.Α.ΧΑΪΔΑΡΙΟΥ",16,0]
["18-30352","ΓΕΩΡΓΟΥΣΗ ΠΑΝΑΓΙΩΤΑ","ΦΙΛΑΘΛΗΤ.ΣΥΛ.ΛΑΜΙΑΣ",15,0]
["18-29464","ΖΑΓΑΡΗ ΦΡΕΙΔΕΡΙΚΗ","Ο.Α.ΒΙΚΕΛΑΣ ΒΕΡΟΙΑΣ",15,0]
["18-32473","ΑΓΓΕΛΟΠΟΥΛΟΥ ΧΡΙΣΤΙΝΑ-ΠΑΡΑΣΚΕΥΗ","Γ.Ο.ΠΕΡΙΣΤΕΡΙΟΥ Γ.ΠΑΛΑΣΚΑΣ",14,0]
["18-32471","ΓΙΑΝΝΟΠΟΥΛΟΥ ΦΩΤΕΙΝΗ","Γ.Ο.ΠΕΡΙΣΤΕΡΙΟΥ Γ.ΠΑΛΑΣΚΑΣ",14,0]
["18-27043","ΚΑΡΑΒΙΩΤΗ ΑΘΗΝΑ","Ο.Α.ΤΟΥΜΠΑΣ",14,0]
["18-29497","ΔΕΜΕΛΙΔΗ ΑΝΑΣΤΑΣΙΑ","Α.Ο.ΒΑΡΗΣ ΑΝΑΓΥΡΟΥΣ",12,0]
["18-28476","ΚΑΡΑΒΑΝΑ ΙΩΑΝΝΑ","Α.Ο.ΒΑΡΗΣ ΑΝΑΓΥΡΟΥΣ",12,0]
["18-22813","ΚΩΝΣΤΑΝΤΑΚΗ ΙΩΑΝΝΑ","Γ.Σ.ΛΙΒΥΚΟΣ ΙΕΡΑΠΕΤΡΑΣ",12,0]
["18-29732","ΚΩΝΣΤΑΝΤΟΠΟΥΛΟΥ ΓΕΩΡΓΙΑ","ΑΙΟΛΟΣ Α.Λ.ΙΛΙΟΥ",11,0]
["18-28607","ΓΑΒΡΙΗΛΙΔΟΥ ΧΡΙΣΤΙΝΑ","Ο.Α.ΚΙΛΚΙΣ",10,0]
["18-29531","ΓΚΑΜΠΑΕΡΙΔΟΥ ΑΝΝΑ-ΜΑΡΙΑ","Ο.Α.ΑΛΕΞΑΝΔΡΟΥΠΟΛΗΣ",10,0]
["18-24685","ΚΟΥΚΛΑΚΗ ΕΛΕΝΗ","Ο.Α.ΧΑΝΙΩΝ",10,0]
["18-28622","ΛΙΑΝΙΔΟΥ ΑΝΤΩΝΙΑ","Ο.Α.ΒΙΚΕΛΑΣ ΒΕΡΟΙΑΣ",10,0]
["18-24601","ΜΙΧΑΗΛΑΚΗ ΛΟΥΙΖΑ-ΑΝΑΤΟΛΗ","Α.Ο.Α.ΝΕΑΣ ΠΕΡΑΜΟΥ ΟΙ ΤΙΤΑΝΕΣ",10,0]
["18-26449","ΠΑΠΑΝΙΚΟΛΑΟΥ ΔΗΜΗΤΡΑ","Ο.Α.ΑΝΑΤΟΛΙΚΗΣ ΦΘΙΩΤΙΔΑΣ",10,0]
["18-34208","ΣΟΥΡΔΗ ΕΛΕΝΗ","Α.Ο.ΤΑΤΟΪΟΥ",10,0]
["18-33714","ΣΠΥΡΑΚΟΥ ΣΠΥΡΙΔΟΥΛΑ","ΑΙΟΛΟΣ Α.Λ.ΙΛΙΟΥ",10,0]
["18-33629","ΣΥΡΙΝΟΓΛΟΥ ΚΑΛΛΙΡΟΗ","Α.Α.ΑΙΓΑΛΕΩ",10,0]
["18-30891","ΤΑΒΛΑ ΕΛΕΝΗ","Α.Ο.ΛΑΤΩ ΑΓ.ΝΙΚΟΛΑΟΥ",10,0]
["18-30146","ΓΚΕΚΑ ΒΑΣΙΛΙΚΗ","Α.Ε.Κ.ΤΡΙΠΟΛΗΣ",9,0]
["18-29863","ΛΑΝΤΖΗ ΛΟΥΙΖΑ","Ο.Α.ΓΛΥΦΑΔΑΣ",9,0]
["18-29442","ΜΑΚΡΥΝΑΚΗ ΜΕΛΙΝΑ","Α.Κ.Α.ΜΑΡΑΘΩΝΑ",9,0]
["18-31371","ΣΚΟΥΤΕΛΗ ΣΕΡΑΦΕΙΝΑ","ΡΟΔΙΑΚΗ ΑΚΑΔ.ΑΝΤΙΣΦ.",9,0]
["18-34563","ΒΕΛΙΣΣΑΡΗ ΜΕΛΠΟΜΕΝΗ","Σ.Α.ΤΡΙΠΟΛΗΣ",8,0]
["18-28655","ΓΙΑΚΟΥΜΑΚΗ ΑΦΡΟΔΙΤΗ","Ο.Α.ΡΕΘΥΜΝΟΥ",8,0]
["18-29333","ΚΑΖΑΜΙΑ ΚΑΤΕΡΙΝΑ","Α.Ο.Α.ΣΤΑΥΡΟΥΠΟΛΗΣ ΙΦΙΤΟΣ",8,0]
["18-26208","ΚΑΣΙΟΥΡΑ ΓΕΩΡΓΙΑ-ΝΕΦΕΛΗ","Γ.Σ.ΚΗΦΙΣΙΑΣ",8,0]
["18-31121","ΚΟΥΜΠΑΤΗ ΚΩΝΣΤΑΝΤΙΝΑ","Ε.Α.Σ.ΟΛΥΜΠΙΑΔΑ",8,0]
["18-25498","ΜΑΡΕΔΗ ΣΠΥΡΙΔΟΥΛΑ","Ο.Α.ΜΑΓΝΗΣΙΑΣ",8,0]
["18-28779","ΜΑΡΙΝΟΠΟΥΛΟΥ ΧΡΙΣΤΙΝΑ","Ο.Α.ΑΘΗΝΩΝ",8,0]
["18-33470","ΜΥΛΩΝΑ ΑΙΚΑΤΕΡΙΝΗ","Ο.Α.ΒΕΡΟΙΑΣ",8,0]
["18-29609","ΠΙΝΑΚΑ ΜΑΡΙΑ","Ο.Α.ΜΑΓΝΗΣΙΑΣ",8,0]
["18-28628","ΠΟΥΤΟΥ ΑΝΝΑ","Ο.Α.ΣΑΛΑΜΙΝΑΣ",8,0]
["18-32906","ΣΙΟΝΤΗ ΗΡΩ","Ο.Α.ΙΩΑΝΝΙΝΩΝ",8,0]
["18-34298","ΣΚΟΙΝΙΩΤΗ ΣΤΑΥΡΙΕΛΑ","Α.Ε.Τ.ΝΙΚΗ ΠΑΤΡΩΝ",8,0]
["18-33692","ΔΙΑΚΟΥ-ΚΟΝΤΕ ΜΥΡΤΩ","Α.Ο.Α.ΗΛΙΟΥΠΟΛΗΣ",7,0]
["18-30562","ΚΟΡΝΑΡΟΥ ΒΑΣΙΛΙΚΗ","Α.Ε.Τ.ΝΙΚΗ ΠΑΤΡΩΝ",7,0]
["18-29784","ΜΠΙΤΣΙΟΥ ΓΕΩΡΓΙΑ","Α.Α.ΑΙΓΑΛΕΩ",7,0]
["18-29771","ΡΙΖΟΠΟΥΛΟΥ ΜΑΡΙΑ-ΙΩΑΝΝΑ","Ο.Α.ΚΑΒΑΛΑΣ ΑΛΕΞΑΝΔΡΟΣ",7,0]
["18-30047","ΣΤΑΜΑΤΗ ΕΝΑΤΙΝΑ-ΑΘΗΝΑ","Α.Ο.Α.ΗΛΙΟΥΠΟΛΗΣ",7,0]
["18-24755","ΑΓΓΕΛΑΚΗ ΑΝΝΑ","Α.Σ.Α.ΛΑΡΙΣΑΣ",6,0]
["18-33096","ΕΛΕΥΘΕΡΙΑΔΟΥ ΕΛΕΝΗ","Ο.Α.ΤΟΥΜΠΑΣ",6,0]
["18-28672","ΚΟΡΔΕΑ ΙΩΑΝΝΑ","Σ.Φ.Φ.Α.Η ΑΜΙΛΛΑ",6,0]
["18-27935","ΚΟΥΤΡΑ ΜΑΡΟΥΣΩ","Ο.Α.ΠΑΡΟΥ",6,0]
["18-34873","ΚΥΡΙΑΚΟΠΟΥΛΟΥ ΣΤΕΛΛΑ-ΠΗΓΗ","Ο.Α.ΠΕΤΑΛΟΥΔΩΝ",6,0]
["18-28203","ΠΑΠΑΔΟΠΟΥΛΟΥ ΣΙΜΩΝΗ","ΡΟΔΙΑΚΟΣ Ο.Α.",6,0]
["18-23784","ΠΑΠΑΚΩΝΣΤΑΝΤΙΝΟΥ ΜΑΡΙΑ","Ο.Α.ΚΕΡΑΤΣΙΝΙΟΥ",6,0]
["18-34330","ΠΕΧΛΙΒΑΝΗ ΜΑΡΙΑΝΝΑ","Α.Σ.ΟΛΥΜΠΙΑΚΟΥ ΧΩΡΙΟΥ Ο ΦΟΙΒΟΣ",6,0]
["18-27044","ΣΜΥΡΛΗ ΧΡΙΣΤΙΑΝΑ","Ο.Α.ΘΕΣΣΑΛΟΝΙΚΗΣ",6,0]
["18-30021","ΣΤΑΥΡΟΠΟΥΛΟΥ ΣΤΥΛΙΑΝΗ","Α.Κ.Α.ΜΑΡΑΘΩΝΑ",6,0]
["18-27409","ΦΟΥΚΑ ΕΥΜΟΡΦΙΑ","Α.Ο.Α.ΑΙΓΑΛΕΩ 92",6,0]
["18-29461","ΧΑΪΖΙΝΧΑ ΕΛΙΖΑ","ΑΙΟΛΟΣ Α.Λ.ΙΛΙΟΥ",6,0]
["18-33205","ΚΑΡΑΓΚΙΑΟΥΡΗ ΣΤΥΛΙΑΝΗ","Α.Ο.Α.ΚΑΒΑΛΑΣ",5,0]
["18-30892","ΚΟΥΤΟΥΛΑΚΗ ΜΑΡΙΑ","Α.Ο.ΛΑΤΩ ΑΓ.ΝΙΚΟΛΑΟΥ",5,0]
["18-28785","ΚΟΥΤΣΙΚΟΠΟΥΛΟΥ ΜΑΡΙΑΝΘΗ","Ο.Α.ΝΙΚΑΙΑ ΛΑΡΙΣΑΣ",5,0]
["18-32958","ΚΩΝΣΤΑΝΤΙΝΙΔΗ ΧΡΙΣΤΙΝΑ","ΖΑΚΥΝΘΙΝΟΣ Α.Ο.Α",5,0]
["18-31475","ΜΥΛΩΝΑ ΛΗΔΑ-ΣΤΥΛΙΑΝΗ","Ο.Α.ΓΛΥΦΑΔΑΣ",5,0]
["18-30316","ΠΑΡΜΕΝΙΔΟΥ ΑΙΚΑΤΕΡΙΝΗ","Ο.Α.ΚΑΒΑΛΑΣ ΑΛΕΞΑΝΔΡΟΣ",5,0]
["18-33209","ΠΙΣΤΙΟΛΑ ΑΝΝΑ","Ο.Α.ΙΩΑΝΝΙΝΩΝ",5,0]
["18-32698","ΠΟΝΤΙΚΑΚΗ ΑΙΚΑΤΕΡΙΝΗ","Ο.Α.ΣΟΥΔΑΣ",5,0]
["18-28868","ΣΤΙΝΗ ΕΙΡΗΝΗ-ΜΑΡΙΑ","Ο.Α.ΚΕΡΚΥΡΑΣ",5,0]
["18-28869","ΣΤΙΝΗ ΠΑΝΑΓΙΩΤΑ","Ο.Α.ΚΕΡΚΥΡΑΣ",5,0]
["18-31646","ΚΑΤΣΙΓΙΑΝΝΗ ΑΘΗΝΑ","Α.Ε.Τ.ΝΙΚΗ ΠΑΤΡΩΝ",4,0]
["18-24351","ΚΟΥΤΗ ΕΙΡΗΝΗ","Ο.Α.ΣΟΦΑΔΩΝ ΚΑΡΔΙΤΣΑΣ",4,0]
["18-28698","ΜΑΡΓΕΛΗ ΟΛΓΑ","Ο.Α.ΚΑΛΑΜΑΤΑΣ",4,0]
["18-27934","ΜΑΥΡΗ ΔΟΜΙΝΙΚΗ-ΤΑΤΙΑΝΗ","Ο.Α.ΠΑΡΟΥ",4,0]
["18-32849","ΜΙΟΥΜΠΗ ΚΩΝΣΤΑΝΤΙΝΑ-ΓΙΑΣΜΙΝ","Ο.Α.ΧΑΝΙΩΝ",4,0]
["18-31290","ΝΙΚΟΛΑΪΔΟΥ ΡΑΦΑΕΛΛΑ","Γ.Α.Σ.ΚΑΡΑΤΕ ΕΡΜΗΣ",4,0]
["18-28630","ΝΙΚΟΛΑΟΥ ΠΑΝΩΡΑΙΑ","ΑΙΟΛΟΣ Α.Λ.ΙΛΙΟΥ",4,0]
["18-35121","ΠΑΠΑΔΕΑ ΔΗΜΗΤΡΑ","Ο.Α.ΡΙΟΥ",4,0]
["18-33402","ΠΑΠΑΪΩΑΝΝΟΥ ΑΝΑΣΤΑΣΙΑ","Α.Γ.Ο.ΦΙΛΙΠΠΙΑΔΑΣ",4,0]
["18-33757","ΠΑΠΠΑ ΑΘΑΝΑΣΙΑ","Ο.Α.ΡΙΟΥ",4,0]
["18-29297","ΠΟΝΗΡΙΔΗ ΗΛΕΚΤΡΑ","Α.Ο.ΜΕΓΑΣ ΑΛΕΞΑΝΔΡΟΣ",4,0]
["18-30511","ΣΑΜΑΡΑ ΧΡΥΣΑΥΓΗ","Ο.Α.ΑΡΙΔΑΙΑΣ",4,0]
["18-31797","ΣΕΡΓΟΥΛΟΠΟΥΛΟΥ ΜΑΡΙΑ-ΕΛΕΝΗ","Α.Ο.Α.ΠΑΠΑΓΟΥ",4,0]
["18-29799","ΣΤΕΦΑΝΙΔΟΥ ΑΝΘΙΑ","Ο.Α.ΒΕΡΟΙΑΣ",4,0]
["18-28483","ΣΩΤΗΡΑ ΚΛΕΟΠΑΤΡΑ","Α.Ε.Κ.ΤΡΙΠΟΛΗΣ",4,0]
["18-33993","ΤΖΙΟΥΜΗ ΓΕΩΡΓΙΑ","Α.Ε.Κ.ΤΡΙΠΟΛΗΣ",4,0]
["18-32756","ΤΖΟΥΡΑ ΕΥΑΓΓΕΛΙΑ","Α.Ο.ΑΙΓΙΟΥ ΜΟΡΕΑΣ",4,0]
["18-28068","ΤΣΙΤΟΥΡΗ ΕΛΕΝΑ","Α.Σ.Α.ΑΓΡΙΝΙΟΥ",4,0]
["18-27178","ΦΕΤΣΙΟΥ ΚΑΤΕΡΙΝΑ","ΠΑΝΘΡΑΚΙΚΟΣ Ο.Α.ΚΟΜΟΤΗΝΗΣ",4,0]
["18-32038","ΑΝΤΩΝΟΠΟΥΛΟΥ ΚΩΝΣΤΑΝΤΙΝΑ","Ε.Σ.Ο.ΕΠΙΚΟΥΡΟΣ ΠΟΛΙΧΝΗΣ",3,0]
["18-28188","ΓΑΛΑΝΑΚΗ ΖΑΧΑΡΕΝΙΑ","Γ.Σ.ΛΙΒΥΚΟΣ ΙΕΡΑΠΕΤΡΑΣ",3,0]
["18-31638","ΓΑΝΙΤΗ ΚΑΛΛΙΟΠΗ","Ν.Ο.Ν.Α.Μ",3,0]
["18-33502","ΚΑΚΑΚΗ ΚΟΜΗΣΑ-ΣΤΑΥΡΟΥΛΑ","ΡΟΔΙΑΚΟΣ Ο.Α.",3,0]
["18-30447","ΚΙΛΙΓΚΑΡΙΔΟΥ ΙΩΑΝΝΑ","Ε.Α.Σ.ΟΛΥΜΠΙΑΔΑ",3,0]
["18-27579","ΚΟΓΙΑ ΜΕΛΙΝΑ","Α.Ο.ΒΑΡΗΣ ΑΝΑΓΥΡΟΥΣ",3,0]
["18-32201","ΚΟΚΚΟΡΗ ΕΙΡΗΝΗΥ-ΕΛΕΝΗ","Ο.Α.ΣΥΡΟΥ",3,0]
["18-25380","ΚΟΤΡΩΤΣΙΟΥ ΣΤΕΦΑΝΙΑ","Α.Σ.Α.ΛΑΡΙΣΑΣ",3,0]
["18-27110","ΛΑΝΤΖΗ ΛΟΥΙΖΑ","Ο.Α.ΑΘΗΝΩΝ",3,0]
["18-32223","ΛΟΥΠΑ ΧΑΡΙΣ","Σ.Α.ΕΛΑΣΣΟΝΑΣ",3,0]
["18-28969","ΜΟΡΦΟΝΙΟΥ ΑΙΚΑΤΕΡΙΝΗ","Ο.Α.ΑΘΗΝΩΝ",3,0]
["18-29118","ΜΠΙΖΟΠΟΥΛΟΥ ΠΕΛΑΓΙΑ","Ο.Α.ΤΟΥΜΠΑΣ",3,0]
["18-29867","ΠΑΛΙΕΡΑΚΗ ΧΡΥΣΑ","Ο.Α.ΡΕΘΥΜΝΟΥ",3,0]
["18-34652","ΠΑΠΑΘΑΝΑΣΙΟΥ ΔΗΜΗΤΡΑ","Σ.Α.ΕΛΑΣΣΟΝΑΣ",3,0]
["18-28436","ΣΑΡΗ ΣΤΑΥΡΟΥΛΑ","Ο.Α.ΠΑΡΟΥ",3,0]
["18-25108","ΣΤΑΜΠΟΥΛΗ ΒΑΣΙΛΙΚΗ","Ο.Α.ΕΥΟΣΜΟΥ ΘΕΣΣΑΛΟΝΙΚΗΣ",3,0]
["18-28111","ΧΑΡΑΛΑΜΠΟΠΟΥΛΟΥ ΙΩΑΝΝΑ","Α.Ε.Κ.ΤΡΙΠΟΛΗΣ",3,0]
["18-31370","ΧΟΡΒΑΛΗ ΜΥΡΤΩ","Φ.Σ.ΚΑΛΛΙΘΕΑΣ",3,0]
["18-29847","ΧΡΟΝΙΔΟΥ ΕΛΕΝΗ","Ο.Α.ΚΑΙΣΑΡΙΑΝΗΣ",3,0]
["18-29848","ΧΡΟΝΙΔΟΥ ΕΥΡΙΔΙΚΗ","Ο.Α.ΚΑΙΣΑΡΙΑΝΗΣ",3,0]
["18-28316","ΑΝΔΡΕΑΔΟΥ ΜΕΛΙΝΑ","Μ.Γ.Σ.ΑΠΟΛΛΩΝ ΚΑΛΑΜΑΡΙΑΣ",2,0]
["18-22950","ΒΑΒΟΥΡΑΚΗ ΕΙΡΗΝΗ","Ο.Α.ΖΩΓΡΑΦΟΥ",2,0]
["18-34698","ΒΑΡΣΑΜΟΥ ΑΙΚΑΤΕΡΙΝΗ","ΠΑΝΕΛΛΗΝΙΟΣ Γ.Σ.",2,0]
["18-34933","ΚΟΝΤΕ ΠΑΡΑΣΚΕΥΗ","Α.Ο.ΒΑΡΗΣ ΑΝΑΓΥΡΟΥΣ",2,0]
["18-24482","ΚΟΝΤΟΓΕΩΡΓΑ ΧΡΙΣΤΙΝΑ","Σ.Φ.Α.ΜΕΛΙΣΣΙΩΝ Ο ΦΟΙΒΟΣ",2,0]
["18-33562","ΜΑΡΓΕΛΟΥ ΚΑΤΕΡΙΝΑ","Α.Σ.ΠΕΡΑ",2,0]
["18-26453","ΜΕΓΑΓΙΑΝΝΗ ΚΩΝΣΤΑΝΤΙΝΑ","Σ.Φ.Α.ΜΕΛΙΣΣΙΩΝ Ο ΦΟΙΒΟΣ",2,0]
["18-33662","ΜΗΤΣΟΤΑΚΗ ΣΟΦΙΑ-ΜΑΡΙΑ","Α.Ο.Α.ΦΙΛΟΘΕΗΣ",2,0]
["18-34291","ΠΑΠΑΔΙΑΜΑΝΤΗ ΖΩΗ","Α.Σ.ΠΕΡΑ",2,0]
["18-34398","ΠΑΠΑΕΥΘΥΜΙΟΥ ΕΥΑΓΓΕΛΙΑ-ΦΑΙΔΡΑ","Α.Σ.ΟΡΦΕΑΣ ΛΑΡΙΣΑΣ",2,0]
["18-32348","ΠΕΠΕΛΙΔΟΥ ΑΙΚΑΤΕΡΙΝΗ","Φ.Ο.Α.ΝΕΑΠΟΛΗΣ",2,0]
["18-34892","ΣΒΙΡΙΔΟΥ ΚΑΤΕΡΙΝΑ","Ο.Α.ΣΥΡΟΥ",2,0]
["18-31400","ΣΕΛΙΒΑΝΩΦ ΜΑΡΙΑ","Α.Σ.Α.ΠΑΝΟΡΑΜΑΤΟΣ",2,0]
["18-28453","ΧΑΤΖΗΙΩΑΝΝΟΥ ΠΕΡΣΕΦΟΝΗ","Ο.Α.ΞΑΝΘΗΣ",2,0]
["18-29986","ΑΝΔΡΟΥΛΑΚΗ ΙΩΑΝΝΑ-ΜΕΛΙΤΙΝΗ","Ο.Α.ΚΑΙΣΑΡΙΑΝΗΣ",1,0]
["18-30132","ΚΑΛΦΑΟΓΛΟΥ ΑΘΗΝΑ","Α.Ο.ΚΑΛΛΙΤΕΧΝΟΥΠΟΛΗΣ",1,0]
["18-30124","ΚΕΦΑΛΙΑΚΟΥ ΝΑΤΑΛΙΑ","Α.Ο.Α.ΠΑΠΑΓΟΥ",1,0]
["18-29722","ΚΟΝΤΟΜΙΧΑΛΟΥ ΣΟΦΙΑ-ΧΑΡΤ","Ο.Α.ΑΘΗΝΩΝ",1,0]
["18-28437","ΜΑΟΥΝΗ ΑΙΚΑΤΕΡΙΝΗ","Ο.Α.ΠΑΡΟΥ",1,0]
["18-27063","ΠΑΠΑΔΟΠΟΥΛΟΥ ΠΑΝΑΓΙΩΤΑ-ΔΕΣΠΟΙΝΑ","Α.Ο.Α.ΗΛΙΟΥΠΟΛΗΣ",1,0]
["18-28471","ΤΡΟΥΛΟΥ ΧΡΙΣΤΙΝΑ","Ο.Α.ΤΟΥΜΠΑΣ",1,0]
["18-32899","ΑΡΓΥΡΙΟΥ ΑΙΚΑΤΕΡΙΝΗ","Α.Σ.Α.ΛΑΡΙΣΑΣ",0,0]
["18-29438","ΚΑΡΙΠΙΔΟΥ ΘΕΟΔΩΡΑ","Ο.Α.ΠΤΟΛΕΜΑΪΔΑΣ",0,0]
["18-31547","ΚΑΤΣΙΜΑΝΗ ΠΟΛΥΞΕΝΗ","Ο.Α.ΘΕΣΠΡΩΤΙΑΣ ΤΙΤΑΝΗ",0,0]
["18-32746","ΚΥΒΡΑΝΟΓΛΟΥ ΜΑΡΚΕΛΛΑ","Ο.Α.ΘΕΣΠΡΩΤΙΑΣ ΤΙΤΑΝΗ",0,0]
["18-25109","ΛΙΟΥΤΑ ΒΑΡΒΑΡΑ-ΕΛΕΥΘΕΡΙΑ","Μ.Α.Σ.ΑΕΤΟΣ ΘΕΣΣΑΛΟΝΙΚΗΣ",0,0]
["18-25264","ΜΕΤΑΞΑ ΕΛΙΣΑΒΕΤ","Ο.Α.ΑΡΙΔΑΙΑΣ",0,0]
["18-34288","ΜΟΣΤΙΟΓΛΟΥ ΙΟΛΗ","Α.Σ.ΠΕΡΑ",0,0]
["18-28336","ΜΠΟΛΛΑ ΖΩΗ","Ο.Α.ΝΕΣΤΩΡΑΣ ΓΙΑΝΝΙΤΣΩΝ",0,0]
["18-34566","ΝΑΖΙΡΗ ΚΩΝΣΤΑΝΤΙΝΑ","Ο.Α.ΑΡΙΔΑΙΑΣ",0,0]
["18-31546","ΝΙΚΟΛΑΟΥ ΑΘΗΝΑ","Ο.Α.ΘΕΣΠΡΩΤΙΑΣ ΤΙΤΑΝΗ",0,0]
["18-90109","ΠΑΝΤΟΥΡΑΡΟΥ ΜΑΡΙΑ-ΛΟΥΙΖΑ","Ο.Α.ΑΘΗΝΩΝ",0,0]
["18-27102","ΠΑΠΑΗΛΙΟΥ ΒΑΣΙΛΙΚΗ","Α.Ε.Κ.ΤΡΙΠΟΛΗΣ",0,0]
["18-22342","ΠΑΠΑΪΩΑΝΝΟΥ ΕΥΑΓΓΕΛΙΑ","Α.Ο.Α.ΧΑΪΔΑΡΙΟΥ",0,0]
["18-30765","ΠΑΡΑΣΚΕΥΟΥΔΗ ΑΝΑΣΤΑΣΙΑ","Φ.Ο.Α.ΝΕΑΠΟΛΗΣ",0,0]
["18-30955","ΠΟΣΤΑΝΤΖΙΑΝ ΜΑΡΚΕΛΛΑ","Ο.Α.ΠΕΤΡΟΥΠΟΛΗΣ",0,0]
["18-30054","ΣΑΚΕΛΛΑΡΙΔΗΣ ΜΙΧΑΛΗΣ","Ο.Α.ΑΓΙΑΣ ΠΑΡΑΣΚΕΥΗΣ",0,0]
["18-31672","ΣΙΔΗΡΟΠΟΥΛΟΥ ΚΥΡΙΑΚΗ","Ο.Α.ΑΡΙΔΑΙΑΣ",0,0]
["18-30873","ΣΠΥΡΟΠΟΥΛΟΥ ΗΡΩ-ΧΡΙΣΤΙΝΑ","Α.Ο.Π.ΦΑΛΗΡΟΥ",0,0]
["18-32453","ΣΤΑΥΡΑΚΗ ΑΙΚΑΤΕΡΙΝΗ","Α.Ο.Α.ΦΙΛΟΘΕΗΣ",0,0]
["18-23785","ΧΟΝΔΡΟΥ ΕΜΜΑΝΟΥΕΛΑ","Ο.Α.ΚΕΡΑΤΣΙΝΙΟΥ",0,0]
["18-24447","ΑΛΜΠΑΝΙΔΟΥ ΕΛΕΝΗ","Ο.Α.ΑΛΕΞΑΝΔΡΟΣ ΒΕΡΟΙΑΣ",0,0]
["18-30576","ΑΡΒΑΝΙΤΗ ΣΟΦΙΑ","Α.Ν.Ο.ΓΛΥΦΑΔΑΣ",0,0]
["18-25527","ΖΑΧΑΡΙΑ ΑΝΑΣΤΑΣΙΑ","ΑΙΟΛΟΣ Α.Λ.ΙΛΙΟΥ",0,0]
["18-32425","ΚΑΡΑΜΕΣΙΝΗ ΑΘΗΝΑ","Ο.Α.ΚΕΡΑΤΣΙΝΙΟΥ",0,0]
["18-26809","ΚΑΡΑΦΛΑ ΚΩΝΣΤΑΝΤΙΝΑ","Α.Ο.Α.ΑΙΓΑΛΕΩ 92",0,0]
["18-30910","ΚΟΤΣΙΡΗ ΕΛΕΝΗ","ΑΙΟΛΟΣ Α.Λ.ΙΛΙΟΥ",0,0]
["18-25525","ΚΟΥΚΟΥΒΙΤΑΚΗ ΧΡΙΣΤΙΝΑ","ΑΙΟΛΟΣ Α.Λ.ΙΛΙΟΥ",0,0]
["18-29130","ΚΟΥΚΟΥΔΑΚΗ ΝΙΚΟΛΕΤΑ","Α.Ο.Α.ΑΙΓΑΛΕΩ 92",0,0]
["18-26412","ΚΟΥΜΠΑΡΟΥ ΜΑΡΙΝΑ","Α.Ο.Α.ΠΡΩΤΑΘΛ.ΚΑΒΑΛΑΣ",0,0]
["18-30385","ΠΑΠΠΑ ΑΝΝΑ-ΜΑΡΙΑ","Ο.Α.ΚΑΙΣΑΡΙΑΝΗΣ",0,0]
["18-28458","ΠΑΥΛΙΔΟΥ ΕΛΕΝΗ-ΜΑΡΙΑ","ΠΕΥΚΗ Γ.ΚΑΛΟΒΕΛΩΝΗΣ",0,0]
["18-29370","ΠΑΥΛΟΥ ΙΩΑΝΝΑ","Γ.Σ.ΚΗΦΙΣΙΑΣ",0,0]
["18-29795","ΠΙΚΟΥΛΑ ΜΑΡΙΑ","Ο.Α.ΚΑΙΣΑΡΙΑΝΗΣ",0,0]
["18-34297","ΠΙΤΣΙΛΗ ΔΑΝΑΗ-ΣΩΣΑΝΑ","Α.Ο.Ν.Φ.ΑΤΤΑΛΟΣ",0,0]
["18-30503","ΡΟΥΜΕΛΙΩΤΗ ΘΕΟΔΩΡΑ","Α.Ε.Κ.ΤΡΙΠΟΛΗΣ",0,0]
["18-24709","ΧΑΡΑΛΑΜΠΟΠΟΥΛΟΥ ΜΑΡΙΑ-ΕΛΕΝΗ","ΠΕΥΚΗ Γ.ΚΑΛΟΒΕΛΩΝΗΣ",0,0]
["18-27085","ΨΑΡΟΠΟΥΛΟΥ ΚΩΝΣΤΑΝΤΙΝΑ-ΜΑΡΙΑ","Α.Ο.ΣΙΚΥΩΝΟΣ ΚΙΑΤΟΥ",0,0]
["12-30710","ΚΑΖΙΑΛΕΣ ΕΥΑΓΓΕΛΟΣ","Ο.Α. ΡΕΘΥΜΝΟΥ",21,0]

{"sheet":"CalcPrg","index":6,"n_rows":25,"n_cols":7,"rows_kept":25,"cut":false,"hidden":false,"merged":[[0,0,0,5],[2,0,2,2],[15,0,15,2],[2,5,3,5],[15,5,16,5],[1,0,1,5]]}
[{"$f":"CONCATENATE(Setup!B3,\", \",Setup!B4,\", \",Setup!B6)","v":"ΕΦΟΑ, 1ο Ε2 2014, ΗΡΑΚΛΕΙΟ Ο.Α.Α."},null,null,null,null,null," Don't Change this Worksheet !"]
[{"$f":"Setup!$B$10","v":"Νικηφοράκης Σταύρος"}]
["Πρόγραμμα αγώνων",null,null,null,"Round 1","i"]
["ΩΡΑ","Κτγρ.","Αθλητές ζευγάρι α'",null,"Αθλητές ζευγάρι β'"]
["Έναρξη",{"$f":"Setup!$B$7","v":"Α12 Δ"},{"$f":"IF(MD!H5=\"bye\",\"\", LEFT(MD!H5,FIND(\" \",MD!H5)+1) & \" - \" & LEFT(MD!H6,FIND(\" \",MD!H6)+1))","v":"ΚΩΣΤΟΥΡΟΣ Δ - ΤΑΜΙΩΛΑΚΗΣ Χ"},{"$f":"IF(OR(C5=\"\",E5=\"\"),\" \",\"-\")","v":" "},{"$f":"IF(MD!H7=\"bye\",\"\", LEFT(MD!H7,FIND(\" \",MD!H7)+1) & \" - \" & LEFT(MD!H8,FIND(\" \",MD!H8)+1))","v":""}]
[null,{"$f":"Setup!$B$7","v":"Α12 Δ"},{"$f":"IF(MD!H9=\"bye\",\"\", LEFT(MD!H9,FIND(\" \",MD!H9)+1) & \" - \" & LEFT(MD!H10,FIND(\" \",MD!H10)+1))","v":"ΝΟΥΧΑΚΗΣ Γ - ΑΣΤΡΕΙΝΙΔΗΣ Φ"},"-",{"$f":"IF(MD!H11=\"bye\",\"\", LEFT(MD!H11,FIND(\" \",MD!H11)+1) & \" - \" & LEFT(MD!H12,FIND(\" \",MD!H12)+1))","v":"ΓΚΑΓΚΑΟΥΔΑΚΗΣ Σ - ΜΠΟΓΡΗΣ Ε"}]
[null,{"$f":"Setup!$B$7","v":"Α12 Δ"},{"$f":"IF(MD!H13=\"bye\",\"\", LEFT(MD!H13,FIND(\" \",MD!H13)+1) & \" - \" & LEFT(MD!H14,FIND(\" \",MD!H14)+1))","v":"ΣΑΒΒΑΚΗΣ Δ - ΤΣΑΚΙΡΑΚΗΣ Γ"}," ",{"$f":"IF(MD!H15=\"bye\",\"\", LEFT(MD!H15,FIND(\" \",MD!H15)+1) & \" - \" & LEFT(MD!H16,FIND(\" \",MD!H16)+1))","v":""}]
[null,{"$f":"Setup!$B$7","v":"Α12 Δ"},{"$f":"IF(MD!H17=\"bye\",\"\", LEFT(MD!H17,FIND(\" \",MD!H17)+1) & \" - \" & LEFT(MD!H18,FIND(\" \",MD!H18)+1))","v":""}," ",{"$f":"IF(MD!H19=\"bye\",\"\", LEFT(MD!H19,FIND(\" \",MD!H19)+1) & \" - \" & LEFT(MD!H20,FIND(\" \",MD!H20)+1))","v":"ΜΑΡΙΝΟΠΟΥΛΟΣ Σ - ΚΥΠΡΙΩΤΗΣ Ε"}]
["όχι πριν",{"$f":"Setup!$B$7","v":"Α12 Δ"},{"$f":"IF(MD!H21=\"bye\",\"\", LEFT(MD!H21,FIND(\" \",MD!H21)+1) & \" - \" & LEFT(MD!H22,FIND(\" \",MD!H22)+1))","v":"ΜΑΤΣΑΜΑΚΗΣ Α - ΚΟΝΤΑΡΑΚΗΣ Α"}," ",{"$f":"IF(MD!H23=\"bye\",\"\", LEFT(MD!H23,FIND(\" \",MD!H23)+1) & \" - \" & LEFT(MD!H24,FIND(\" \",MD!H24)+1))","v":""}]
[null,{"$f":"Setup!$B$7","v":"Α12 Δ"},{"$f":"IF(MD!H25=\"bye\",\"\", LEFT(MD!H25,FIND(\" \",MD!H25)+1) & \" - \" & LEFT(MD!H26,FIND(\" \",MD!H26)+1))","v":"ΚΑΖΙΑΛΕΣ Ε - ΤΣΑΓΛΙΩΤΗΣ Α"},"-",{"$f":"IF(MD!H27=\"bye\",\"\", LEFT(MD!H27,FIND(\" \",MD!H27)+1) & \" - \" & LEFT(MD!H28,FIND(\" \",MD!H28)+1))","v":"ΚΩΝΣΤΑΝΤΑΡΑΚΗΣ Α - ΚΑΡΑΧΑΛΙΟΣ Α"}]
[null,{"$f":"Setup!$B$7","v":"Α12 Δ"},{"$f":"IF(MD!H29=\"bye\",\"\", LEFT(MD!H29,FIND(\" \",MD!H29)+1) & \" - \" & LEFT(MD!H30,FIND(\" \",MD!H30)+1))","v":"ΔΕΛΑΚΗΣ Δ - ΜΠΟΥΡΑΣ Ι"},"-",{"$f":"IF(MD!H31=\"bye\",\"\", LEFT(MD!H31,FIND(\" \",MD!H31)+1) & \" - \" & LEFT(MD!H32,FIND(\" \",MD!H32)+1))","v":"ΖΕΡΒΟΣ Γ - ΒΟΛΤΥΡΑΚΗΣ Β"}]
[null,{"$f":"Setup!$B$7","v":"Α12 Δ"},{"$f":"IF(MD!H33=\"bye\",\"\", LEFT(MD!H33,FIND(\" \",MD!H33)+1) & \" - \" & LEFT(MD!H34,FIND(\" \",MD!H34)+1))","v":""}," ",{"$f":"IF(MD!H35=\"bye\",\"\", LEFT(MD!H35,FIND(\" \",MD!H35)+1) & \" - \" & LEFT(MD!H36,FIND(\" \",MD!H36)+1))","v":"ΤΡΙΑΝΤΑΦΥΛΛΟΥ Ν - ΣΙΜΑΤΟΣ Γ"}]
[]
[]
[]
["Πρόγραμμα αγώνων",null,null,null,"Round 2","i"]
["ΩΡΑ","Κτγρ.","Αθλητές ζευγάρι α'",null,"Αθλητές ζευγάρι β'"]
["Έναρξη",{"$f":"Setup!$B$7","v":"Α12 Δ"},{"$f":"MD!L5 & \" - \" & MD!L6","v":"ΚΩΣΤΟΥΡΟΣ - ΤΑΜΙΩΛΑΚΗΣ"},{"$f":"IF(OR(C18=\"\",E18=\"\"),\" \",\"-\")","v":"-"},{"$f":"MD!L9 & \" - \" & MD!L10","v":"ΝΟΥΧΑΚΗΣ - ΑΣΤΡΕΙΝΙΔΗΣ"}]
[null,{"$f":"Setup!$B$7","v":"Α12 Δ"},{"$f":"MD!L13 & \" - \" & MD!L14","v":"ΣΑΒΒΑΚΗΣ - ΤΣΑΚΙΡΑΚΗΣ"},{"$f":"IF(OR(C19=\"\",E19=\"\"),\" \",\"-\")","v":"-"},{"$f":"MD!L17 & \" - \" & MD!L18","v":"ΜΑΡΙΝΟΠΟΥΛΟΣ - ΚΥΠΡΙΩΤΗΣ"}]
[null,{"$f":"Setup!$B$7","v":"Α12 Δ"},{"$f":"MD!L21 & \" - \" & MD!L22","v":"ΜΑΤΣΑΜΑΚΗΣ - ΚΟΝΤΑΡΑΚΗΣ"},{"$f":"IF(OR(C20=\"\",E20=\"\"),\" \",\"-\")","v":"-"},{"$f":"MD!L25 & \" - \" & MD!L26","v":"ΚΩΝΣΤΑΝΤΑΡΑΚΗΣ - ΚΑΡΑΧΑΛΙΟΣ"}]
[null,{"$f":"Setup!$B$7","v":"Α12 Δ"},{"$f":"MD!L29 & \" - \" & MD!L30","v":"ΖΕΡΒΟΣ - ΒΟΛΤΥΡΑΚΗΣ"},{"$f":"IF(OR(C21=\"\",E21=\"\"),\" \",\"-\")","v":"-"},{"$f":"MD!L33 & \" - \" & MD!L34","v":"ΤΡΙΑΝΤΑΦΥΛΛΟΥ - ΣΙΜΑΤΟΣ"}]
[]
[]
[]
[" Don't Change this Worksheet !"]

{"sheet":"tmp","index":7,"n_rows":65,"n_cols":24,"rows_kept":65,"cut":false,"hidden":false,"merged":[[31,9,33,9],[31,16,33,16],[20,8,22,8],[20,16,22,16],[25,9,25,22],[26,9,26,10],[26,16,26,17],[27,9,30,9],[27,16,30,16],[11,8,11,23],[12,16,12,17],[13,8,16,8],[13,16,16,16],[17,8,19,8],[17,16,19,16],[0,8,0,23],[1,16,1,17],[2,8,5,8],[2,16,5,16],[6,8,8,8],[6,16,8,16]]}
["RndIndx","random","FixRandom",null,null,null,null,null,"ΠΡΟΚΡΙΜΑΤΙΚΑ E1, E2 (32 για 8)"]
[1,{"$f":"RAND()/22","v":2.7676505632532825E-2},3.3788066285176367E-2,null,null,null,null,null,null,null,"17-32","9-16","5-8","3-4","2ος","1ος",null,null,"17-32","9-16","5-8","3-4","2ος","1ος"]
[2,{"$f":"RAND()/22","v":3.6323020200848238E-2},2.4638147638899186E-2,null,null,null,null,null,"E1","E1-12",1,2,2,0,0,0,"E1","E1-12",1,1,0,0,0,0]
[3,{"$f":"RAND()/22","v":3.2843095550710348E-2},1.7334584915927057E-2,null,null,null,null,null,null,"E1-14",3,4,4,0,0,0,null,"E1-14",3,1,0,0,0,0]
[4,{"$f":"RAND()/22","v":3.6418460549820807E-2},3.6986914925632768E-2,null,null,null,null,null,null,"E1-16",6,8,8,0,0,0,null,"E1-16",6,2,0,0,0,0]
[5,1.1282151675101937E-2,4.1043909423465426E-2,null,null,null,null,null,null,"E1-18",7.5,10,10,null,null,null,null,"E1-18",7.5,2.5,0,0,0,0]
[6,4.1096404556466772E-2,2.6315418407484324E-2,null,null,null,null,null,"E2","E2-12",0.3,0.5,0.5,0,0,0,"E2","E2-12",0.3,0.2,0,0,0,0]
[7,1.2279509476296979E-2,1.3494198484654364E-2,null,null,null,null,null,null,"E2-14",1,2,2,0,0,0,null,"E2-14",1,1,0,0,0,0]
[8,2.9679473056516362E-2,3.2452014588394938E-2,null,null,null,null,null,null,"E2-16",2,4,4,0,0,0,null,"E2-16",2,2,0,0,0,0]
[9,3.551659458593108E-2,1.0644074789532483E-2]
[10,4.4763209823822557E-2,3.1785047136978654E-2]
[11,3.7761461490677807E-2,1.7585668443730482E-2,null,null,null,null,null,"ΚΥΡΙΩΣ ΤΑΜΠΛΟ E1, E2 & E3"]
[12,3.5980178022869104E-2,3.9987863905085644E-2,null,null,null,null,null,null,null,"17-32","9-16","5-8","3-4","2ος","1ος",null,null,"17-32","9-16","5-8","3-4","2ος","1ος"]
[13,2.9959380924875247E-2,4.9035516606613545E-3,null,null,null,null,null,"E1","E1-12",7,10,14,21,35,42,"E1","E1-12",7,3,4,7,14,7]
[14,3.74195243208525E-2,5.283575895968496E-3,null,null,null,null,null,null,"E1-14",10,15,20,30,50,60,null,"E1-14",10,5,5,10,20,10]
[15,3.7154053149174325E-2,2.226394754404951E-2,null,null,null,null,null,null,"E1-16",20,30,40,60,100,120,null,"E1-16",20,10,10,20,40,20]
[16,9.786129148221372E-3,1.3693414951109146E-2,null,null,null,null,null,null,"E1-18",25,37,50,75,125,150,null,"E1-18",25,12,13,25,50,25]
[17,1.5624491954348774E-2,4.3342189197474096E-2,null,null,null,null,null,"E2","E2-12",4,5,7,10,15,18,"E2","E2-12",4,1,2,3,5,3]
[18,2.3728319111742911E-2,7.6622926021615379E-3,null,null,null,null,null,null,"E2-14",5,8,10,15,25,30,null,"E2-14",5,3,2,5,10,5]
[19,1.0223379598510192E-2,6.2745213797389095E-3,null,null,null,null,null,null,"E2-16",10,15,20,30,50,60,null,"E2-16",10,5,5,10,20,10]
[20,1.4956541398899842E-2,5.9834451407245548E-3,null,null,null,null,null,"E3","E3-12",0.5,2,3,4,7,8,"E3","E3-12",0.5,1.5,1,1,3,1]
[21,3.772420793829849E-2,1.2866523881327445E-2,null,null,null,null,null,null,"E3-14",2,3,4,6,10,12,null,"E3-14",2,1,1,2,4,2]
[22,1.6181888368713107E-2,3.4314361544036179E-2,null,null,null,null,null,null,"E3-16",4,6,8,12,20,24,null,"E3-16",4,2,2,4,8,4]
[23,1.7375153952323252E-2,2.781197050120646E-2]
[24,1.9077482112898968E-2,3.9210337622193163E-3]
[25,3.6667388866184632E-3,2.2100984810082724E-2,null,null,null,null,null,null,"ΔΙΠΛΑ E1, E2"]
[26,1.1023849593242168E-2,1.2511545882030174E-2,null,null,null,null,null,null,null,null,"9-16","5-8","3-4","2ος","1ος",null,null,"9-16","5-8","3-4","2ος","1ος"]
[27,2.3326128406916087E-3,3.6513062539042428E-2,null,null,null,null,null,null,"E1","E1-12",3,4,5,9,11,"E1","E1-12",3,1,1,4,2]
[28,1.7376294967223847E-2,4.1045206795773193E-3,null,null,null,null,null,null,null,"E1-14",4,5,8,13,15,null,"E1-14",4,1,3,5,2]
[29,2.8147135347810315E-3,2.7878712391499538E-2,null,null,null,null,null,null,null,"E1-16",8,10,15,25,30,null,"E1-16",8,2,5,10,5]
[30,3.2348584608065008E-2,3.7753704508849732E-2,null,null,null,null,null,null,null,"E1-18",9,12,19,31,37,null,"E1-18",9,3,7,12,6]
[31,2.9035646580494723E-2,2.3610198845519091E-2,null,null,null,null,null,null,"E2","E2-12",1,2,3,4,8,"E2","E2-12",1,1,1,1,4]
[32,4.5008716749727902E-2,2.4309252361079049E-2,null,null,null,null,null,null,null,"E2-14",2,3,4,6,8,null,"E2-14",2,1,1,2,2]
[33,2.7786543308141898E-2,3.251491169991081E-2,null,null,null,null,null,null,null,"E2-16",4,6,8,12,16,null,"E2-16",4,2,2,4,4]
[34,3.5056116684803948E-2,4.1076148565636329E-2]
[35,2.0950203917618915E-2,1.5189556802775672E-2]
[36,3.1870698677787468E-2,1.201579860675544E-2]
[37,9.6692968659071177E-3,4.2904768661496832E-2]
[38,2.8614867284934474E-2,6.1465522288429823E-3]
[39,3.1893493234539043E-2,1.9977450973708569E-2]
[40,4.1247242009426137E-2,2.5958941610439424E-2]
[41,2.2811449968970485E-2,3.9399485061373363E-2]
[42,3.2324019726274127E-2,2.1887126077770394E-2]
[43,1.982727828740628E-2,2.4271227114927223E-3]
[44,4.4273687822484004E-2,3.5238146055760637E-2]
[45,1.4265488231264561E-2,1.0907259421687042E-2]
[46,4.1453340983802794E-2,3.4388212864654571E-2]
[47,2.0883150161390821E-3,3.7627597190890968E-2]
[48,3.528265971124054E-2,4.13980657162768E-2]
[49,2.6089811837694543E-2,3.616525415892837E-5]
[50,3.8798431743939862E-2,1.0218488859543269E-2]
[51,2.9475018088305195E-2,2.5069922215317151E-2]
[52,5.7252438046206536E-3,4.2295700435180515E-2]
[53,8.2047970683649055E-3,2.3629002680783353E-2]
[54,1.5837790746630043E-2,3.3145972746865128E-2]
[55,2.9614564733966429E-2,3.2933167049274063E-2]
[56,2.616027196084296E-2,3.4733831597236524E-2]
[57,3.2681467437355068E-2,3.8560727020799608E-2]
[58,2.7157277129094669E-2,3.3829844140856415E-2]
[59,3.6140504748968703E-2,1.3490016277999718E-2]
[60,4.4580982393166213E-2,3.0017024903125866E-2]
[61,1.4290754059426853E-2,9.7415684614897587E-3]
[62,1.5284846016379805E-2,1.6740312314857789E-2]
[63,9.7710031295275817E-4,2.7975524618067547E-2]
[64,1.6116385181668379E-2,1.1969071547523902E-2]