{"text_format":"1","workbook":"xlsx","n_sheets":12,"sheets":["Setup","AL QD","AL MD","QD","MD","MD16","QDprg","MDprg","notes","Rankings","CalcPrg","tmp"],"not_rendered":{"charts":0,"images":0,"macros":1,"external_links":0,"defined_names":5,"comments":0,"pivot_tables":0},"unopened":[],"bounds":{"document_bytes":16777216,"sheet_cells":100000,"rows_first":2000,"rows_last":500,"rows_between":2000,"halvings":0,"cell_chars":16384,"cell_head_chars":4096},"cells_cut":0,"cells_raw":0,"read":"whole","date_system":"1900"}

{"sheet":"Setup","index":0,"n_rows":90,"n_cols":18,"rows_kept":90,"cut":false,"hidden":false,"merged":[[0,0,0,1],[12,4,12,8],[3,4,10,4],[1,4,1,7],[1,10,1,11],[59,0,59,1],[60,3,61,3],[1,13,1,17],[3,10,4,10],[6,10,9,10]]}
["ΤΟΥΡΝΟΥΑ QD 32►8, MD 32"]
[null,null,null,null,"Qual seeded",null,null,null,null,null,"M.D. seeded",null,null,"M.D. others"]
["Διοργανωτής: ","ΕΦΟΑ",null,null,null,"seed 1","seed 2","Spaces",null,null,"Θέσεις","seed",null,0,"seed","Spaces","Index","Value"]
["Τίτλος Τουρνουά: ","1ο Ε2 2014",null,null,"8 seeded",1,{"$f":"VALUE(MID($A$34,1,H4-1))","v":0},{"$f":"FIND(\" \",$A$34,1)","v":2},null,null,"3-4",{"$f":"VALUE(LEFT(A45,1))","v":4},null,{"$f":"IF(O4=\"-\",\"-\",IF(O4>0,N3+1,0))","v":0},{"$f":"IF(P4>0,VALUE(MID($A$46,1,P4-1)),\"-\")","v":0},{"$f":"IF(LEN($A$46)>1,FIND(\" \",$A$46,1),0)","v":2},0,0]
["type: ","e2-12",null,null,null,2,{"$f":"VALUE(MID($A$34,H4+1,H5-H4-1))","v":0},{"$f":"FIND(\" \",$A$34,H4+1)","v":4},null,null,null,{"$f":"VALUE(RIGHT(A45,1))","v":3},null,{"$f":"IF(O5=\"-\",\"-\",IF(O5>0,N4+1,0))","v":0},{"$f":"IF(P5>0,VALUE(MID($A$46,P4+1,P5-P4-1)),\"-\")","v":0},{"$f":"IF(AND(P4>0,LEN($A$46)>P4+1),FIND(\" \",$A$46,P4+1),0)","v":4},0,0]
["Έδρα αγώνων: ","ΗΡΑΚΛΕΙΟ Ο.Α. & Α",null,null,null,3,0,6,null,null,"Θέσεις","seed",null,{"$f":"IF(O6=\"-\",\"-\",IF(O6>0,N5+1,0))","v":0},0,6,0,0]
["Κατηγορία: ","Α16",null,null,null,4,0,8,null,null,"5-8",{"$f":"TRIM(LEFT(B45,(FIND(\" \",B45,1)-1)))","v":"5"},null,{"$f":"IF(O7=\"-\",\"-\",IF(O7>0,N6+1,0))","v":0},0,8,0,0]
["Έναρξη: ","28 Φεβρουαρίου",null,null,null,5,0,10,null,null,null,{"$f":"TRIM(MID(B45,(FIND(\" \",B45,1)),FIND(\" \",B45,(FIND(\" \",B45,1)+1))-(FIND(\" \",B45,1))))","v":"8"},null,{"$f":"IF(O8=\"-\",\"-\",IF(O8>0,N7+1,0))","v":0},0,10,0,0]
{"$rows_left_out":83}
{"sheet":"AL QD","index":1,"n_rows":42,"n_cols":10,"rows_kept":42,"cut":false,"hidden":false,"merged":[[35,1,35,4],[41,6,41,7],[0,0,0,6]]}
[{"$f":"Setup!$B$3 & \", \" & Setup!$B$4 & \", \" & Setup!$B$6 & \", \" & Setup!$B$8 & \"-\" & Setup!$B$9","v":"ΕΦΟΑ, 1ο Ε2 2014, ΗΡΑΚΛΕΙΟ Ο.Α. & Α, 28 Φεβρουαρίου-4 Μαρτίου"},null,null,null,null,null,null,{"$f":"Setup!$B$7","v":"Α16"}]
["α/α"," ","  Α.Μ.  ","Ονοματεπώνυμο","Σύλλογος","βαθμ.","   Τηλέφωνο   ","Υπογραφή","srtPts","rand"]
[1,null,null,null,null,null,null,null,{"$f":"IF(C3=\"\",0,F3+J3)","v":0},1.5772524634032104E-2]
[2,null,null,null,null,null,null,null,0,1.0205068941753553E-2]
[3,null,null,null,null,null,null,null,0,1.0883413208593767E-2]
[4,null,null,null,null,null,null,null,0,3.0833001484018886E-3]
[5,null,null,null,null,null,null,null,0,2.9370210174760988E-2]
[6,null,null,null,null,null,null,null,0,2.1890812163676953E-2]
{"$rows_left_out":35}
{"sheet":"AL MD","index":2,"n_rows":42,"n_cols":10,"rows_kept":42,"cut":false,"hidden":false,"merged":[[35,1,35,4],[41,6,41,7],[0,0,0,6]]}
[{"$f":"Setup!$B$3 & \", \" & Setup!$B$4 & \", \" & Setup!$B$6 & \", \" & Setup!$B$8 & \"-\" & Setup!$B$9","v":"ΕΦΟΑ, 1ο Ε2 2014, ΗΡΑΚΛΕΙΟ Ο.Α. & Α, 28 Φεβρουαρίου-4 Μαρτίου"},null,null,null,null,null,null,{"$f":"Setup!$B$7","v":"Α16"}]
["α/α","από","  Α.Μ.  ","Ονοματεπώνυμο","Σύλλογος","βαθμ.","   Τηλέφωνο   ","Υπογραφή","srtPts","rand"]
[1,null,26317,"ΚΩΣΤΑΡΑΣ ΠΑΝΑΓΙΩΤΗΣ","Ο.Α.ΠΕΤΡΟΥΠΟΛΗΣ",646,null,null,{"$f":"IF(C3=\"\",0,F3+J3)","v":646.02445798148926},2.4457981489311383E-2]
[2,null,25297,"ΚΑΠΙΡΗΣ ΣΤΑΜΑΤΗΣ","Α.Ο.Α.ΗΛΙΟΥΠΟΛΗΣ",506,null,null,506.00406469885422,4.0646988542447282E-3]
[3,null,30186,"ΠΙΤΣΙΝΗΣ ΔΗΜΗΤΡΙΟΣ","Ο.Α.ΚΕΡΑΤΣΙΝΙΟΥ",440,null,null,440.03530910225635,3.5309102256323867E-2]
[4,null,26459,"ΝΑΟΥΜ ΣΠΥΡΙΔΩΝ","Ο.Α.ΧΑΝΙΩΝ",333,null,null,333.00828716004668,8.2871600467021092E-3]
[5,null,26457,"ΑΡΕΤΑΚΗΣ ΙΩΑΝΝΗΣ","Ο.Α.ΧΑΝΙΩΝ",247,null,null,247.00759611688861,7.5961168885925901E-3]
[6,null,27583,"ΠΑΧΑΚΗΣ ΝΙΚΟΛΑΟΣ-ΑΝΔΡΕΑΣ","Ο.Α.ΑΘΗΝΩΝ",219,null,null,219.00531086386889,5.3108638688796807E-3]
{"$rows_left_out":35}
{"sheet":"QD","index":3,"n_rows":67,"n_cols":14,"rows_kept":67,"cut":false,"hidden":false,"merged":[[0,0,0,11],[39,13,39,15],[2,7,2,9],[38,7,38,9]]}
[{"$f":"Setup!B3 & \", \" & Setup!B4 & \", \" & Setup!B6 & \", \" & Setup!B8 & \"-\" & Setup!B9","v":"ΕΦΟΑ, 1ο Ε2 2014, ΗΡΑΚΛΕΙΟ Ο.Α. & Α, 28 Φεβρουαρίου-4 Μαρτίου"},null,null,null,null,null,null,null,null,null,null,null,null,{"$f":"Setup!$B$7","v":"Α16"}]
[null,{"$f":"Setup!B15","v":32},null,null,null,null,{"$f":"\"p\"&VLOOKUP(Setup!$B$5,tmp!$J$3:$P$9,2,FALSE)","v":"p0,3"},null,null,null,null,{"$f":"\"p\"&VLOOKUP(Setup!$B$5,tmp!$J$3:$P$9,3,FALSE)","v":"p0,5"},null,{"$f":"\"p\"&VLOOKUP(Setup!$B$5,tmp!$J$3:$P$9,4,FALSE)","v":"p0,5"}]
[null,null,null,null,null,null,null,32,null,null,null,16,null,8]
["α/α",null,"ByeOrder","ByeSum","ByeCnt","seed","  Α.Μ.  ","Ονοματεπώνυμο","επώνυμο","Σύλλογος"]
[1,null,null,null,0,1,{"$f":"IF(Setup!$B$23=\"#\",0,IF(F5>0,VLOOKUP(F5,'AL QD'!$A$3:$H$34,3,FALSE),0))","v":0},{"$f":"IF($G5>0,VLOOKUP(G5,'AL QD'!$C$3:$H$34,2,FALSE),0)","v":0},{"$f":"IF(NOT(G5>0),\"\", IF(ISERROR(FIND(\"-\",H5)), LEFT(H5,FIND(\" \",H5)-1),  IF(FIND(\"-\",H5)>FIND(\" \",H5),LEFT(H5,FIND(\" \",H5)-1),   LEFT(H5,FIND(\"-\",H5)-1)    )))","v":""},{"$f":"IF($G5>0,VLOOKUP($G5,'AL QD'!$C$3:$E$34,3,FALSE),\"\")","v":""},null,{"$f":"UPPER(IF($A$2=\"R\",IF(OR(K5=1,K5=\"a\"),G5,IF(OR(K5=2,K5=\"b\"),G6,\"\")),IF(OR(K5=1,K5=\"1\"),I5,IF(OR(K5=2,K5=\"b\"),I6,\"\"))))","v":""}]
[2,{"$f":"IF(E6=0,17-D6,0)","v":0},1,{"$f":"E6","v":1},{"$f":"IF($B$2>=C6,1,0)","v":1},{"$f":"IF($B$2>=C6,\"-\",VLOOKUP($B6,Setup!$H$15:$I$30,2,FALSE))","v":"-"},{"$f":"IF(Setup!$B$23=\"#\",0,IF(NOT(F6=\"-\"),VLOOKUP(F6,'AL QD'!$A$3:$H$34,3,FALSE),0))","v":0},{"$f":"IF($G6>0,VLOOKUP($G6,'AL QD'!$C$3:$E$34,2,FALSE),\"bye\")","v":"bye"},{"$f":"IF(NOT(G6>0),\"\", IF(ISERROR(FIND(\"-\",H6)), LEFT(H6,FIND(\" \",H6)-1),  IF(FIND(\"-\",H6)>FIND(\" \",H6),LEFT(H6,FIND(\" \",H6)-1),   LEFT(H6,FIND(\"-\",H6)-1)    )))","v":""},{"$f":"IF($G6>0,VLOOKUP($G6,'AL QD'!$C$3:$E$34,3,FALSE),\"\")","v":""},null,null,null,{"$f":"UPPER(IF($A$2=\"R\",IF(OR(M6=1,M6=\"a\"),L5,IF(OR(M6=2,M6=\"b\"),L7,\"\")),IF(OR(M6=1,M6=\"a\"),L5,IF(OR(M6=2,M6=\"b\"),L7,\"\"))))","v":""}]
[3,{"$f":"IF(E7=0,18-D7,0)","v":0},{"$f":"Setup!G4","v":0},{"$f":"D6+E7","v":2},{"$f":"IF($B$2>=C7,1,0)","v":1},{"$f":"IF($B$2>=C7,\"-\",VLOOKUP($B7,Setup!$H$15:$I$30,2,FALSE))","v":"-"},{"$f":"IF(Setup!$B$23=\"#\",0,IF(NOT(F7=\"-\"),VLOOKUP(F7,'AL QD'!$A$3:$H$34,3,FALSE),0))","v":0},{"$f":"IF($G7>0,VLOOKUP(G7,'AL QD'!$C$3:$E$34,2,FALSE),\"bye\")","v":"bye"},"",{"$f":"IF($G7>0,VLOOKUP($G7,'AL QD'!$C$3:$E$34,3,FALSE),\"\")","v":""},null,{"$f":"UPPER(IF($A$2=\"R\",IF(OR(K7=1,K7=\"a\"),G7,IF(OR(K7=2,K7=\"b\"),G8,\"\")),IF(OR(K7=1,K7=\"a\"),I7,IF(OR(K7=2,K7=\"b\"),I8,\"\"))))","v":""}]
[4,null,17,3,{"$f":"IF($B$2>=C8,1,0)","v":1},{"$f":"Setup!G4","v":0},{"$f":"IF(Setup!$B$23=\"#\",0,IF(F8>0,VLOOKUP(F8,'AL QD'!$A$3:$E$34,3,FALSE),0))","v":0},{"$f":"IF(G8>0,VLOOKUP(G8,'AL QD'!$C$3:$E$34,2,FALSE),\"bye\")","v":"bye"},"",{"$f":"IF($G8>0,VLOOKUP($G8,'AL QD'!$C$3:$E$34,3,FALSE),\"\")","v":""}]
{"$rows_left_out":60}
{"sheet":"MD","index":4,"n_rows":67,"n_cols":30,"rows_kept":67,"cut":false,"hidden":false,"merged":[[41,17,41,19],[0,0,0,17],[2,9,2,11],[38,9,38,11]]}
[{"$f":"Setup!B3 & \", \" & Setup!B4 & \", \" & Setup!B6 & \", \" & Setup!B8 & \"-\" & Setup!B9","v":"ΕΦΟΑ, 1ο Ε2 2014, ΗΡΑΚΛΕΙΟ Ο.Α. & Α, 28 Φεβρουαρίου-4 Μαρτίου"},null,null,null,null,null,null,null,null,null,null,null,null,null,null,null,null,null,null,{"$f":"Setup!$B$7","v":"Α16"}]
[null,{"$f":"Setup!B18","v":6},null,null,null,null,null,null,{"$f":"\"p\"&VLOOKUP(Setup!$B$5,tmp!$J$14:$P$23,2,FALSE)","v":"p4"},null,null,null,null,{"$f":"\"p\"&VLOOKUP(Setup!$B$5,tmp!$J$14:$P$23,3,FALSE)","v":"p5"},null,{"$f":"\"p\"&VLOOKUP(Setup!$B$5,tmp!$J$14:$P$23,4,FALSE)","v":"p7"},null,{"$f":"\"p\"&VLOOKUP(Setup!$B$5,tmp!$J$14:$P$23,5,FALSE)","v":"p10"},null,{"$f":"\"p\"&VLOOKUP(Setup!$B$5,tmp!$J$14:$P$23,6,FALSE)&\"-\"&VLOOKUP(Setup!$B$5,tmp!$J$14:$P$23,7,FALSE)","v":"p15-18"}]
[null,null,null,null,null,null,null,null,null,32,null,null,null,16,null,8,null,4,null,"2 & w"]
["α/α",null,"ByeOrder","ByeSum","ByeCnt","από","seed","Pts","  Α.Μ.  ","Ονοματεπώνυμο","επώνυμο","Σύλλογος"]
[1,1,null,null,0,{"$f":"IF(NOT($G5=\"-\"),VLOOKUP($G5,'AL MD'!$A$3:$E$34,2,FALSE),\"\")","v":0},{"$f":"VLOOKUP($B5,Setup!$Q$4:$R$35,2,FALSE)","v":1},{"$f":"IF($G5>0,VLOOKUP($G5,'AL MD'!$A$3:$F$34,6,FALSE),0)","v":646},{"$f":"IF(Setup!$B$24=\"#\",0,IF($G5>0,VLOOKUP($G5,'AL MD'!$A$3:$E$34,3,FALSE),0))","v":26317},{"$f":"IF($I5>0,VLOOKUP($I5,'AL MD'!$C$3:$E$34,2,FALSE),\"bye\")","v":"ΚΩΣΤΑΡΑΣ ΠΑΝΑΓΙΩΤΗΣ"},{"$f":"IF(NOT(I5>0),\"\", IF(ISERROR(FIND(\"-\",J5)), LEFT(J5,FIND(\" \",J5)-1),  IF(FIND(\"-\",J5)>FIND(\" \",J5),LEFT(J5,FIND(\" \",J5)-1),   LEFT(J5,FIND(\"-\",J5)-1)    )))","v":"ΚΩΣΤΑΡΑΣ"},{"$f":"IF($I5>0,VLOOKUP($I5,'AL MD'!$C$3:$E$34,3,FALSE),\"\")","v":"Ο.Α.ΠΕΤΡΟΥΠΟΛΗΣ"},1,{"$f":"UPPER(IF($A$2=\"R\",IF(OR(M5=1,M5=\"a\"),I5,IF(OR(M5=2,M5=\"b\"),I6,\"\")),IF(OR(M5=1,M5=\"1\"),K5,IF(OR(M5=2,M5=\"b\"),K6,\"\"))))","v":"ΚΩΣΤΑΡΑΣ"},null,null,null,null,null,null,null,null,null,{"$f":"I5","v":26317},{"$f":"J5","v":"ΚΩΣΤΑΡΑΣ ΠΑΝΑΓΙΩΤΗΣ"}," ",{"$f":"N5","v":"ΚΩΣΤΑΡΑΣ"}]
[2,{"$f":"1-D6+8","v":8},{"$f":"B5","v":1},{"$f":"E6","v":1},{"$f":"IF($B$2>=C6,1,0)","v":1},{"$f":"IF(NOT($G6=\"-\"),VLOOKUP($G6,'AL MD'!$A$3:$E$34,2,FALSE),\"\")","v":""},{"$f":"IF($B$2>=C6,\"-\",VLOOKUP($B6,Setup!$Q$4:$R$35,2,FALSE))","v":"-"},{"$f":"IF(NOT($G6=\"-\"),VLOOKUP($G6,'AL MD'!$A$3:$F$34,6,FALSE),0)","v":0},{"$f":"IF(Setup!$B$24=\"#\",0,IF(NOT($G6=\"-\"),VLOOKUP($G6,'AL MD'!$A$3:$E$34,3,FALSE),0))","v":0},{"$f":"IF($I6>0,VLOOKUP($I6,'AL MD'!$C$3:$E$34,2,FALSE),\"bye\")","v":"bye"},{"$f":"IF(NOT(I6>0),\"\", IF(ISERROR(FIND(\"-\",J6)), LEFT(J6,FIND(\" \",J6)-1),  IF(FIND(\"-\",J6)>FIND(\" \",J6),LEFT(J6,FIND(\" \",J6)-1),   LEFT(J6,FIND(\"-\",J6)-1)    )))","v":""},{"$f":"IF($I6>0,VLOOKUP($I6,'AL MD'!$C$3:$E$34,3,FALSE),\"\")","v":""},null,null,1,{"$f":"UPPER(IF($A$2=\"R\",IF(OR(O6=1,O6=\"a\"),N5,IF(OR(O6=2,O6=\"b\"),N7,\"\")),IF(OR(O6=1,O6=\"a\"),N5,IF(OR(O6=2,O6=\"b\"),N7,\"\"))))","v":"ΚΩΣΤΑΡΑΣ"},null,null,null,null,null,null,null,{"$f":"I6","v":0},"bye",null,{"$f":"N6","v":0},{"$f":"P6","v":"ΚΩΣΤΑΡΑΣ"}]
[3,{"$f":"2-D7+8","v":9},null,{"$f":"D6+E7","v":1},0,{"$f":"IF(NOT($G7=\"-\"),VLOOKUP($G7,'AL MD'!$A$3:$E$34,2,FALSE),\"\")","v":0},{"$f":"VLOOKUP($B7,Setup!$Q$4:$R$35,2,FALSE)","v":19},{"$f":"IF($G7>0,VLOOKUP($G7,'AL MD'!$A$3:$F$34,6,FALSE),0)","v":36.5},{"$f":"IF(Setup!$B$24=\"#\",0,IF($G7>0,VLOOKUP($G7,'AL MD'!$A$3:$E$34,3,FALSE),0))","v":28243},{"$f":"IF($I7>0,VLOOKUP($I7,'AL MD'!$C$3:$E$34,2,FALSE),\"bye\")","v":"ΚΡΑΣΟΥΔΑΚΗΣ ΙΩΑΝΝΗΣ-ΓΕΩΡΓΙΟΣ"},"ΚΡΑΣΟΥΔΑΚΗΣ",{"$f":"IF($I7>0,VLOOKUP($I7,'AL MD'!$C$3:$E$34,3,FALSE),\"\")","v":"Ο.Α.ΧΑΝΙΩΝ"},2,{"$f":"UPPER(IF($A$2=\"R\",IF(OR(M7=1,M7=\"a\"),I7,IF(OR(M7=2,M7=\"b\"),I8,\"\")),IF(OR(M7=1,M7=\"a\"),K7,IF(OR(M7=2,M7=\"b\"),K8,\"\"))))","v":"ΚΥΡΙΑΚΑΚΗΣ"},null,"60, 60",null,null,null,null,null,null,null,28243,"ΚΡΑΣΟΥΔΑΚΗΣ ΙΩΑΝΝΗΣ-ΓΕΩΡΓΙΟΣ",null,"ΚΥΡΙΑΚΑΚΗΣ","60, 60"]
[4,{"$f":"3-D8+8","v":10},15,{"$f":"D7+E8","v":1},{"$f":"IF($B$2>=C8,1,0)","v":0},{"$f":"IF(NOT($G8=\"-\"),VLOOKUP($G8,'AL MD'!$A$3:$E$34,2,FALSE),\"\")","v":0},{"$f":"IF($B$2>=C8,\"-\",VLOOKUP($B8,Setup!$Q$4:$R$35,2,FALSE))","v":10},{"$f":"IF(NOT($G8=\"-\"),VLOOKUP($G8,'AL MD'!$A$3:$F$34,6,FALSE),0)","v":119},{"$f":"IF(Setup!$B$24=\"#\",0,IF(NOT($G8=\"-\"),VLOOKUP($G8,'AL MD'!$A$3:$E$34,3,FALSE),0))","v":26338},{"$f":"IF($I8>0,VLOOKUP($I8,'AL MD'!$C$3:$E$34,2,FALSE),\"bye\")","v":"ΚΥΡΙΑΚΑΚΗΣ-ΜΕΣΣΑΡΙΤΑΚΗΣ ΓΕΩΡΓΙΟΣ"},"ΚΥΡΙΑΚΑΚΗΣ",{"$f":"IF($I8>0,VLOOKUP($I8,'AL MD'!$C$3:$E$34,3,FALSE),\"\")","v":"ΗΡΑΚΛΕΙΟ Ο.Α.& Α."},null,"60, 62",null,null,1,{"$f":"UPPER(IF($A$2=\"R\",IF(OR(Q8=1,Q8=\"a\"),P6,IF(OR(Q8=2,Q8=\"b\"),P10,\"\")),IF(OR(Q8=1,Q8=\"a\"),P6,IF(OR(Q8=2,Q8=\"b\"),P10,\"\"))))","v":"ΚΩΣΤΑΡΑΣ"},null,null,null,null,null,26338,"ΚΥΡΙΑΚΑΚΗΣ-ΜΕΣΣΑΡΙΤΑΚΗΣ ΓΕΩΡΓΙΟΣ",null,"60, 62",null,{"$f":"R8","v":"ΚΩΣΤΑΡΑΣ"}]
{"$rows_left_out":60}
{"sheet":"MD16","index":5,"n_rows":44,"n_cols":18,"rows_kept":44,"cut":false,"hidden":false,"merged":[[2,9,2,11],[0,0,0,15],[26,17,26,18]]}
[{"$f":"Setup!B3 & \", \" & Setup!B4 & \", \" & Setup!B6 & \", \" & Setup!B8 & \"-\" & Setup!B9","v":"ΕΦΟΑ, 1ο Ε2 2014, ΗΡΑΚΛΕΙΟ Ο.Α. & Α, 28 Φεβρουαρίου-4 Μαρτίου"},null,null,null,null,null,null,null,null,null,null,null,null,null,null,null,null,{"$f":"Setup!B7","v":"Α16"}]
[null,{"$f":"Setup!$B$77","v":0},null,null,null,null,null,null,{"$f":"\"p\"&VLOOKUP(Setup!$B$5,tmp!$J$14:$P$23,3,FALSE)","v":"p5"},null,null,null,null,{"$f":"\"p\"&VLOOKUP(Setup!$B$5,tmp!$J$14:$P$23,4,FALSE)","v":"p7"},null,{"$f":"\"p\"&VLOOKUP(Setup!$B$5,tmp!$J$14:$P$23,5,FALSE)","v":"p10"},null,{"$f":"\"p\"&VLOOKUP(Setup!$B$5,tmp!$J$14:$P$23,6,FALSE)&\"-\"&VLOOKUP(Setup!$B$5,tmp!$J$14:$P$23,7,FALSE)","v":"p15-18"}]
[null,null,null,null,null,null,null,null,null,16,null,null,null,8,null,4,null,2]
["α/α",null,"ByeOrder","ByeSum","ByeCnt","από","seed","Pts","Α.Μ.","Ονοματεπώνυμο","επώνυμο","Σύλλογος"]
[1,1,null,null,0,{"$f":"IF(NOT($G5=\"-\"),VLOOKUP($G5,'AL MD'!$A$3:$G$18,2,FALSE),\"\")","v":0},{"$f":"VLOOKUP($B5,Setup!$G$71:$H$86,2,FALSE)","v":1},{"$f":"IF($I5>0,VLOOKUP($G5,'AL MD'!$A$3:$G$18,6,FALSE),0)","v":0},{"$f":"IF(Setup!$B$25=\"#\",0,IF($G5>0,VLOOKUP($G5,'AL MD'!$A$3:$G$18,3,FALSE),0))","v":0},{"$f":"IF($I5>0,VLOOKUP($I5,'AL MD'!$C$3:$G$18,2,FALSE),\"bye\")","v":"bye"},{"$f":"IF(NOT(I5>0),\"\", IF(ISERROR(FIND(\"-\",J5)), LEFT(J5,FIND(\" \",J5)-1), IF(FIND(\"-\",J5)>FIND(\" \",J5),LEFT(J5,FIND(\" \",J5)-1), LEFT(J5,FIND(\"-\",J5)-1) )))","v":""},{"$f":"IF($I5>0,VLOOKUP($I5,'AL MD'!$C$3:$G$18,3,FALSE),\"\")","v":""},null,{"$f":"UPPER(IF($A$2=\"R\",IF(OR(M5=1,M5=\"a\"),I5,IF(OR(M5=2,M5=\"b\"),I6,\"\")),IF(OR(M5=1,M5=\"1\"),K5,IF(OR(M5=2,M5=\"b\"),K6,\"\"))))","v":""}]
[2,{"$f":"1-D6+4","v":5},1,{"$f":"E6","v":0},{"$f":"IF($B$2>=C6,1,0)","v":0},{"$f":"IF(NOT($G6=\"-\"),VLOOKUP($G6,'AL MD'!$A$3:$G$18,2,FALSE),\"\")","v":0},{"$f":"IF($B$2>=C6,\"-\",VLOOKUP($B6,Setup!$G$71:$H$86,2,FALSE))","v":6},{"$f":"IF($I6>0,VLOOKUP($G6,'AL MD'!$A$3:$G$18,6,FALSE),0)","v":0},{"$f":"IF(Setup!$B$25=\"#\",0,IF(NOT($G6=\"-\"),VLOOKUP($G6,'AL MD'!$A$3:$G$18,3,FALSE),0))","v":0},{"$f":"IF($I6>0,VLOOKUP($I6,'AL MD'!$C$3:$G$18,2,FALSE),\"bye\")","v":"bye"},"",{"$f":"IF($I6>0,VLOOKUP($I6,'AL MD'!$C$3:$G$18,3,FALSE),\"\")","v":""},null,null,null,{"$f":"UPPER(IF($A$2=\"R\",IF(OR(O6=1,O6=\"a\"),N5,IF(OR(O6=2,O6=\"b\"),N7,\"\")),IF(OR(O6=1,O6=\"a\"),N5,IF(OR(O6=2,O6=\"b\"),N7,\"\"))))","v":""}]
[3,{"$f":"2-D7+4","v":6},null,{"$f":"D6+E7","v":0},0,{"$f":"IF(NOT($G7=\"-\"),VLOOKUP($G7,'AL MD'!$A$3:$G$18,2,FALSE),\"\")","v":0},{"$f":"VLOOKUP($B7,Setup!$G$71:$H$86,2,FALSE)","v":12},{"$f":"IF($I7>0,VLOOKUP($G7,'AL MD'!$A$3:$G$18,6,FALSE),0)","v":0},{"$f":"IF(Setup!$B$25=\"#\",0,IF($G7>0,VLOOKUP($G7,'AL MD'!$A$3:$G$18,3,FALSE),0))","v":0},{"$f":"IF($I7>0,VLOOKUP($I7,'AL MD'!$C$3:$G$18,2,FALSE),\"bye\")","v":"bye"},"",{"$f":"IF($I7>0,VLOOKUP($I7,'AL MD'!$C$3:$G$18,3,FALSE),\"\")","v":""},null,{"$f":"UPPER(IF($A$2=\"R\",IF(OR(M7=1,M7=\"a\"),I7,IF(OR(M7=2,M7=\"b\"),I8,\"\")),IF(OR(M7=1,M7=\"a\"),K7,IF(OR(M7=2,M7=\"b\"),K8,\"\"))))","v":""}]
[4,{"$f":"3-D8+4","v":7},7,0,{"$f":"IF($B$2>=C8,1,0)","v":0},{"$f":"IF(NOT($G8=\"-\"),VLOOKUP($G8,'AL MD'!$A$3:$G$18,2,FALSE),\"\")","v":"ALT"},{"$f":"IF($B$2>=C8,\"-\",VLOOKUP($B8,Setup!$G$71:$H$86,2,FALSE))","v":11},{"$f":"IF($I8>0,VLOOKUP($G8,'AL MD'!$A$3:$G$18,6,FALSE),0)","v":0},{"$f":"IF(Setup!$B$25=\"#\",0,IF(NOT($G8=\"-\"),VLOOKUP($G8,'AL MD'!$A$3:$G$18,3,FALSE),0))","v":0},{"$f":"IF($I8>0,VLOOKUP($I8,'AL MD'!$C$3:$G$18,2,FALSE),\"bye\")","v":"bye"},"",{"$f":"IF($I8>0,VLOOKUP($I8,'AL MD'!$C$3:$G$18,3,FALSE),\"\")","v":""},null,null,null,null,null,{"$f":"UPPER(IF($A$2=\"R\",IF(OR(Q8=1,Q8=\"a\"),P6,IF(OR(Q8=2,Q8=\"b\"),P10,\"\")),IF(OR(Q8=1,Q8=\"a\"),P6,IF(OR(Q8=2,Q8=\"b\"),P10,\"\"))))","v":""}]
{"$rows_left_out":37}
{"sheet":"QDprg","index":6,"n_rows":32,"n_cols":5,"rows_kept":32,"cut":false,"hidden":false,"merged":[[0,0,0,4],[1,0,1,4],[22,0,22,2],[3,0,3,2]]}
[{"$f":"Setup!$B$3 & \", \" & Setup!$B$4 & \", \" & Setup!$B$6  & \" (\" & Setup!$B$7 & \")\"","v":"ΕΦΟΑ, 1ο Ε2 2014, ΗΡΑΚΛΕΙΟ Ο.Α. & Α (Α16)"}]
[{"$f":"Setup!$B$10","v":"Νικηφοράκης Σταύρος"}]
[]
["Πρόγραμμα Προκριματικών",null,null,null,"Round 1"]
["ΩΡΑ","Κτγρ.","Αθλητής-Σύλλογος",null,"Αθλητής-Σύλλογος"]
["Έναρξη","Α12 Δ",{"$error":"#VALUE!"},{"$error":"#VALUE!"},""]
[null,"Α12 Δ",""," ",""]
[null,"Α12 Δ",{"$error":"#VALUE!"},{"$error":"#VALUE!"},""]
{"$rows_left_out":25}
{"sheet":"MDprg","index":7,"n_rows":32,"n_cols":5,"rows_kept":32,"cut":false,"hidden":false,"merged":[[0,0,0,4],[1,0,1,4],[22,0,22,2],[3,0,3,2]]}
[{"$f":"Setup!$B$3 & \", \" & Setup!$B$4 & \", \" & Setup!$B$6  & \" (\" & Setup!$B$7 & \")\"","v":"ΕΦΟΑ, 1ο Ε2 2014, ΗΡΑΚΛΕΙΟ Ο.Α. & Α (Α16)"}]
[{"$f":"Setup!$B$10","v":"Νικηφοράκης Σταύρος"}]
[]
["Πρόγραμμα αγώνων Κ.Τ.",null,null,null,"Round 1"]
["ΩΡΑ","Κτγρ.","Αθλητής-Σύλλογος",null,"Αθλητής-Σύλλογος"]
["Έναρξη","Α16","ΚΩΣΤΑΡΑΣ Π (Ο.Α.ΠΕΤΡΟΥΠΟΛΗΣ)"," ",""]
[null,"Α16","ΚΡΑΣΟΥΔΑΚΗΣ Ι (Ο.Α.ΧΑΝΙΩΝ)","-","ΚΥΡΙΑΚΑΚΗΣ-ΜΕΣΣΑΡΙΤΑΚΗΣ Γ (ΗΡΑΚΛΕΙΟ Ο.Α.& Α.)"]
[null,"Α16","ΚΑΪΜΑΡΑΣ Χ (Α.Κ.Α.ΜΑΡΑΘΩΝΑ)","-","ΠΑΤΕΡΑΣ Δ (Α.Ο.ΤΑΤΟΪΟΥ)"]
{"$rows_left_out":25}
{"sheet":"notes","index":8,"n_rows":0,"n_cols":0,"rows_kept":0,"cut":false,"hidden":false,"merged":[]}

{"sheet":"Rankings","index":9,"n_rows":2,"n_cols":6,"rows_kept":2,"cut":false,"hidden":false,"merged":[]}
["ΑΜ","Ονοματεπώνυμο","Βαθμ","Διπλ"]
[null,null,null,null,null,"=IF(C3=\"\";0;VLOOKUP(C3;Rankings!$A:$E;3;FALSE))"]

{"sheet":"CalcPrg","index":10,"n_rows":93,"n_cols":7,"rows_kept":93,"cut":false,"hidden":false,"merged":[[72,0,72,2],[83,0,83,2],[54,0,54,2],[0,0,0,4],[1,0,1,4],[22,0,22,2],[35,0,35,2],[3,0,3,2]]}
[{"$f":"Setup!$B$3 & \", \" & Setup!$B$4 & \", \" & Setup!$B$6  & \" (\" & Setup!$B$7 & \")\"","v":"ΕΦΟΑ, 1ο Ε2 2014, ΗΡΑΚΛΕΙΟ Ο.Α. & Α (Α16)"},null,null,null,null,null,"Don't Change this Worksheet !"]
[{"$f":"Setup!$B$10","v":"Νικηφοράκης Σταύρος"}]
[]
["Πρόγραμμα Προκριματικών",null,null,null,"Round 1"]
["ΩΡΑ","Κτγρ.","Αθλητής-Σύλλογος",null,"Αθλητής-Σύλλογος"]
["Έναρξη",{"$f":"Setup!$B$7","v":"Α16"},{"$f":"IF(OR(QD!H5=\"bye\",QD!H5=\"LWD\"),\"\",LEFT(QD!H5,FIND(\" \",QD!H5)+1)&\" (\"&QD!J5&\")\")","v":{"$error":"#VALUE!"}},{"$f":"IF(OR(C6=\"\",E6=\"\"),\" \",\"-\")","v":{"$error":"#VALUE!"}},{"$f":"IF(OR(QD!H6=\"bye\",QD!H6=\"LWD\"),\"\",LEFT(QD!H6,FIND(\" \",QD!H6)+1)&\" (\"&QD!J6&\")\")","v":""}]
[null,{"$f":"Setup!$B$7","v":"Α16"},{"$f":"IF(OR(QD!H7=\"bye\",QD!H7=\"LWD\"),\"\",LEFT(QD!H7,FIND(\" \",QD!H7)+1)&\" (\"&QD!J7&\")\")","v":""},{"$f":"IF(OR(C7=\"\",E7=\"\"),\" \",\"-\")","v":" "},{"$f":"IF(OR(QD!H8=\"bye\",QD!H8=\"LWD\"), \"\", LEFT(QD!H8,FIND(\" \",QD!H8)+1)&\" (\"&QD!J8&\")\")","v":""}]
[null,{"$f":"Setup!$B$7","v":"Α16"},{"$f":"IF(OR(QD!H9=\"bye\",QD!H9=\"LWD\"),\"\",LEFT(QD!H9,FIND(\" \",QD!H9)+1)&\" (\"&QD!J9&\")\")","v":{"$error":"#VALUE!"}},{"$error":"#VALUE!"},{"$f":"IF(OR(QD!H10=\"bye\",QD!H10=\"LWD\"), \"\", LEFT(QD!H10,FIND(\" \",QD!H10)+1)&\" (\"&QD!J10&\")\")","v":""}]
{"$rows_left_out":86}
{"sheet":"tmp","index":11,"n_rows":34,"n_cols":24,"rows_kept":34,"cut":false,"hidden":false,"merged":[[31,9,33,9],[31,16,33,16],[20,8,22,8],[20,16,22,16],[25,9,25,22],[26,9,26,10],[26,16,26,17],[27,9,30,9],[27,16,30,16],[11,8,11,23],[12,16,12,17],[13,8,16,8],[13,16,16,16],[17,8,19,8],[17,16,19,16],[0,8,0,23],[1,16,1,17],[2,8,5,8],[2,16,5,16],[6,8,8,8],[6,16,8,16]]}
["RndIndx","random","FixRandom",null,"α/α","seed","ByeOrder",null,"ΠΡΟΚΡΙΜΑΤΙΚΑ E1, E2 (32 για 8)"]
[1,{"$f":"RAND()/25","v":8.5763732708090852E-3},2.4457981489311383E-2,null,1,1,null,null,null,null,"17-32","9-16","5-8","3-4","2ος","1ος",null,null,"17-32","9-16","5-8","3-4","2ος","1ος"]
[2,{"$f":"RAND()/25","v":1.1354254335349125E-2},4.0646988542447282E-3,null,2,null,1,null,"E1","E1-12",1,2,2,0,0,0,"E1","E1-12",1,1,0,0,0,0]
[3,{"$f":"RAND()/25","v":3.755889567764964E-2},3.5309102256323867E-2,null,3,null,null,null,null,"E1-14",3,4,4,0,0,0,null,"E1-14",3,1,0,0,0,0]
[4,{"$f":"RAND()/25","v":1.1232801816760372E-2},8.2871600467021092E-3,null,4,null,15,null,null,"E1-16",6,8,8,0,0,0,null,"E1-16",6,2,0,0,0,0]
[5,{"$f":"RAND()/25","v":4.5684177168142173E-3},7.5961168885925901E-3,null,5,null,null,null,null,"E1-18",7.5,10,10,null,null,null,null,"E1-18",7.5,2.5,0,0,0,0]
[6,2.0807149747017809E-2,1.9135796487158369E-2,null,6,null,9,null,"E2","E2-12",0.3,0.5,0.5,0,0,0,"E2","E2-12",0.3,0.2,0,0,0,0]
[7,2.1618181365462875E-2,5.3108638688796807E-3,null,7,null,5,null,null,"E2-14",1,2,2,0,0,0,null,"E2-14",1,1,0,0,0,0]
{"$rows_left_out":26}