{"text_format":"1","workbook":"xlsx","n_sheets":12,"sheets":["Setup","AL QD","AL MD","QD","MD","MD16","QDprg","MDprg","notes","Rankings","CalcPrg","tmp"],"not_rendered":{"charts":0,"images":0,"macros":1,"external_links":0,"defined_names":5,"comments":0,"pivot_tables":0},"unopened":[],"bounds":{"document_bytes":16777216,"sheet_cells":100000,"rows_first":2000,"rows_last":500,"rows_between":2000,"halvings":0,"cell_chars":16384,"cell_head_chars":4096},"cells_cut":0,"cells_raw":0,"read":"whole","date_system":"1900"}

{"sheet":"Setup","index":0,"n_rows":90,"n_cols":18,"rows_kept":90,"cut":false,"hidden":false,"merged":[[0,0,0,1],[12,4,12,8],[3,4,10,4],[1,4,1,7],[1,10,1,11],[59,0,59,1],[60,3,61,3],[1,13,1,17],[3,10,4,10],[6,10,9,10]]}
["ΤΟΥΡΝΟΥΑ QD 32►8, MD 32"]
[null,null,null,null,"Qual seeded",null,null,null,null,null,"M.D. seeded",null,null,"M.D. others"]
["Διοργανωτής: ","ΕΦΟΑ",null,null,null,"seed 1","seed 2","Spaces",null,null,"Θέσεις","seed",null,0,"seed","Spaces","Index","Value"]
["Τίτλος Τουρνουά: ","1ο Ε2 2014",null,null,"8 seeded",1,{"$f":"VALUE(MID($A$34,1,H4-1))","v":0},{"$f":"FIND(\" \",$A$34,1)","v":2},null,null,"3-4",{"$f":"VALUE(LEFT(A45,1))","v":4},null,{"$f":"IF(O4=\"-\",\"-\",IF(O4>0,N3+1,0))","v":0},{"$f":"IF(P4>0,VALUE(MID($A$46,1,P4-1)),\"-\")","v":0},{"$f":"IF(LEN($A$46)>1,FIND(\" \",$A$46,1),0)","v":2},0,0]
["type: ","e2-12",null,null,null,2,{"$f":"VALUE(MID($A$34,H4+1,H5-H4-1))","v":0},{"$f":"FIND(\" \",$A$34,H4+1)","v":4},null,null,null,{"$f":"VALUE(RIGHT(A45,1))","v":3},null,{"$f":"IF(O5=\"-\",\"-\",IF(O5>0,N4+1,0))","v":0},{"$f":"IF(P5>0,VALUE(MID($A$46,P4+1,P5-P4-1)),\"-\")","v":0},{"$f":"IF(AND(P4>0,LEN($A$46)>P4+1),FIND(\" \",$A$46,P4+1),0)","v":4},0,0]
["Έδρα αγώνων: ","ΗΡΑΚΛΕΙΟ Ο.Α. & Α",null,null,null,3,0,6,null,null,"Θέσεις","seed",null,{"$f":"IF(O6=\"-\",\"-\",IF(O6>0,N5+1,0))","v":0},0,6,0,0]
["Κατηγορία: ","Α16",null,null,null,4,0,8,null,null,"5-8",{"$f":"TRIM(LEFT(B45,(FIND(\" \",B45,1)-1)))","v":"5"},null,{"$f":"IF(O7=\"-\",\"-\",IF(O7>0,N6+1,0))","v":0},0,8,0,0]
["Έναρξη: ","28 Φεβρουαρίου",null,null,null,5,0,10,null,null,null,{"$f":"TRIM(MID(B45,(FIND(\" \",B45,1)),FIND(\" \",B45,(FIND(\" \",B45,1)+1))-(FIND(\" \",B45,1))))","v":"8"},null,{"$f":"IF(O8=\"-\",\"-\",IF(O8>0,N7+1,0))","v":0},0,10,0,0]
["Λήξη: ","4 Μαρτίου",null,null,null,6,0,12,null,null,null,{"$f":"TRIM(MID(B45, (FIND(\" \",B45,(FIND(\" \",B45,1)+1))+1), (FIND(\" \",B45,(FIND(\" \",B45,(FIND(\" \",B45,1)+1))+1)))-(FIND(\" \",B45,(FIND(\" \",B45,1)+1))+1)))","v":"6"},null,{"$f":"IF(O9=\"-\",\"-\",IF(O9>0,N8+1,0))","v":0},0,12,0,0]
["Επιδιατητής: ","Νικηφοράκης Σταύρος",null,null,null,7,10,15,null,null,null,{"$f":"TRIM(RIGHT(B45,LEN(B45)-(FIND(\" \",B45,(FIND(\" \",B45,(FIND(\" \",B45,1)+1))+1)))))","v":"7"},null,1,1,14,1,1]
["Τηλέφωνο επιδ: ","6974-735923",null,null,null,8,9,17,null,null,null,null,null,2,2,16,2,2]
[null,null,null,null,null,null,null,null,null,null,null,null,null,3,3,18,3,3]
[null,null,null,null,"Qual others",null,null,null,null,null,null,null,null,4,4,20,4,4]
["Qual Draw",{"$f":"\"(\"&COUNTBLANK('AL QD'!D3:D34)&\")\"","v":"(32)"},null,null,16,"seed","Spaces","Index","Value",null,null,null,null,{"$f":"IF(O14=\"-\",\"-\",IF(O14>0,N13+1,0))","v":5},5,22,5,5]
["Πλήθος bye (0-24): ",{"$f":"COUNTBLANK('AL QD'!D3:D34)","v":32},null,null,{"$f":"IF(F15=0,0,$E$14+1)","v":0},{"$f":"VALUE(MID($A$36,1,G15-1))","v":0},{"$f":"IF(LEN($A$36)>1,FIND(\" \",$A$36,1),0)","v":2},0,0,null,null,null,null,6,6,24,6,6]
["Αριθμός θέσεων seeded: ",8,null,null,{"$f":"IF(F16=0,0,IF(E15>0,E15+1,$E$14+1))","v":0},{"$f":"VALUE(MID($A$36,G15+1,G16-G15-1))","v":0},{"$f":"IF(AND(G15>0,LEN($A$36)>G15+1),FIND(\" \",$A$36,G15+1),0)","v":4},0,0,null,null,null,null,7,7,26,7,7]
["Main Draw",{"$f":"\"(\"&COUNTBLANK('AL MD'!$D$3:$D$34)&\")\"","v":"(6)"},null,null,{"$f":"IF(F17=0,0,IF(E16>0,E16+1,$E$14+1))","v":0},0,6,0,0,null,null,null,null,8,8,28,8,8]
["Πλήθος bye (0-15): ",{"$f":"COUNTBLANK('AL MD'!$D$3:$D$34)","v":6},null,null,{"$f":"IF(F18=0,0,IF(E17>0,E17+1,$E$14+1))","v":0},0,8,0,0,null,null,null,null,9,19,31,9,19]
["Αριθμός θέσεων seeded: ",8,null,null,{"$f":"IF(F19=0,0,IF(E18>0,E18+1,$E$14+1))","v":0},0,10,0,0,null,null,null,null,10,10,34,10,10]
[null,null,null,null,0,0,12,0,0,null,null,null,null,11,9,36,11,9]
[null,null,null,null,0,0,14,0,0,null,null,null,null,12,17,39,12,17]
[null,null,null,null,0,0,16,0,0,null,null,null,null,13,16,42,13,16]
["qd  (# για off) ","#",null,null,0,0,18,0,0,null,null,null,null,14,20,45,14,20]
["md  (# για off) ","ok",null,null,0,0,20,0,0,null,null,null,null,15,21,48,15,21]
["md16  (# για off) ","#",null,null,0,0,22,0,0,null,null,null,null,16,25,51,16,25]
[null,null,null,null,0,0,24,0,0,null,null,null,null,17,13,54,17,13]
[null,null,null,null,0,0,26,0,0,null,null,null,null,18,23,57,18,23]
[null,null,null,null,0,0,28,0,0,null,null,null,null,19,22,60,19,22]
[{"$f":"VLOOKUP($B$15,$E$33:$G$57,2)","v":0},{"$f":"VLOOKUP($B$15,$E$33:$G$57,3)","v":0},null,null,0,0,30,0,0,null,null,null,null,20,12,63,20,12]
[{"$f":"IF(A29>0,LEFT(A37,(8-A29)*2) & RandUniq(9,8+A29,A29),LEFT(A37,8*2)) & \" \"","v":"0 0 0 0 0 0 0 0  "},null,null,null,0,0,32,0,0,null,null,null,null,21,26,66,21,26]
[{"$f":"IF(B29>0,(LEFT(A37,(16-B29)*2)&RandUniq(17,16+B29,B29)),LEFT(A37,16*2))&\" \"","v":"0 0 0 0 0 0 0 0 0 0 0 0 0 0 0 0  "},null,null,null,null,null,null,null,null,null,null,null," ",22,14,69,22,14]
[null,null," ",null,"bye","seed2","other",null,null,null,null,null,null,23,18,72,23,18]
["QD",null,null,null,0,8,16,null,null,null,null,null,null,24,15,75,24,15]
["0 0 0 0 0 0 10 9 ",null,null,null,1,8,15,null,null,null,null,null,null,25,11,78,25,11]
["0 0 0 0 0 0 0 0 ",null,null,null,2,8,14,null,null,null,null,null,null,26,24,81,26,24]
["0 0 0 0 0 0 0 0 0 0 0 0 0 0 0 0  ",null,null,null,3,8,13]
["0 0 0 0 0 0 0 0 0 0 0 0 0 0 0 0 0 0 0 0 0 0 0 0 0 0 0 0 0 0 0 0 ",null,null,null,4,8,12]
[null,null,null,null,5,8,11]
[null,null,null,null,6,8,10]
["=RandUniq(3;4;2)",null,null,null,7,8,9]
["=RandUniq(5;8;4)",null,null,null,8,8,8]
["=LEFT($A$48;$B$18*2) & LEFT($A$47;$B$19*2) & RandUniq($B$19+1;32-$B$18;32-$B$19-$B$18) & \" \"",null,null,null,9,8,7]
[null,null,null,null,10,8,6]
["MD",null,null,null,11,8,5]
["4 3","5 8 6 7",null,null,12,8,4]
["0 0 0 0 0 0 1 2 3 4 5 6 7 8 19 10 9 17 16 20 21 25 13 23 22 12 26 14 18 15 11 24 ",null,null,null,13,8,3]
["1 2 3 4 5 6 7 8 ",null,null,null,14,8,2]
["0 0 0 0 0 0 0 0 0 0 0 0 0 0 0 0 0 0 0 0 0 0 0 0 0 0 0 0 0 0 0 0 0 0 0 0 0 0 0 0 0 0 0 0 0 0 0 0  ",null,null,null,15,8,1]
[null,null,null,null,16,8,0]
[null,null,null,null,17,7,0]
[null,null,null,null,18,6,0]
[null,null,null,null,19,5,0]
[null,null,null,null,20,4,0]
[null,null,null,null,21,3,0]
[null,null,null,null,22,2,0]
[null,null,null,null,23,1,0]
[null,null,null,null,24,0,0]
[]
[]
["16άρι ταμπλό",null,null,"Θέσεις","seed"]
[null,null,null,"3-4",{"$f":"VALUE(LEFT(F61,1))","v":4},"4 3"]
["Διοργανωτής: ",{"$f":"B3","v":"ΕΦΟΑ"},null,null,{"$f":"VALUE(RIGHT(F61,1))","v":3}]
["Τίτλος Τουρνουά: ",{"$f":"B4","v":"1ο Ε2 2014"}]
["type: ","e2-12"]
["Έδρα αγώνων: ","ΗΡΑΚΛΕΙΟ Ο.Α. & Α"]
["Κατηγορία: ","Α16",null,"1 2 3 4 6 12 11 5 7 9 15 16 14 8 13 10 "]
["Έναρξη: ","28 Φεβρουαρίου",null,"1 2 3 4 "]
["Λήξη: ","4 Μαρτίου",null,"0 0 0 0 0 0 0 0 0 0 0 0 0 0 0 0 0 0 0 0 0 0 0 0 0 0 0 0 0 0 0 0 0 0 0 0 0 0 0 0  "]
["Επιδιατητής: ","Νικηφοράκης Σταύρος"]
["Τηλέφωνο επιδ: ","6974-735923",null,0,"seed","space pos","Index","Value"]
[null,null,null,{"$f":"IF(E71=\"-\",\"-\",IF(E71>0,D70+1,0))","v":1},{"$f":"IF(F71>0,VALUE(MID($D$66,1,F71-1)),\"-\")","v":1},{"$f":"IF(LEN($D$66)>1,FIND(\" \",$D$66,1),0)","v":2},1,1]
[null,null,null,{"$f":"IF(E72=\"-\",\"-\",IF(E72>0,D71+1,0))","v":2},{"$f":"IF(F72>0,VALUE(MID($D$66,F71+1,F72-F71-1)),\"-\")","v":2},{"$f":"IF(AND(F71>0,LEN($D$66)>F71+1),FIND(\" \",$D$66,F71+1),0)","v":4},2,2]
[null,null,null,{"$f":"IF(E73=\"-\",\"-\",IF(E73>0,D72+1,0))","v":3},3,6,3,3]
[null,null,null,{"$f":"IF(E74=\"-\",\"-\",IF(E74>0,D73+1,0))","v":4},4,8,4,4]
[null,null,null,5,6,10,5,6]
["Main Draw",{"$f":"\"(\"&COUNTBLANK('AL MD'!$D$3:$D$18)&\")\"","v":"(0)"},null,6,12,13,6,12]
["Πλήθος bye (0-7): ",{"$f":"COUNTBLANK('AL MD'!$D$3:$D$18)","v":0},null,7,11,16,7,11]
["Αριθμός θέσεων seeded: ",4,null,8,5,18,8,5]
[null,null,null,9,7,20,9,7]
[null,null,null,10,9,22,10,9]
[null,null,null,11,15,25,11,15]
[null,null,null,12,16,28,12,16]
["md  (# για off) ","ok",null,13,14,31,13,14]
[null,null,null,14,8,33,14,8]
[null,null,null,15,13,36,15,13]
["=RandUniq(3;4;2)",null,null,16,10,39,16,10]
[]
["=LEFT($D$68;$B$77*2)&LEFT($D$67;$B$78*2)&RandUniq($B$78+1;16-$B$77;16-$B$78-$B$77)&\" \""]
[]
[null,null," "]

{"sheet":"AL QD","index":1,"n_rows":42,"n_cols":10,"rows_kept":42,"cut":false,"hidden":false,"merged":[[35,1,35,4],[41,6,41,7],[0,0,0,6]]}
[{"$f":"Setup!$B$3 & \", \" & Setup!$B$4 & \", \" & Setup!$B$6 & \", \" & Setup!$B$8 & \"-\" & Setup!$B$9","v":"ΕΦΟΑ, 1ο Ε2 2014, ΗΡΑΚΛΕΙΟ Ο.Α. & Α, 28 Φεβρουαρίου-4 Μαρτίου"},null,null,null,null,null,null,{"$f":"Setup!$B$7","v":"Α16"}]
["α/α"," ","  Α.Μ.  ","Ονοματεπώνυμο","Σύλλογος","βαθμ.","   Τηλέφωνο   ","Υπογραφή","srtPts","rand"]
[1,null,null,null,null,null,null,null,{"$f":"IF(C3=\"\",0,F3+J3)","v":0},1.5772524634032104E-2]
[2,null,null,null,null,null,null,null,0,1.0205068941753553E-2]
[3,null,null,null,null,null,null,null,0,1.0883413208593767E-2]
[4,null,null,null,null,null,null,null,0,3.0833001484018886E-3]
[5,null,null,null,null,null,null,null,0,2.9370210174760988E-2]
[6,null,null,null,null,null,null,null,0,2.1890812163676953E-2]
[7,null,null,null,null,null,null,null,0,3.1456384875983789E-2]
[8,null,null,null,null,null,null,null,0,1.3180944981985299E-3]
[9,null,null,null,null,null,null,null,0,3.8587376644361092E-2]
[10,null,null,null,null,null,null,null,0,9.6409184645231957E-5]
[11,null,null,null,null,null,null,null,0,1.6887971953247947E-2]
[12,null,null,null,null,null,null,null,0,3.5774431298166045E-4]
[13,null,null,null,null,null,null,null,0,1.4173432744935597E-2]
[14,null,null,null,null,null,null,null,0,3.5448598637397521E-2]
[15,null,null,null,null,null,null,null,0,1.3786464546098149E-2]
[16,null,null,null,null,null,null,null,0,2.3381886327394796E-2]
[17,null,null,null,null,null,null,null,0,1.7219843162904071E-2]
[18,null,null,"",null,0,null,null,0,1.1417681975327252E-2]
[19,null,null,"",null,0,null,null,0,3.7775105821058884E-2]
[20,null,null,"",null,0,null,null,0,5.0917538107316139E-3]
[21,null,null,"",null,0,null,null,0,2.6701280650675142E-3]
[22,null,null,"",null,0,null,null,0,7.7757695845035489E-3]
[23,null,null,"",null,0,null,null,0,2.4329787281480678E-2]
[24,null,null,"",null,0,null,null,0,2.0450769029904045E-2]
[25,null,null,"",null,0,null,null,0,2.0939115413057346E-2]
[26,null,null,"",null,0,null,null,0,6.3929616149408152E-3]
[27,null,null,"",null,0,null,null,0,1.1228633230459724E-2]
[28,null,null,"",null,0,null,null,0,2.2789964265901737E-2]
[29,null,null,"",null,0,null,null,0,1.2410800597369508E-2]
[30,null,null,"",null,0,null,null,0,3.6737779709876087E-2]
[31,null,null,"",null,0,null,null,0,3.131286249720204E-2]
[32,null,null,"",null,0,null,null,0,1.4989701104620545E-3]
[]
[null,"Walk over"]
[null,"α/α","Α.Μ.","Ονοματεπώνυμο","med (Ν ή Ο)"]
[null,1]
[null,2]
[null,3]
[null,4,null,null,null,null,"επιδιαιτητής"]
[null,5,null,null,null,null,{"$f":"Setup!B10","v":"Νικηφοράκης Σταύρος"}]

{"sheet":"AL MD","index":2,"n_rows":42,"n_cols":10,"rows_kept":42,"cut":false,"hidden":false,"merged":[[35,1,35,4],[41,6,41,7],[0,0,0,6]]}
[{"$f":"Setup!$B$3 & \", \" & Setup!$B$4 & \", \" & Setup!$B$6 & \", \" & Setup!$B$8 & \"-\" & Setup!$B$9","v":"ΕΦΟΑ, 1ο Ε2 2014, ΗΡΑΚΛΕΙΟ Ο.Α. & Α, 28 Φεβρουαρίου-4 Μαρτίου"},null,null,null,null,null,null,{"$f":"Setup!$B$7","v":"Α16"}]
["α/α","από","  Α.Μ.  ","Ονοματεπώνυμο","Σύλλογος","βαθμ.","   Τηλέφωνο   ","Υπογραφή","srtPts","rand"]
[1,null,26317,"ΚΩΣΤΑΡΑΣ ΠΑΝΑΓΙΩΤΗΣ","Ο.Α.ΠΕΤΡΟΥΠΟΛΗΣ",646,null,null,{"$f":"IF(C3=\"\",0,F3+J3)","v":646.02445798148926},2.4457981489311383E-2]
[2,null,25297,"ΚΑΠΙΡΗΣ ΣΤΑΜΑΤΗΣ","Α.Ο.Α.ΗΛΙΟΥΠΟΛΗΣ",506,null,null,506.00406469885422,4.0646988542447282E-3]
[3,null,30186,"ΠΙΤΣΙΝΗΣ ΔΗΜΗΤΡΙΟΣ","Ο.Α.ΚΕΡΑΤΣΙΝΙΟΥ",440,null,null,440.03530910225635,3.5309102256323867E-2]
[4,null,26459,"ΝΑΟΥΜ ΣΠΥΡΙΔΩΝ","Ο.Α.ΧΑΝΙΩΝ",333,null,null,333.00828716004668,8.2871600467021092E-3]
[5,null,26457,"ΑΡΕΤΑΚΗΣ ΙΩΑΝΝΗΣ","Ο.Α.ΧΑΝΙΩΝ",247,null,null,247.00759611688861,7.5961168885925901E-3]
[6,null,27583,"ΠΑΧΑΚΗΣ ΝΙΚΟΛΑΟΣ-ΑΝΔΡΕΑΣ","Ο.Α.ΑΘΗΝΩΝ",219,null,null,219.00531086386889,5.3108638688796807E-3]
[7,null,29274,"ΣΗΜΑΙΟΦΟΡΙΔΗΣ ΧΑΡΑΛΑΜΠΟΣ","ΠΕΥΚΗ Γ.ΚΑΛΟΒΕΛΩΝΗΣ",212,null,null,212.0237767470787,2.3776747078706278E-2]
[8,null,26427,"ΦΡΙΣΗΡΑΣ ΣΤΕΦΑΝΟΣ","Ο.Α.ΑΘΛΗΤ.ΠΑΙΔΕΙΑ",139,null,null,139.01854412412118,1.8544124121176363E-2]
[9,null,28337,"ΚΑΪΜΑΡΑΣ ΧΡΗΣΤΟΣ","Α.Κ.Α.ΜΑΡΑΘΩΝΑ",136,null,null,136.00147272945676,1.4727294567760652E-3]
[10,null,26338,"ΚΥΡΙΑΚΑΚΗΣ-ΜΕΣΣΑΡΙΤΑΚΗΣ ΓΕΩΡΓΙΟΣ","ΗΡΑΚΛΕΙΟ Ο.Α.& Α.",119,null,null,119.00596016482008,5.9601648200855806E-3]
[11,"ALT",28285,"ΠΗΛΙΟΥΝΗΣ ΜΙΧΑΗΛ","Ο.Α. ΑΘΗΝΩΝ",114,null,null,114.01913579648716,1.9135796487158369E-2]
[12,null,29789,"ΤΣΟΜΛΕΚΤΣΟΓΛΟΥ ΝΙΚΟΛΑΟΣ","Α.Ο.Α.ΦΙΛΟΘΕΗΣ",109,null,null,109.00438464707835,4.3846470783480114E-3]
[13,null,28588,"ΑΓΓΕΛΟΠΟΥΛΟΣ ΜΙΛΤΙΑΔΗΣ","ΠΕΥΚΗ Γ.ΚΑΛΟΒΕΛΩΝΗΣ",103,null,null,103.00058602699016,5.8602699016837786E-4]
[14,null,26547,"ΚΟΚΟΤΣΑΚΗΣ ΑΛΚΙΝΟΟΣ","Α.Ο.Α.ΗΛΙΟΥΠΟΛΗΣ",73,null,null,73.01593985266561,1.5939852665617132E-2]
[15,null,29651,"ΝΙΚΟΛΑΚΑΚΗΣ ΙΩΑΝΝΗΣ","ΗΡΑΚΛΕΙΟ Ο.Α.& Α.",67,null,null,67.037127154946887,3.712715494688941E-2]
[16,null,26230,"ΜΑΝΟΥΣΑΚΗΣ ΚΥΡΙΑΚΟΣ","ΗΡΑΚΛΕΙΟ Ο.Α.& Α.",49,null,null,49.022537002543089,2.2537002543092068E-2]
[17,null,29502,"ΠΑΤΕΡΑΣ ΔΙΑΜΑΝΤΗΣ","Α.Ο.ΤΑΤΟΪΟΥ",46,null,null,46.005826776003651,5.826776003653329E-3]
[18,null,30944,"ΚΟΝΤΟΓΙΩΡΓΑΚΗΣ ΙΩΑΝΝΗΣ","Ο.Α.ΣΗΤΕΙΑΣ",44,null,null,44.013215640213971,1.3215640213968829E-2]
[19,null,28243,"ΚΡΑΣΟΥΔΑΚΗΣ ΙΩΑΝΝΗΣ-ΓΕΩΡΓΙΟΣ","Ο.Α.ΧΑΝΙΩΝ",36.5,null,null,36.505744889394464,5.744889394460522E-3]
[20,null,26172,"ΣΤΑΥΡΟΥΛΑΚΗΣ ΓΕΩΡΓΙΟΣ","ΗΡΑΚΛΕΙΟ Ο.Α.& Α.",34,null,null,34.027476962414816,2.7476962414815835E-2]
[21,null,33530,"ΓΙΑΚΟΥΜΑΚΗΣ ΙΩΑΝΝΗΣ","Ο.Α.ΧΑΝΙΩΝ",26,null,null,26.039275071678805,3.9275071678805847E-2]
[22,null,30064,"ΚΟΥΚΟΥΛΙΘΡΑΣ ΙΩΑΝΝΗΣ","Ο.Α.ΚΕΡΑΤΣΙΝΙΟΥ",25,null,null,25.022161363530341,2.2161363530340098E-2]
[23,null,33872,"ΚΡΟΝΤΗΡΑΣ ΑΝΑΣΤΑΣΙΟΣ","ΗΡΑΚΛΕΙΟ Ο.Α.& Α.",13,null,null,13.012876077784496,1.2876077784495248E-2]
[24,null,34445,"ΠΑΠΑΚΥΡΙΑΚΟΥ ΜΙΧΑΛΗΣ","Α.Ο.ΒΑΡΗΣ ΑΝΑΓΥΡΟΥΣ",0,null,null,3.8645904157832298E-2,3.8645904157832298E-2]
[25,null,35870,"ΠΑΡΑΣΚΕΥΑΣ ΜΑΡΙΝΟΣ","Α.Π.Μ.Σ.ΑΣΚΗΣΗ ΗΡΑΚΛΕΙΟΥ",0,null,null,2.4613119562463516E-2,2.4613119562463516E-2]
[26,null,30054,"ΣΑΚΕΛΛΑΡΙΔΗΣ ΜΙΧΑΛΗΣ","Ο.Α.ΑΓΙΑΣ ΠΑΡΑΣΚΕΥΗΣ",0,null,null,1.4628744235009501E-2,1.4628744235009501E-2]
[27,null,null,null,null,null,null,null,0,2.8821068867363912E-2]
[28,null,null,null,null,null,null,null,0,3.6143213527570953E-2]
[29,null,null,null,null,null,null,null,0,1.1978541603131436E-2]
[30,null,null,null,null,null,null,null,0,1.5829326203151552E-2]
[31,null,null,null,null,null,null,null,0,4.7513255553265311E-3]
[32,null,null,null,null,0,null,null,0,2.7403534004256373E-2]
[]
[null,"Walk over"]
[null,"α/α","Α.Μ.","Ονοματεπώνυμο","med (Ν ή Ο)"]
[null,1,24168,"ΜΙΧΑΗΛΟΣ ΣΤΕΦΑΝΟΣ","Ν"]
[null,2,24511,"ΙΩΑΝΝΙΔΗΣ ΝΙΚΟΛΑΟΣ","Ν"]
[null,3,24772,"ΜΑΡΚΟΓΙΑΝΝΑΚΗΣ ΚΩΝΣΤΑΝΤΙΝΟΣ","Ο"]
[null,4,null,null,null,null,"επιδιαιτητής"]
[null,5,null,null,null,null,{"$f":"Setup!B10","v":"Νικηφοράκης Σταύρος"}]

{"sheet":"QD","index":3,"n_rows":67,"n_cols":14,"rows_kept":67,"cut":false,"hidden":false,"merged":[[0,0,0,11],[39,13,39,15],[2,7,2,9],[38,7,38,9]]}
[{"$f":"Setup!B3 & \", \" & Setup!B4 & \", \" & Setup!B6 & \", \" & Setup!B8 & \"-\" & Setup!B9","v":"ΕΦΟΑ, 1ο Ε2 2014, ΗΡΑΚΛΕΙΟ Ο.Α. & Α, 28 Φεβρουαρίου-4 Μαρτίου"},null,null,null,null,null,null,null,null,null,null,null,null,{"$f":"Setup!$B$7","v":"Α16"}]
[null,{"$f":"Setup!B15","v":32},null,null,null,null,{"$f":"\"p\"&VLOOKUP(Setup!$B$5,tmp!$J$3:$P$9,2,FALSE)","v":"p0,3"},null,null,null,null,{"$f":"\"p\"&VLOOKUP(Setup!$B$5,tmp!$J$3:$P$9,3,FALSE)","v":"p0,5"},null,{"$f":"\"p\"&VLOOKUP(Setup!$B$5,tmp!$J$3:$P$9,4,FALSE)","v":"p0,5"}]
[null,null,null,null,null,null,null,32,null,null,null,16,null,8]
["α/α",null,"ByeOrder","ByeSum","ByeCnt","seed","  Α.Μ.  ","Ονοματεπώνυμο","επώνυμο","Σύλλογος"]
[1,null,null,null,0,1,{"$f":"IF(Setup!$B$23=\"#\",0,IF(F5>0,VLOOKUP(F5,'AL QD'!$A$3:$H$34,3,FALSE),0))","v":0},{"$f":"IF($G5>0,VLOOKUP(G5,'AL QD'!$C$3:$H$34,2,FALSE),0)","v":0},{"$f":"IF(NOT(G5>0),\"\", IF(ISERROR(FIND(\"-\",H5)), LEFT(H5,FIND(\" \",H5)-1),  IF(FIND(\"-\",H5)>FIND(\" \",H5),LEFT(H5,FIND(\" \",H5)-1),   LEFT(H5,FIND(\"-\",H5)-1)    )))","v":""},{"$f":"IF($G5>0,VLOOKUP($G5,'AL QD'!$C$3:$E$34,3,FALSE),\"\")","v":""},null,{"$f":"UPPER(IF($A$2=\"R\",IF(OR(K5=1,K5=\"a\"),G5,IF(OR(K5=2,K5=\"b\"),G6,\"\")),IF(OR(K5=1,K5=\"1\"),I5,IF(OR(K5=2,K5=\"b\"),I6,\"\"))))","v":""}]
[2,{"$f":"IF(E6=0,17-D6,0)","v":0},1,{"$f":"E6","v":1},{"$f":"IF($B$2>=C6,1,0)","v":1},{"$f":"IF($B$2>=C6,\"-\",VLOOKUP($B6,Setup!$H$15:$I$30,2,FALSE))","v":"-"},{"$f":"IF(Setup!$B$23=\"#\",0,IF(NOT(F6=\"-\"),VLOOKUP(F6,'AL QD'!$A$3:$H$34,3,FALSE),0))","v":0},{"$f":"IF($G6>0,VLOOKUP($G6,'AL QD'!$C$3:$E$34,2,FALSE),\"bye\")","v":"bye"},{"$f":"IF(NOT(G6>0),\"\", IF(ISERROR(FIND(\"-\",H6)), LEFT(H6,FIND(\" \",H6)-1),  IF(FIND(\"-\",H6)>FIND(\" \",H6),LEFT(H6,FIND(\" \",H6)-1),   LEFT(H6,FIND(\"-\",H6)-1)    )))","v":""},{"$f":"IF($G6>0,VLOOKUP($G6,'AL QD'!$C$3:$E$34,3,FALSE),\"\")","v":""},null,null,null,{"$f":"UPPER(IF($A$2=\"R\",IF(OR(M6=1,M6=\"a\"),L5,IF(OR(M6=2,M6=\"b\"),L7,\"\")),IF(OR(M6=1,M6=\"a\"),L5,IF(OR(M6=2,M6=\"b\"),L7,\"\"))))","v":""}]
[3,{"$f":"IF(E7=0,18-D7,0)","v":0},{"$f":"Setup!G4","v":0},{"$f":"D6+E7","v":2},{"$f":"IF($B$2>=C7,1,0)","v":1},{"$f":"IF($B$2>=C7,\"-\",VLOOKUP($B7,Setup!$H$15:$I$30,2,FALSE))","v":"-"},{"$f":"IF(Setup!$B$23=\"#\",0,IF(NOT(F7=\"-\"),VLOOKUP(F7,'AL QD'!$A$3:$H$34,3,FALSE),0))","v":0},{"$f":"IF($G7>0,VLOOKUP(G7,'AL QD'!$C$3:$E$34,2,FALSE),\"bye\")","v":"bye"},"",{"$f":"IF($G7>0,VLOOKUP($G7,'AL QD'!$C$3:$E$34,3,FALSE),\"\")","v":""},null,{"$f":"UPPER(IF($A$2=\"R\",IF(OR(K7=1,K7=\"a\"),G7,IF(OR(K7=2,K7=\"b\"),G8,\"\")),IF(OR(K7=1,K7=\"a\"),I7,IF(OR(K7=2,K7=\"b\"),I8,\"\"))))","v":""}]
[4,null,17,3,{"$f":"IF($B$2>=C8,1,0)","v":1},{"$f":"Setup!G4","v":0},{"$f":"IF(Setup!$B$23=\"#\",0,IF(F8>0,VLOOKUP(F8,'AL QD'!$A$3:$E$34,3,FALSE),0))","v":0},{"$f":"IF(G8>0,VLOOKUP(G8,'AL QD'!$C$3:$E$34,2,FALSE),\"bye\")","v":"bye"},"",{"$f":"IF($G8>0,VLOOKUP($G8,'AL QD'!$C$3:$E$34,3,FALSE),\"\")","v":""}]
[5,null,null,3,0,2,{"$f":"IF(Setup!$B$23=\"#\",0,IF(F9>0,VLOOKUP(F9,'AL QD'!$A$3:$H$34,3,FALSE),0))","v":0},{"$f":"IF($G9>0,VLOOKUP(G9,'AL QD'!$C$3:$H$34,2,FALSE),0)","v":0},"",{"$f":"IF($G9>0,VLOOKUP($G9,'AL QD'!$C$3:$E$34,3,FALSE),\"\")","v":""},null,{"$f":"UPPER(IF($A$2=\"R\",IF(OR(K9=1,K9=\"a\"),G9,IF(OR(K9=2,K9=\"b\"),G10,\"\")),IF(OR(K9=1,K9=\"a\"),I9,IF(OR(K9=2,K9=\"b\"),I10,\"\"))))","v":""}]
[6,{"$f":"IF(E10=0,19-D10,0)","v":0},2,4,{"$f":"IF($B$2>=C10,1,0)","v":1},{"$f":"IF($B$2>=C10,\"-\",VLOOKUP($B10,Setup!$H$15:$I$30,2,FALSE))","v":"-"},{"$f":"IF(Setup!$B$23=\"#\",0,IF(NOT(F10=\"-\"),VLOOKUP(F10,'AL QD'!$A$3:$E$34,3,FALSE),0))","v":0},{"$f":"IF($G10>0,VLOOKUP($G10,'AL QD'!$C$3:$E$34,2,FALSE),\"bye\")","v":"bye"},"",{"$f":"IF($G10>0,VLOOKUP($G10,'AL QD'!$C$3:$E$34,3,FALSE),\"\")","v":""},null,null,null,{"$f":"UPPER(IF($A$2=\"R\",IF(OR(M10=1,M10=\"a\"),L9,IF(OR(M10=2,M10=\"b\"),L11,\"\")),IF(OR(M10=1,M10=\"a\"),L9,IF(OR(M10=2,M10=\"b\"),L11,\"\"))))","v":""}]
[7,{"$f":"IF(E11=0,20-D11,0)","v":0},{"$f":"Setup!G5","v":0},5,{"$f":"IF($B$2>=C11,1,0)","v":1},{"$f":"IF($B$2>=C11,\"-\",VLOOKUP($B11,Setup!$H$15:$I$30,2,FALSE))","v":"-"},{"$f":"IF(Setup!$B$23=\"#\",0,IF(NOT(F11=\"-\"),VLOOKUP(F11,'AL QD'!$A$3:$E$34,3,FALSE),0))","v":0},{"$f":"IF($G11>0,VLOOKUP($G11,'AL QD'!$C$3:$E$34,2,FALSE),\"bye\")","v":"bye"},"",{"$f":"IF($G11>0,VLOOKUP($G11,'AL QD'!$C$3:$E$34,3,FALSE),\"\")","v":""},null,{"$f":"UPPER(IF($A$2=\"R\",IF(OR(K11=1,K11=\"a\"),G11,IF(OR(K11=2,K11=\"b\"),G12,\"\")),IF(OR(K11=1,K11=\"a\"),I11,IF(OR(K11=2,K11=\"b\"),I12,\"\"))))","v":""}]
[8,null,18,6,{"$f":"IF($B$2>=C12,1,0)","v":1},{"$f":"Setup!G5","v":0},{"$f":"IF(Setup!$B$23=\"#\",0,IF(F12>0,VLOOKUP(F12,'AL QD'!$A$3:$E$34,3,FALSE),0))","v":0},{"$f":"IF(G12>0,VLOOKUP(G12,'AL QD'!$C$3:$E$34,2,FALSE),\"bye\")","v":"bye"},"",{"$f":"IF($G12>0,VLOOKUP($G12,'AL QD'!$C$3:$E$34,3,FALSE),\"\")","v":""}]
[9,null,null,6,0,3,{"$f":"IF(Setup!$B$23=\"#\",0,IF(F13>0,VLOOKUP(F13,'AL QD'!$A$3:$H$34,3,FALSE),0))","v":0},{"$f":"IF($G13>0,VLOOKUP(G13,'AL QD'!$C$3:$H$34,2,FALSE),0)","v":0},"",{"$f":"IF($G13>0,VLOOKUP($G13,'AL QD'!$C$3:$E$34,3,FALSE),\"\")","v":""},null,{"$f":"UPPER(IF($A$2=\"R\",IF(OR(K13=1,K13=\"a\"),G13,IF(OR(K13=2,K13=\"b\"),G14,\"\")),IF(OR(K13=1,K13=\"a\"),I13,IF(OR(K13=2,K13=\"b\"),I14,\"\"))))","v":""}]
[10,{"$f":"IF(E14=0,21-D14,0)","v":0},3,7,{"$f":"IF($B$2>=C14,1,0)","v":1},{"$f":"IF($B$2>=C14,\"-\",VLOOKUP($B14,Setup!$H$15:$I$30,2,FALSE))","v":"-"},{"$f":"IF(Setup!$B$23=\"#\",0,IF(NOT(F14=\"-\"),VLOOKUP(F14,'AL QD'!$A$3:$E$34,3,FALSE),0))","v":0},{"$f":"IF($G14>0,VLOOKUP($G14,'AL QD'!$C$3:$E$34,2,FALSE),\"bye\")","v":"bye"},"",{"$f":"IF($G14>0,VLOOKUP($G14,'AL QD'!$C$3:$E$34,3,FALSE),\"\")","v":""},null,null,null,{"$f":"UPPER(IF($A$2=\"R\",IF(OR(M14=1,M14=\"a\"),L13,IF(OR(M14=2,M14=\"b\"),L15,\"\")),IF(OR(M14=1,M14=\"a\"),L13,IF(OR(M14=2,M14=\"b\"),L15,\"\"))))","v":""}]
[11,{"$f":"IF(E15=0,22-D15,0)","v":0},{"$f":"Setup!G6","v":0},8,{"$f":"IF($B$2>=C15,1,0)","v":1},{"$f":"IF($B$2>=C15,\"-\",VLOOKUP($B15,Setup!$H$15:$I$30,2,FALSE))","v":"-"},{"$f":"IF(Setup!$B$23=\"#\",0,IF(NOT(F15=\"-\"),VLOOKUP(F15,'AL QD'!$A$3:$E$34,3,FALSE),0))","v":0},{"$f":"IF(G15>0,VLOOKUP(G15,'AL QD'!$C$3:$E$34,2,FALSE),\"bye\")","v":"bye"},"",{"$f":"IF($G15>0,VLOOKUP($G15,'AL QD'!$C$3:$E$34,3,FALSE),\"\")","v":""},null,{"$f":"UPPER(IF($A$2=\"R\",IF(OR(K15=1,K15=\"a\"),G15,IF(OR(K15=2,K15=\"b\"),G16,\"\")),IF(OR(K15=1,K15=\"a\"),I15,IF(OR(K15=2,K15=\"b\"),I16,\"\"))))","v":""}]
[12,null,19,9,{"$f":"IF($B$2>=C16,1,0)","v":1},{"$f":"Setup!G6","v":0},{"$f":"IF(Setup!$B$23=\"#\",0,IF(F16>0,VLOOKUP(F16,'AL QD'!$A$3:$E$34,3,FALSE),0))","v":0},{"$f":"IF(G16>0,VLOOKUP(G16,'AL QD'!$C$3:$E$34,2,FALSE),\"bye\")","v":"bye"},"",{"$f":"IF($G16>0,VLOOKUP($G16,'AL QD'!$C$3:$E$34,3,FALSE),\"\")","v":""}]
[13,null,null,9,0,4,{"$f":"IF(Setup!$B$23=\"#\",0,IF(F17>0,VLOOKUP(F17,'AL QD'!$A$3:$H$34,3,FALSE),0))","v":0},{"$f":"IF($G17>0,VLOOKUP(G17,'AL QD'!$C$3:$H$34,2,FALSE),0)","v":0},"",{"$f":"IF($G17>0,VLOOKUP($G17,'AL QD'!$C$3:$E$34,3,FALSE),\"\")","v":""},null,{"$f":"UPPER(IF($A$2=\"R\",IF(OR(K17=1,K17=\"a\"),G17,IF(OR(K17=2,K17=\"b\"),G18,\"\")),IF(OR(K17=1,K17=\"a\"),I17,IF(OR(K17=2,K17=\"b\"),I18,\"\"))))","v":""}]
[14,{"$f":"IF(E18=0,23-D18,0)","v":0},4,10,{"$f":"IF($B$2>=C18,1,0)","v":1},{"$f":"IF($B$2>=C18,\"-\",VLOOKUP($B18,Setup!$H$15:$I$30,2,FALSE))","v":"-"},{"$f":"IF(Setup!$B$23=\"#\",0,IF(NOT(F18=\"-\"),VLOOKUP(F18,'AL QD'!$A$3:$E$34,3,FALSE),0))","v":0},{"$f":"IF($G18>0,VLOOKUP($G18,'AL QD'!$C$3:$E$34,2,FALSE),\"bye\")","v":"bye"},"",{"$f":"IF($G18>0,VLOOKUP($G18,'AL QD'!$C$3:$E$34,3,FALSE),\"\")","v":""},null,null,null,{"$f":"UPPER(IF($A$2=\"R\",IF(OR(M18=1,M18=\"a\"),L17,IF(OR(M18=2,M18=\"b\"),L19,\"\")),IF(OR(M18=1,M18=\"a\"),L17,IF(OR(M18=2,M18=\"b\"),L19,\"\"))))","v":""}]
[15,{"$f":"IF(E19=0,24-D19,0)","v":0},{"$f":"Setup!G7","v":0},11,{"$f":"IF($B$2>=C19,1,0)","v":1},{"$f":"IF($B$2>=C19,\"-\",VLOOKUP($B19,Setup!$H$15:$I$30,2,FALSE))","v":"-"},{"$f":"IF(Setup!$B$23=\"#\",0,IF(NOT(F19=\"-\"),VLOOKUP(F19,'AL QD'!$A$3:$E$34,3,FALSE),0))","v":0},{"$f":"IF(G19>0,VLOOKUP(G19,'AL QD'!$C$3:$E$34,2,FALSE),\"bye\")","v":"bye"},"",{"$f":"IF($G19>0,VLOOKUP($G19,'AL QD'!$C$3:$E$34,3,FALSE),\"\")","v":""},null,{"$f":"UPPER(IF($A$2=\"R\",IF(OR(K19=1,K19=\"a\"),G19,IF(OR(K19=2,K19=\"b\"),G20,\"\")),IF(OR(K19=1,K19=\"a\"),I19,IF(OR(K19=2,K19=\"b\"),I20,\"\"))))","v":""}]
[16,null,20,12,{"$f":"IF($B$2>=C20,1,0)","v":1},{"$f":"Setup!G7","v":0},{"$f":"IF(Setup!$B$23=\"#\",0,IF(F20>0,VLOOKUP(F20,'AL QD'!$A$3:$E$34,3,FALSE),0))","v":0},{"$f":"IF(G20>0,VLOOKUP(G20,'AL QD'!$C$3:$E$34,2,FALSE),\"bye\")","v":"bye"},"",{"$f":"IF($G20>0,VLOOKUP($G20,'AL QD'!$C$3:$E$34,3,FALSE),\"\")","v":""}]
[17,null,null,{"$f":"D20+E21","v":12},0,5,{"$f":"IF(Setup!$B$23=\"#\",0,IF(F21>0,VLOOKUP(F21,'AL QD'!$A$3:$H$34,3,FALSE),0))","v":0},{"$f":"IF($G21>0,VLOOKUP(G21,'AL QD'!$C$3:$H$34,2,FALSE),0)","v":0},"",{"$f":"IF($G21>0,VLOOKUP($G21,'AL QD'!$C$3:$E$34,3,FALSE),\"\")","v":""},null,{"$f":"UPPER(IF($A$2=\"R\",IF(OR(K21=1,K21=\"a\"),G21,IF(OR(K21=2,K21=\"b\"),G22,\"\")),IF(OR(K21=1,K21=\"a\"),I21,IF(OR(K21=2,K21=\"b\"),I22,\"\"))))","v":""}]
[18,{"$f":"IF(E22=0,25-D22,0)","v":0},5,13,{"$f":"IF($B$2>=C22,1,0)","v":1},{"$f":"IF($B$2>=C22,\"-\",VLOOKUP($B22,Setup!$H$15:$I$30,2,FALSE))","v":"-"},{"$f":"IF(Setup!$B$23=\"#\",0,IF(NOT(F22=\"-\"),VLOOKUP(F22,'AL QD'!$A$3:$E$34,3,FALSE),0))","v":0},{"$f":"IF($G22>0,VLOOKUP($G22,'AL QD'!$C$3:$E$34,2,FALSE),\"bye\")","v":"bye"},"",{"$f":"IF($G22>0,VLOOKUP($G22,'AL QD'!$C$3:$E$34,3,FALSE),\"\")","v":""},null,null,null,{"$f":"UPPER(IF($A$2=\"R\",IF(OR(M22=1,M22=\"a\"),L21,IF(OR(M22=2,M22=\"b\"),L23,\"\")),IF(OR(M22=1,M22=\"a\"),L21,IF(OR(M22=2,M22=\"b\"),L23,\"\"))))","v":""}]
[19,{"$f":"IF(E23=0,26-D23,0)","v":0},{"$f":"Setup!G8","v":0},14,{"$f":"IF($B$2>=C23,1,0)","v":1},{"$f":"IF($B$2>=C23,\"-\",VLOOKUP($B23,Setup!$H$15:$I$30,2,FALSE))","v":"-"},{"$f":"IF(Setup!$B$23=\"#\",0,IF(NOT(F23=\"-\"),VLOOKUP(F23,'AL QD'!$A$3:$E$34,3,FALSE),0))","v":0},{"$f":"IF(G23>0,VLOOKUP(G23,'AL QD'!$C$3:$E$34,2,FALSE),\"bye\")","v":"bye"},"",{"$f":"IF($G23>0,VLOOKUP($G23,'AL QD'!$C$3:$E$34,3,FALSE),\"\")","v":""},null,{"$f":"UPPER(IF($A$2=\"R\",IF(OR(K23=1,K23=\"a\"),G23,IF(OR(K23=2,K23=\"b\"),G24,\"\")),IF(OR(K23=1,K23=\"a\"),I23,IF(OR(K23=2,K23=\"b\"),I24,\"\"))))","v":""}]
[20,null,21,15,{"$f":"IF($B$2>=C24,1,0)","v":1},{"$f":"Setup!G8","v":0},{"$f":"IF(Setup!$B$23=\"#\",0,IF(F24>0,VLOOKUP(F24,'AL QD'!$A$3:$E$34,3,FALSE),0))","v":0},{"$f":"IF(G24>0,VLOOKUP(G24,'AL QD'!$C$3:$E$34,2,FALSE),\"bye\")","v":"bye"},"",{"$f":"IF($G24>0,VLOOKUP($G24,'AL QD'!$C$3:$E$34,3,FALSE),\"\")","v":""}]
[21,null,null,15,0,6,{"$f":"IF(Setup!$B$23=\"#\",0,IF(F25>0,VLOOKUP(F25,'AL QD'!$A$3:$H$34,3,FALSE),0))","v":0},{"$f":"IF($G25>0,VLOOKUP(G25,'AL QD'!$C$3:$H$34,2,FALSE),0)","v":0},"",{"$f":"IF($G25>0,VLOOKUP($G25,'AL QD'!$C$3:$E$34,3,FALSE),\"\")","v":""},null,{"$f":"UPPER(IF($A$2=\"R\",IF(OR(K25=1,K25=\"a\"),G25,IF(OR(K25=2,K25=\"b\"),G26,\"\")),IF(OR(K25=1,K25=\"a\"),I25,IF(OR(K25=2,K25=\"b\"),I26,\"\"))))","v":""}]
[22,{"$f":"IF(E26=0,27-D26,0)","v":0},6,16,{"$f":"IF($B$2>=C26,1,0)","v":1},{"$f":"IF($B$2>=C26,\"-\",VLOOKUP($B26,Setup!$H$15:$I$30,2,FALSE))","v":"-"},{"$f":"IF(Setup!$B$23=\"#\",0,IF(NOT(F26=\"-\"),VLOOKUP(F26,'AL QD'!$A$3:$E$34,3,FALSE),0))","v":0},{"$f":"IF($G26>0,VLOOKUP($G26,'AL QD'!$C$3:$E$34,2,FALSE),\"bye\")","v":"bye"},"",{"$f":"IF($G26>0,VLOOKUP($G26,'AL QD'!$C$3:$E$34,3,FALSE),\"\")","v":""},null,null,null,{"$f":"UPPER(IF($A$2=\"R\",IF(OR(M26=1,M26=\"a\"),L25,IF(OR(M26=2,M26=\"b\"),L27,\"\")),IF(OR(M26=1,M26=\"a\"),L25,IF(OR(M26=2,M26=\"b\"),L27,\"\"))))","v":""}]
[23,{"$f":"IF(E27=0,28-D27,0)","v":0},{"$f":"Setup!G9","v":0},17,{"$f":"IF($B$2>=C27,1,0)","v":1},{"$f":"IF($B$2>=C27,\"-\",VLOOKUP($B27,Setup!$H$15:$I$30,2,FALSE))","v":"-"},{"$f":"IF(Setup!$B$23=\"#\",0,IF(NOT(F27=\"-\"),VLOOKUP(F27,'AL QD'!$A$3:$E$34,3,FALSE),0))","v":0},{"$f":"IF(G27>0,VLOOKUP(G27,'AL QD'!$C$3:$E$34,2,FALSE),\"bye\")","v":"bye"},"",{"$f":"IF($G27>0,VLOOKUP($G27,'AL QD'!$C$3:$E$34,3,FALSE),\"\")","v":""},null,{"$f":"UPPER(IF($A$2=\"R\",IF(OR(K27=1,K27=\"a\"),G27,IF(OR(K27=2,K27=\"b\"),G28,\"\")),IF(OR(K27=1,K27=\"a\"),I27,IF(OR(K27=2,K27=\"b\"),I28,\"\"))))","v":""}]
[24,null,22,18,{"$f":"IF($B$2>=C28,1,0)","v":1},{"$f":"Setup!G9","v":0},{"$f":"IF(Setup!$B$23=\"#\",0,IF(F28>0,VLOOKUP(F28,'AL QD'!$A$3:$E$34,3,FALSE),0))","v":0},{"$f":"IF(G28>0,VLOOKUP(G28,'AL QD'!$C$3:$E$34,2,FALSE),\"bye\")","v":"bye"},"",{"$f":"IF($G28>0,VLOOKUP($G28,'AL QD'!$C$3:$E$34,3,FALSE),\"\")","v":""}]
[25,null,null,18,0,7,{"$f":"IF(Setup!$B$23=\"#\",0,IF(F29>0,VLOOKUP(F29,'AL QD'!$A$3:$H$34,3,FALSE),0))","v":0},{"$f":"IF($G29>0,VLOOKUP(G29,'AL QD'!$C$3:$H$34,2,FALSE),0)","v":0},"",{"$f":"IF($G29>0,VLOOKUP($G29,'AL QD'!$C$3:$E$34,3,FALSE),\"\")","v":""},null,{"$f":"UPPER(IF($A$2=\"R\",IF(OR(K29=1,K29=\"a\"),G29,IF(OR(K29=2,K29=\"b\"),G30,\"\")),IF(OR(K29=1,K29=\"a\"),I29,IF(OR(K29=2,K29=\"b\"),I30,\"\"))))","v":""}]
[26,{"$f":"IF(E30=0,29-D30,0)","v":0},7,19,{"$f":"IF($B$2>=C30,1,0)","v":1},{"$f":"IF($B$2>=C30,\"-\",VLOOKUP($B30,Setup!$H$15:$I$30,2,FALSE))","v":"-"},{"$f":"IF(Setup!$B$23=\"#\",0,IF(NOT(F30=\"-\"),VLOOKUP(F30,'AL QD'!$A$3:$E$34,3,FALSE),0))","v":0},{"$f":"IF($G30>0,VLOOKUP($G30,'AL QD'!$C$3:$E$34,2,FALSE),\"bye\")","v":"bye"},"",{"$f":"IF($G30>0,VLOOKUP($G30,'AL QD'!$C$3:$E$34,3,FALSE),\"\")","v":""},null,null,null,{"$f":"UPPER(IF($A$2=\"R\",IF(OR(M30=1,M30=\"a\"),L29,IF(OR(M30=2,M30=\"b\"),L31,\"\")),IF(OR(M30=1,M30=\"a\"),L29,IF(OR(M30=2,M30=\"b\"),L31,\"\"))))","v":""}]
[27,{"$f":"IF(E31=0,30-D31,0)","v":0},{"$f":"Setup!G10","v":10},20,{"$f":"IF($B$2>=C31,1,0)","v":1},{"$f":"IF($B$2>=C31,\"-\",VLOOKUP($B31,Setup!$H$15:$I$30,2,FALSE))","v":"-"},{"$f":"IF(Setup!$B$23=\"#\",0,IF(NOT(F31=\"-\"),VLOOKUP(F31,'AL QD'!$A$3:$E$34,3,FALSE),0))","v":0},{"$f":"IF(G31>0,VLOOKUP(G31,'AL QD'!$C$3:$E$34,2,FALSE),\"bye\")","v":"bye"},"",{"$f":"IF($G31>0,VLOOKUP($G31,'AL QD'!$C$3:$E$34,3,FALSE),\"\")","v":""},null,{"$f":"UPPER(IF($A$2=\"R\",IF(OR(K31=1,K31=\"a\"),G31,IF(OR(K31=2,K31=\"b\"),G32,\"\")),IF(OR(K31=1,K31=\"a\"),I31,IF(OR(K31=2,K31=\"b\"),I32,\"\"))))","v":""}]
[28,null,23,21,{"$f":"IF($B$2>=C32,1,0)","v":1},{"$f":"Setup!G10","v":10},{"$f":"IF(Setup!$B$23=\"#\",0,IF(F32>0,VLOOKUP(F32,'AL QD'!$A$3:$E$34,3,FALSE),0))","v":0},{"$f":"IF(G32>0,VLOOKUP(G32,'AL QD'!$C$3:$E$34,2,FALSE),\"bye\")","v":"bye"},"",{"$f":"IF($G32>0,VLOOKUP($G32,'AL QD'!$C$3:$E$34,3,FALSE),\"\")","v":""}]
[29,null,null,21,0,8,{"$f":"IF(Setup!$B$23=\"#\",0,IF(F33>0,VLOOKUP(F33,'AL QD'!$A$3:$H$34,3,FALSE),0))","v":0},{"$f":"IF($G33>0,VLOOKUP(G33,'AL QD'!$C$3:$H$34,2,FALSE),0)","v":0},"",{"$f":"IF($G33>0,VLOOKUP($G33,'AL QD'!$C$3:$E$34,3,FALSE),\"\")","v":""},null,{"$f":"UPPER(IF($A$2=\"R\",IF(OR(K33=1,K33=\"a\"),G33,IF(OR(K33=2,K33=\"b\"),G34,\"\")),IF(OR(K33=1,K33=\"a\"),I33,IF(OR(K33=2,K33=\"b\"),I34,\"\"))))","v":""}]
[30,{"$f":"IF(E34=0,31-D34,0)","v":0},8,22,{"$f":"IF($B$2>=C34,1,0)","v":1},{"$f":"IF($B$2>=C34,\"-\",VLOOKUP($B34,Setup!$H$15:$I$30,2,FALSE))","v":"-"},{"$f":"IF(Setup!$B$23=\"#\",0,IF(NOT(F34=\"-\"),VLOOKUP(F34,'AL QD'!$A$3:$E$34,3,FALSE),0))","v":0},{"$f":"IF($G34>0,VLOOKUP($G34,'AL QD'!$C$3:$E$34,2,FALSE),\"bye\")","v":"bye"},"",{"$f":"IF($G34>0,VLOOKUP($G34,'AL QD'!$C$3:$E$34,3,FALSE),\"\")","v":""},null,null,null,{"$f":"UPPER(IF($A$2=\"R\",IF(OR(M34=1,M34=\"a\"),L33,IF(OR(M34=2,M34=\"b\"),L35,\"\")),IF(OR(M34=1,M34=\"a\"),L33,IF(OR(M34=2,M34=\"b\"),L35,\"\"))))","v":""}]
[31,{"$f":"IF(E35=0,32-D35,0)","v":0},{"$f":"Setup!G11","v":9},23,{"$f":"IF($B$2>=C35,1,0)","v":1},{"$f":"IF($B$2>=C35,\"-\",VLOOKUP($B35,Setup!$H$15:$I$30,2,FALSE))","v":"-"},{"$f":"IF(Setup!$B$23=\"#\",0,IF(NOT(F35=\"-\"),VLOOKUP(F35,'AL QD'!$A$3:$E$34,3,FALSE),0))","v":0},{"$f":"IF(G35>0,VLOOKUP(G35,'AL QD'!$C$3:$E$34,2,FALSE),\"bye\")","v":"bye"},"",{"$f":"IF($G35>0,VLOOKUP($G35,'AL QD'!$C$3:$E$34,3,FALSE),\"\")","v":""},null,{"$f":"UPPER(IF($A$2=\"R\",IF(OR(K35=1,K35=\"a\"),G35,IF(OR(K35=2,K35=\"b\"),G36,\"\")),IF(OR(K35=1,K35=\"a\"),I35,IF(OR(K35=2,K35=\"b\"),I36,\"\"))))","v":""}]
[32,null,24,24,{"$f":"IF($B$2>=C36,1,0)","v":1},{"$f":"Setup!G11","v":9},{"$f":"IF(Setup!$B$23=\"#\",0,IF(F36>0,VLOOKUP(F36,'AL QD'!$A$3:$E$34,3,FALSE),0))","v":0},{"$f":"IF(G36>0,VLOOKUP(G36,'AL QD'!$C$3:$E$34,2,FALSE),\"bye\")","v":"bye"},"",{"$f":"IF($G36>0,VLOOKUP($G36,'AL QD'!$C$3:$E$34,3,FALSE),\"\")","v":""}]
[]
[]
[null,null,null,null,null,null,null,"seeded players",null,null,null,null,null,"επιδιαιτητής"]
[null,null,null,null,null,null,null,{"$f":"\"1. \" & H5","v":"1. 0"},null,{"$f":"\"5. \" & H21","v":"5. 0"},null,null,null,{"$f":"Setup!B10","v":"Νικηφοράκης Σταύρος"}]
[null,null,null,null,null,null,null,{"$f":"\"2. \" & H9","v":"2. 0"},null,{"$f":"\"6. \" & H25","v":"6. 0"}]
[null,null,null,null,null,null,null,{"$f":"\"3. \" & H13","v":"3. 0"},null,{"$f":"\"7. \" & H29","v":"7. 0"}]
[null,null,null,null,null,null,null,{"$f":"\"4. \" & H17","v":"4. 0"},null,{"$f":"\"8. \" & H33","v":"8. 0"}]
[]
[]
[]
[]
[]
[]
[]
[]
[]
[]
[]
[]
[]
[]
[]
[null,null,null,null,null,null,null,"BoldPlayers"]
[null,null,null,null,null,null,null,{"$f":"IF(Setup!$B$16>0,I5,\"\")","v":""}]
[null,null,null,null,null,null,null,{"$f":"IF(Setup!$B$16>1,I9,\"\")","v":""}]
[null,null,null,null,null,null,null,{"$f":"IF(Setup!$B$16>2,I13,\"\")","v":""}]
[null,null,null,null,null,null,null,{"$f":"IF(Setup!$B$16>3,I17,\"\")","v":""}]
[null,null,null,null,null,null,null,{"$f":"IF(Setup!$B$16>4,I21,\"\")","v":""}]
[null,null,null,null,null,null,null,{"$f":"IF(Setup!$B$16>5,I25,\"\")","v":""}]
[null,null,null,null,null,null,null,{"$f":"IF(Setup!$B$16>6,I29,\"\")","v":""}]
[null,null,null,null,null,null,null,{"$f":"IF(Setup!$B$16>7,I33,\"\")","v":""}]

{"sheet":"MD","index":4,"n_rows":67,"n_cols":30,"rows_kept":67,"cut":false,"hidden":false,"merged":[[41,17,41,19],[0,0,0,17],[2,9,2,11],[38,9,38,11]]}
[{"$f":"Setup!B3 & \", \" & Setup!B4 & \", \" & Setup!B6 & \", \" & Setup!B8 & \"-\" & Setup!B9","v":"ΕΦΟΑ, 1ο Ε2 2014, ΗΡΑΚΛΕΙΟ Ο.Α. & Α, 28 Φεβρουαρίου-4 Μαρτίου"},null,null,null,null,null,null,null,null,null,null,null,null,null,null,null,null,null,null,{"$f":"Setup!$B$7","v":"Α16"}]
[null,{"$f":"Setup!B18","v":6},null,null,null,null,null,null,{"$f":"\"p\"&VLOOKUP(Setup!$B$5,tmp!$J$14:$P$23,2,FALSE)","v":"p4"},null,null,null,null,{"$f":"\"p\"&VLOOKUP(Setup!$B$5,tmp!$J$14:$P$23,3,FALSE)","v":"p5"},null,{"$f":"\"p\"&VLOOKUP(Setup!$B$5,tmp!$J$14:$P$23,4,FALSE)","v":"p7"},null,{"$f":"\"p\"&VLOOKUP(Setup!$B$5,tmp!$J$14:$P$23,5,FALSE)","v":"p10"},null,{"$f":"\"p\"&VLOOKUP(Setup!$B$5,tmp!$J$14:$P$23,6,FALSE)&\"-\"&VLOOKUP(Setup!$B$5,tmp!$J$14:$P$23,7,FALSE)","v":"p15-18"}]
[null,null,null,null,null,null,null,null,null,32,null,null,null,16,null,8,null,4,null,"2 & w"]
["α/α",null,"ByeOrder","ByeSum","ByeCnt","από","seed","Pts","  Α.Μ.  ","Ονοματεπώνυμο","επώνυμο","Σύλλογος"]
[1,1,null,null,0,{"$f":"IF(NOT($G5=\"-\"),VLOOKUP($G5,'AL MD'!$A$3:$E$34,2,FALSE),\"\")","v":0},{"$f":"VLOOKUP($B5,Setup!$Q$4:$R$35,2,FALSE)","v":1},{"$f":"IF($G5>0,VLOOKUP($G5,'AL MD'!$A$3:$F$34,6,FALSE),0)","v":646},{"$f":"IF(Setup!$B$24=\"#\",0,IF($G5>0,VLOOKUP($G5,'AL MD'!$A$3:$E$34,3,FALSE),0))","v":26317},{"$f":"IF($I5>0,VLOOKUP($I5,'AL MD'!$C$3:$E$34,2,FALSE),\"bye\")","v":"ΚΩΣΤΑΡΑΣ ΠΑΝΑΓΙΩΤΗΣ"},{"$f":"IF(NOT(I5>0),\"\", IF(ISERROR(FIND(\"-\",J5)), LEFT(J5,FIND(\" \",J5)-1),  IF(FIND(\"-\",J5)>FIND(\" \",J5),LEFT(J5,FIND(\" \",J5)-1),   LEFT(J5,FIND(\"-\",J5)-1)    )))","v":"ΚΩΣΤΑΡΑΣ"},{"$f":"IF($I5>0,VLOOKUP($I5,'AL MD'!$C$3:$E$34,3,FALSE),\"\")","v":"Ο.Α.ΠΕΤΡΟΥΠΟΛΗΣ"},1,{"$f":"UPPER(IF($A$2=\"R\",IF(OR(M5=1,M5=\"a\"),I5,IF(OR(M5=2,M5=\"b\"),I6,\"\")),IF(OR(M5=1,M5=\"1\"),K5,IF(OR(M5=2,M5=\"b\"),K6,\"\"))))","v":"ΚΩΣΤΑΡΑΣ"},null,null,null,null,null,null,null,null,null,{"$f":"I5","v":26317},{"$f":"J5","v":"ΚΩΣΤΑΡΑΣ ΠΑΝΑΓΙΩΤΗΣ"}," ",{"$f":"N5","v":"ΚΩΣΤΑΡΑΣ"}]
[2,{"$f":"1-D6+8","v":8},{"$f":"B5","v":1},{"$f":"E6","v":1},{"$f":"IF($B$2>=C6,1,0)","v":1},{"$f":"IF(NOT($G6=\"-\"),VLOOKUP($G6,'AL MD'!$A$3:$E$34,2,FALSE),\"\")","v":""},{"$f":"IF($B$2>=C6,\"-\",VLOOKUP($B6,Setup!$Q$4:$R$35,2,FALSE))","v":"-"},{"$f":"IF(NOT($G6=\"-\"),VLOOKUP($G6,'AL MD'!$A$3:$F$34,6,FALSE),0)","v":0},{"$f":"IF(Setup!$B$24=\"#\",0,IF(NOT($G6=\"-\"),VLOOKUP($G6,'AL MD'!$A$3:$E$34,3,FALSE),0))","v":0},{"$f":"IF($I6>0,VLOOKUP($I6,'AL MD'!$C$3:$E$34,2,FALSE),\"bye\")","v":"bye"},{"$f":"IF(NOT(I6>0),\"\", IF(ISERROR(FIND(\"-\",J6)), LEFT(J6,FIND(\" \",J6)-1),  IF(FIND(\"-\",J6)>FIND(\" \",J6),LEFT(J6,FIND(\" \",J6)-1),   LEFT(J6,FIND(\"-\",J6)-1)    )))","v":""},{"$f":"IF($I6>0,VLOOKUP($I6,'AL MD'!$C$3:$E$34,3,FALSE),\"\")","v":""},null,null,1,{"$f":"UPPER(IF($A$2=\"R\",IF(OR(O6=1,O6=\"a\"),N5,IF(OR(O6=2,O6=\"b\"),N7,\"\")),IF(OR(O6=1,O6=\"a\"),N5,IF(OR(O6=2,O6=\"b\"),N7,\"\"))))","v":"ΚΩΣΤΑΡΑΣ"},null,null,null,null,null,null,null,{"$f":"I6","v":0},"bye",null,{"$f":"N6","v":0},{"$f":"P6","v":"ΚΩΣΤΑΡΑΣ"}]
[3,{"$f":"2-D7+8","v":9},null,{"$f":"D6+E7","v":1},0,{"$f":"IF(NOT($G7=\"-\"),VLOOKUP($G7,'AL MD'!$A$3:$E$34,2,FALSE),\"\")","v":0},{"$f":"VLOOKUP($B7,Setup!$Q$4:$R$35,2,FALSE)","v":19},{"$f":"IF($G7>0,VLOOKUP($G7,'AL MD'!$A$3:$F$34,6,FALSE),0)","v":36.5},{"$f":"IF(Setup!$B$24=\"#\",0,IF($G7>0,VLOOKUP($G7,'AL MD'!$A$3:$E$34,3,FALSE),0))","v":28243},{"$f":"IF($I7>0,VLOOKUP($I7,'AL MD'!$C$3:$E$34,2,FALSE),\"bye\")","v":"ΚΡΑΣΟΥΔΑΚΗΣ ΙΩΑΝΝΗΣ-ΓΕΩΡΓΙΟΣ"},"ΚΡΑΣΟΥΔΑΚΗΣ",{"$f":"IF($I7>0,VLOOKUP($I7,'AL MD'!$C$3:$E$34,3,FALSE),\"\")","v":"Ο.Α.ΧΑΝΙΩΝ"},2,{"$f":"UPPER(IF($A$2=\"R\",IF(OR(M7=1,M7=\"a\"),I7,IF(OR(M7=2,M7=\"b\"),I8,\"\")),IF(OR(M7=1,M7=\"a\"),K7,IF(OR(M7=2,M7=\"b\"),K8,\"\"))))","v":"ΚΥΡΙΑΚΑΚΗΣ"},null,"60, 60",null,null,null,null,null,null,null,28243,"ΚΡΑΣΟΥΔΑΚΗΣ ΙΩΑΝΝΗΣ-ΓΕΩΡΓΙΟΣ",null,"ΚΥΡΙΑΚΑΚΗΣ","60, 60"]
[4,{"$f":"3-D8+8","v":10},15,{"$f":"D7+E8","v":1},{"$f":"IF($B$2>=C8,1,0)","v":0},{"$f":"IF(NOT($G8=\"-\"),VLOOKUP($G8,'AL MD'!$A$3:$E$34,2,FALSE),\"\")","v":0},{"$f":"IF($B$2>=C8,\"-\",VLOOKUP($B8,Setup!$Q$4:$R$35,2,FALSE))","v":10},{"$f":"IF(NOT($G8=\"-\"),VLOOKUP($G8,'AL MD'!$A$3:$F$34,6,FALSE),0)","v":119},{"$f":"IF(Setup!$B$24=\"#\",0,IF(NOT($G8=\"-\"),VLOOKUP($G8,'AL MD'!$A$3:$E$34,3,FALSE),0))","v":26338},{"$f":"IF($I8>0,VLOOKUP($I8,'AL MD'!$C$3:$E$34,2,FALSE),\"bye\")","v":"ΚΥΡΙΑΚΑΚΗΣ-ΜΕΣΣΑΡΙΤΑΚΗΣ ΓΕΩΡΓΙΟΣ"},"ΚΥΡΙΑΚΑΚΗΣ",{"$f":"IF($I8>0,VLOOKUP($I8,'AL MD'!$C$3:$E$34,3,FALSE),\"\")","v":"ΗΡΑΚΛΕΙΟ Ο.Α.& Α."},null,"60, 62",null,null,1,{"$f":"UPPER(IF($A$2=\"R\",IF(OR(Q8=1,Q8=\"a\"),P6,IF(OR(Q8=2,Q8=\"b\"),P10,\"\")),IF(OR(Q8=1,Q8=\"a\"),P6,IF(OR(Q8=2,Q8=\"b\"),P10,\"\"))))","v":"ΚΩΣΤΑΡΑΣ"},null,null,null,null,null,26338,"ΚΥΡΙΑΚΑΚΗΣ-ΜΕΣΣΑΡΙΤΑΚΗΣ ΓΕΩΡΓΙΟΣ",null,"60, 62",null,{"$f":"R8","v":"ΚΩΣΤΑΡΑΣ"}]
[5,{"$f":"4-D9+8","v":11},null,1,0,{"$f":"IF(NOT($G9=\"-\"),VLOOKUP($G9,'AL MD'!$A$3:$E$34,2,FALSE),\"\")","v":0},{"$f":"VLOOKUP($B9,Setup!$Q$4:$R$35,2,FALSE)","v":9},{"$f":"IF($G9>0,VLOOKUP($G9,'AL MD'!$A$3:$F$34,6,FALSE),0)","v":136},{"$f":"IF(Setup!$B$24=\"#\",0,IF($G9>0,VLOOKUP($G9,'AL MD'!$A$3:$E$34,3,FALSE),0))","v":28337},{"$f":"IF($I9>0,VLOOKUP($I9,'AL MD'!$C$3:$E$34,2,FALSE),\"bye\")","v":"ΚΑΪΜΑΡΑΣ ΧΡΗΣΤΟΣ"},"ΚΑΪΜΑΡΑΣ",{"$f":"IF($I9>0,VLOOKUP($I9,'AL MD'!$C$3:$E$34,3,FALSE),\"\")","v":"Α.Κ.Α.ΜΑΡΑΘΩΝΑ"},1,{"$f":"UPPER(IF($A$2=\"R\",IF(OR(M9=1,M9=\"a\"),I9,IF(OR(M9=2,M9=\"b\"),I10,\"\")),IF(OR(M9=1,M9=\"a\"),K9,IF(OR(M9=2,M9=\"b\"),K10,\"\"))))","v":"ΚΑΪΜΑΡΑΣ"},null,null,null,"60, 76(5)",null,null,null,null,null,28337,"ΚΑΪΜΑΡΑΣ ΧΡΗΣΤΟΣ",null,"ΚΑΪΜΑΡΑΣ",null,{"$f":"R9","v":"60, 76(5)"}]
[6,{"$f":"5-D10+8","v":12},9,1,{"$f":"IF($B$2>=C10,1,0)","v":0},{"$f":"IF(NOT($G10=\"-\"),VLOOKUP($G10,'AL MD'!$A$3:$E$34,2,FALSE),\"\")","v":0},{"$f":"IF($B$2>=C10,\"-\",VLOOKUP($B10,Setup!$Q$4:$R$35,2,FALSE))","v":17},{"$f":"IF(NOT($G10=\"-\"),VLOOKUP($G10,'AL MD'!$A$3:$F$34,6,FALSE),0)","v":46},{"$f":"IF(Setup!$B$24=\"#\",0,IF(NOT($G10=\"-\"),VLOOKUP($G10,'AL MD'!$A$3:$E$34,3,FALSE),0))","v":29502},{"$f":"IF($I10>0,VLOOKUP($I10,'AL MD'!$C$3:$E$34,2,FALSE),\"bye\")","v":"ΠΑΤΕΡΑΣ ΔΙΑΜΑΝΤΗΣ"},"ΠΑΤΕΡΑΣ",{"$f":"IF($I10>0,VLOOKUP($I10,'AL MD'!$C$3:$E$34,3,FALSE),\"\")","v":"Α.Ο.ΤΑΤΟΪΟΥ"},null,"61, 75",1,{"$f":"UPPER(IF($A$2=\"R\",IF(OR(O10=1,O10=\"a\"),N9,IF(OR(O10=2,O10=\"b\"),N11,\"\")),IF(OR(O10=1,O10=\"a\"),N9,IF(OR(O10=2,O10=\"b\"),N11,\"\"))))","v":"ΚΑΪΜΑΡΑΣ"},null,null,null,null,null,null,null,29502,"ΠΑΤΕΡΑΣ ΔΙΑΜΑΝΤΗΣ",null,"61, 75","ΚΑΪΜΑΡΑΣ"]
[7,{"$f":"6-D11+8","v":12},{"$f":"B12","v":5},2,{"$f":"IF($B$2>=C11,1,0)","v":1},{"$f":"IF(NOT($G11=\"-\"),VLOOKUP($G11,'AL MD'!$A$3:$E$34,2,FALSE),\"\")","v":""},{"$f":"IF($B$2>=C11,\"-\",VLOOKUP($B11,Setup!$Q$4:$R$35,2,FALSE))","v":"-"},{"$f":"IF(NOT($G11=\"-\"),VLOOKUP($G11,'AL MD'!$A$3:$F$34,6,FALSE),0)","v":0},{"$f":"IF(Setup!$B$24=\"#\",0,IF(NOT($G11=\"-\"),VLOOKUP($G11,'AL MD'!$A$3:$E$34,3,FALSE),0))","v":0},{"$f":"IF($I11>0,VLOOKUP($I11,'AL MD'!$C$3:$E$34,2,FALSE),\"bye\")","v":"bye"},"",{"$f":"IF($I11>0,VLOOKUP($I11,'AL MD'!$C$3:$E$34,3,FALSE),\"\")","v":""},2,{"$f":"UPPER(IF($A$2=\"R\",IF(OR(M11=1,M11=\"a\"),I11,IF(OR(M11=2,M11=\"b\"),I12,\"\")),IF(OR(M11=1,M11=\"a\"),K11,IF(OR(M11=2,M11=\"b\"),K12,\"\"))))","v":"ΑΡΕΤΑΚΗΣ"},null,"63, 75",null,null,null,null,null,null,null,0,"bye",null,"ΑΡΕΤΑΚΗΣ","63, 75"]
[8,{"$f":"VALUE(Setup!L7)","v":5},null,2,0,{"$f":"IF(NOT($G12=\"-\"),VLOOKUP($G12,'AL MD'!$A$3:$E$34,2,FALSE),\"\")","v":0},{"$f":"VLOOKUP($B12,Setup!$Q$4:$R$35,2,FALSE)","v":5},{"$f":"IF($G12>0,VLOOKUP($G12,'AL MD'!$A$3:$F$34,6,FALSE),0)","v":247},{"$f":"IF(Setup!$B$24=\"#\",0,IF($G12>0,VLOOKUP($G12,'AL MD'!$A$3:$E$34,3,FALSE),0))","v":26457},{"$f":"IF($I12>0,VLOOKUP($I12,'AL MD'!$C$3:$E$34,2,FALSE),\"bye\")","v":"ΑΡΕΤΑΚΗΣ ΙΩΑΝΝΗΣ"},"ΑΡΕΤΑΚΗΣ",{"$f":"IF($I12>0,VLOOKUP($I12,'AL MD'!$C$3:$E$34,3,FALSE),\"\")","v":"Ο.Α.ΧΑΝΙΩΝ"},null,null,null,null,null,null,1,{"$f":"UPPER(IF($A$2=\"R\",IF(OR(S12=1,S12=\"a\"),R8,IF(OR(S12=2,S12=\"b\"),R16,\"\")),IF(OR(S12=1,S12=\"a\"),R8,IF(OR(S12=2,S12=\"b\"),R16,\"\"))))","v":"ΚΩΣΤΑΡΑΣ"},null,null,null,26457,"ΑΡΕΤΑΚΗΣ ΙΩΑΝΝΗΣ",null,0,null,null,{"$f":"T12","v":"ΚΩΣΤΑΡΑΣ"}]
[9,{"$f":"VALUE(Setup!L4)","v":4},null,2,0,{"$f":"IF(NOT($G13=\"-\"),VLOOKUP($G13,'AL MD'!$A$3:$E$34,2,FALSE),\"\")","v":0},{"$f":"VLOOKUP($B13,Setup!$Q$4:$R$35,2,FALSE)","v":4},{"$f":"IF($G13>0,VLOOKUP($G13,'AL MD'!$A$3:$F$34,6,FALSE),0)","v":333},{"$f":"IF(Setup!$B$24=\"#\",0,IF($G13>0,VLOOKUP($G13,'AL MD'!$A$3:$E$34,3,FALSE),0))","v":26459},{"$f":"IF($I13>0,VLOOKUP($I13,'AL MD'!$C$3:$E$34,2,FALSE),\"bye\")","v":"ΝΑΟΥΜ ΣΠΥΡΙΔΩΝ"},"ΝΑΟΥΜ",{"$f":"IF($I13>0,VLOOKUP($I13,'AL MD'!$C$3:$E$34,3,FALSE),\"\")","v":"Ο.Α.ΧΑΝΙΩΝ"},1,{"$f":"UPPER(IF($A$2=\"R\",IF(OR(M13=1,M13=\"a\"),I13,IF(OR(M13=2,M13=\"b\"),I14,\"\")),IF(OR(M13=1,M13=\"a\"),K13,IF(OR(M13=2,M13=\"b\"),K14,\"\"))))","v":"ΝΑΟΥΜ"},null,null,null,null,null,"62, 61",null,null,null,26459,"ΝΑΟΥΜ ΣΠΥΡΙΔΩΝ",null,"ΝΑΟΥΜ"]
[10,{"$f":"7-D14+8","v":12},{"$f":"B13","v":4},3,{"$f":"IF($B$2>=C14,1,0)","v":1},{"$f":"IF(NOT($G14=\"-\"),VLOOKUP($G14,'AL MD'!$A$3:$E$34,2,FALSE),\"\")","v":""},{"$f":"IF($B$2>=C14,\"-\",VLOOKUP($B14,Setup!$Q$4:$R$35,2,FALSE))","v":"-"},{"$f":"IF(NOT($G14=\"-\"),VLOOKUP($G14,'AL MD'!$A$3:$F$34,6,FALSE),0)","v":0},{"$f":"IF(Setup!$B$24=\"#\",0,IF(NOT($G14=\"-\"),VLOOKUP($G14,'AL MD'!$A$3:$E$34,3,FALSE),0))","v":0},{"$f":"IF($I14>0,VLOOKUP($I14,'AL MD'!$C$3:$E$34,2,FALSE),\"bye\")","v":"bye"},"",{"$f":"IF($I14>0,VLOOKUP($I14,'AL MD'!$C$3:$E$34,3,FALSE),\"\")","v":""},null,null,1,{"$f":"UPPER(IF($A$2=\"R\",IF(OR(O14=1,O14=\"a\"),N13,IF(OR(O14=2,O14=\"b\"),N15,\"\")),IF(OR(O14=1,O14=\"a\"),N13,IF(OR(O14=2,O14=\"b\"),N15,\"\"))))","v":"ΝΑΟΥΜ"},null,null,null,null,null,null,null,0,"bye",null,0,"ΝΑΟΥΜ"]
[11,{"$f":"8-D15+8","v":13},null,3,0,{"$f":"IF(NOT($G15=\"-\"),VLOOKUP($G15,'AL MD'!$A$3:$E$34,2,FALSE),\"\")","v":0},{"$f":"VLOOKUP($B15,Setup!$Q$4:$R$35,2,FALSE)","v":16},{"$f":"IF($G15>0,VLOOKUP($G15,'AL MD'!$A$3:$F$34,6,FALSE),0)","v":49},{"$f":"IF(Setup!$B$24=\"#\",0,IF($G15>0,VLOOKUP($G15,'AL MD'!$A$3:$E$34,3,FALSE),0))","v":26230},{"$f":"IF($I15>0,VLOOKUP($I15,'AL MD'!$C$3:$E$34,2,FALSE),\"bye\")","v":"ΜΑΝΟΥΣΑΚΗΣ ΚΥΡΙΑΚΟΣ"},"ΜΑΝΟΥΣΑΚΗΣ",{"$f":"IF($I15>0,VLOOKUP($I15,'AL MD'!$C$3:$E$34,3,FALSE),\"\")","v":"ΗΡΑΚΛΕΙΟ Ο.Α.& Α."},1,{"$f":"UPPER(IF($A$2=\"R\",IF(OR(M15=1,M15=\"a\"),I15,IF(OR(M15=2,M15=\"b\"),I16,\"\")),IF(OR(M15=1,M15=\"a\"),K15,IF(OR(M15=2,M15=\"b\"),K16,\"\"))))","v":"ΜΑΝΟΥΣΑΚΗΣ"},null,"61, 61",null,null,null,null,null,null,null,26230,"ΜΑΝΟΥΣΑΚΗΣ ΚΥΡΙΑΚΟΣ",null,"ΜΑΝΟΥΣΑΚΗΣ","61, 61"]
[12,{"$f":"9-D16+8","v":14},13,3,{"$f":"IF($B$2>=C16,1,0)","v":0},{"$f":"IF(NOT($G16=\"-\"),VLOOKUP($G16,'AL MD'!$A$3:$E$34,2,FALSE),\"\")","v":0},{"$f":"IF($B$2>=C16,\"-\",VLOOKUP($B16,Setup!$Q$4:$R$35,2,FALSE))","v":20},{"$f":"IF(NOT($G16=\"-\"),VLOOKUP($G16,'AL MD'!$A$3:$F$34,6,FALSE),0)","v":34},{"$f":"IF(Setup!$B$24=\"#\",0,IF(NOT($G16=\"-\"),VLOOKUP($G16,'AL MD'!$A$3:$E$34,3,FALSE),0))","v":26172},{"$f":"IF($I16>0,VLOOKUP($I16,'AL MD'!$C$3:$E$34,2,FALSE),\"bye\")","v":"ΣΤΑΥΡΟΥΛΑΚΗΣ ΓΕΩΡΓΙΟΣ"},"ΣΤΑΥΡΟΥΛΑΚΗΣ",{"$f":"IF($I16>0,VLOOKUP($I16,'AL MD'!$C$3:$E$34,3,FALSE),\"\")","v":"ΗΡΑΚΛΕΙΟ Ο.Α.& Α."},null,"63, 61",null,null,1,{"$f":"UPPER(IF($A$2=\"R\",IF(OR(Q16=1,Q16=\"a\"),P14,IF(OR(Q16=2,Q16=\"b\"),P18,\"\")),IF(OR(Q16=1,Q16=\"a\"),P14,IF(OR(Q16=2,Q16=\"b\"),P18,\"\"))))","v":"ΝΑΟΥΜ"},null,null,null,null,null,26172,"ΣΤΑΥΡΟΥΛΑΚΗΣ ΓΕΩΡΓΙΟΣ",null,"63, 61",null,{"$f":"R16","v":"ΝΑΟΥΜ"}]
[13,{"$f":"10-D17+8","v":15},null,3,0,{"$f":"IF(NOT($G17=\"-\"),VLOOKUP($G17,'AL MD'!$A$3:$E$34,2,FALSE),\"\")","v":0},{"$f":"VLOOKUP($B17,Setup!$Q$4:$R$35,2,FALSE)","v":21},{"$f":"IF($G17>0,VLOOKUP($G17,'AL MD'!$A$3:$F$34,6,FALSE),0)","v":26},{"$f":"IF(Setup!$B$24=\"#\",0,IF($G17>0,VLOOKUP($G17,'AL MD'!$A$3:$E$34,3,FALSE),0))","v":33530},{"$f":"IF($I17>0,VLOOKUP($I17,'AL MD'!$C$3:$E$34,2,FALSE),\"bye\")","v":"ΓΙΑΚΟΥΜΑΚΗΣ ΙΩΑΝΝΗΣ"},"ΓΙΑΚΟΥΜΑΚΗΣ",{"$f":"IF($I17>0,VLOOKUP($I17,'AL MD'!$C$3:$E$34,3,FALSE),\"\")","v":"Ο.Α.ΧΑΝΙΩΝ"},1,{"$f":"UPPER(IF($A$2=\"R\",IF(OR(M17=1,M17=\"a\"),I17,IF(OR(M17=2,M17=\"b\"),I18,\"\")),IF(OR(M17=1,M17=\"a\"),K17,IF(OR(M17=2,M17=\"b\"),K18,\"\"))))","v":"ΓΙΑΚΟΥΜΑΚΗΣ"},null,null,null,"46, 64, 62",null,null,null,null,null,33530,"ΓΙΑΚΟΥΜΑΚΗΣ ΙΩΑΝΝΗΣ",null,"ΓΙΑΚΟΥΜΑΚΗΣ",null,{"$f":"R17","v":"46, 64, 62"}]
[14,{"$f":"11-D18+8","v":16},11,3,{"$f":"IF($B$2>=C18,1,0)","v":0},{"$f":"IF(NOT($G18=\"-\"),VLOOKUP($G18,'AL MD'!$A$3:$E$34,2,FALSE),\"\")","v":0},{"$f":"IF($B$2>=C18,\"-\",VLOOKUP($B18,Setup!$Q$4:$R$35,2,FALSE))","v":25},{"$f":"IF(NOT($G18=\"-\"),VLOOKUP($G18,'AL MD'!$A$3:$F$34,6,FALSE),0)","v":0},{"$f":"IF(Setup!$B$24=\"#\",0,IF(NOT($G18=\"-\"),VLOOKUP($G18,'AL MD'!$A$3:$E$34,3,FALSE),0))","v":35870},{"$f":"IF($I18>0,VLOOKUP($I18,'AL MD'!$C$3:$E$34,2,FALSE),\"bye\")","v":"ΠΑΡΑΣΚΕΥΑΣ ΜΑΡΙΝΟΣ"},"ΠΑΡΑΣΚΕΥΑΣ",{"$f":"IF($I18>0,VLOOKUP($I18,'AL MD'!$C$3:$E$34,3,FALSE),\"\")","v":"Α.Π.Μ.Σ.ΑΣΚΗΣΗ ΗΡΑΚΛΕΙΟΥ"},null,"61, 63",2,{"$f":"UPPER(IF($A$2=\"R\",IF(OR(O18=1,O18=\"a\"),N17,IF(OR(O18=2,O18=\"b\"),N19,\"\")),IF(OR(O18=1,O18=\"a\"),N17,IF(OR(O18=2,O18=\"b\"),N19,\"\"))))","v":"ΦΡΙΣΗΡΑΣ"},null,null,null,null,null,null,null,35870,"ΠΑΡΑΣΚΕΥΑΣ ΜΑΡΙΝΟΣ",null,"61, 63","ΦΡΙΣΗΡΑΣ"]
[15,{"$f":"12-D19+8","v":17},{"$f":"B20","v":8},3,{"$f":"IF($B$2>=C19,1,0)","v":0},{"$f":"IF(NOT($G19=\"-\"),VLOOKUP($G19,'AL MD'!$A$3:$E$34,2,FALSE),\"\")","v":0},{"$f":"IF($B$2>=C19,\"-\",VLOOKUP($B19,Setup!$Q$4:$R$35,2,FALSE))","v":13},{"$f":"IF(NOT($G19=\"-\"),VLOOKUP($G19,'AL MD'!$A$3:$F$34,6,FALSE),0)","v":103},{"$f":"IF(Setup!$B$24=\"#\",0,IF(NOT($G19=\"-\"),VLOOKUP($G19,'AL MD'!$A$3:$E$34,3,FALSE),0))","v":28588},{"$f":"IF($I19>0,VLOOKUP($I19,'AL MD'!$C$3:$E$34,2,FALSE),\"bye\")","v":"ΑΓΓΕΛΟΠΟΥΛΟΣ ΜΙΛΤΙΑΔΗΣ"},"ΑΓΓΕΛΟΠΟΥΛΟΣ",{"$f":"IF($I19>0,VLOOKUP($I19,'AL MD'!$C$3:$E$34,3,FALSE),\"\")","v":"ΠΕΥΚΗ Γ.ΚΑΛΟΒΕΛΩΝΗΣ"},2,{"$f":"UPPER(IF($A$2=\"R\",IF(OR(M19=1,M19=\"a\"),I19,IF(OR(M19=2,M19=\"b\"),I20,\"\")),IF(OR(M19=1,M19=\"a\"),K19,IF(OR(M19=2,M19=\"b\"),K20,\"\"))))","v":"ΦΡΙΣΗΡΑΣ"},null,"60 ret",null,null,null,null,null,null,null,28588,"ΑΓΓΕΛΟΠΟΥΛΟΣ ΜΙΛΤΙΑΔΗΣ",null,"ΦΡΙΣΗΡΑΣ","60 ret"]
[16,{"$f":"VALUE(Setup!L8)","v":8},null,3,0,{"$f":"IF(NOT($G20=\"-\"),VLOOKUP($G20,'AL MD'!$A$3:$E$34,2,FALSE),\"\")","v":0},{"$f":"VLOOKUP($B20,Setup!$Q$4:$R$35,2,FALSE)","v":8},{"$f":"IF($G20>0,VLOOKUP($G20,'AL MD'!$A$3:$F$34,6,FALSE),0)","v":139},{"$f":"IF(Setup!$B$24=\"#\",0,IF($G20>0,VLOOKUP($G20,'AL MD'!$A$3:$E$34,3,FALSE),0))","v":26427},{"$f":"IF($I20>0,VLOOKUP($I20,'AL MD'!$C$3:$E$34,2,FALSE),\"bye\")","v":"ΦΡΙΣΗΡΑΣ ΣΤΕΦΑΝΟΣ"},"ΦΡΙΣΗΡΑΣ",{"$f":"IF($I20>0,VLOOKUP($I20,'AL MD'!$C$3:$E$34,3,FALSE),\"\")","v":"Ο.Α.ΑΘΛΗΤ.ΠΑΙΔΕΙΑ"},null,"61, 61",null,null,null,null,2,{"$f":"UPPER(IF($A$2=\"R\",IF(OR(S20=1,S20=\"a\"),T12,IF(OR(S20=2,S20=\"b\"),T28,\"\")),IF(OR(S20=1,S20=\"a\"),T12,IF(OR(S20=2,S20=\"b\"),T28,\"\"))))","v":"ΚΑΠΙΡΗΣ"},null,null,null,26427,"ΦΡΙΣΗΡΑΣ ΣΤΕΦΑΝΟΣ",null,"61, 61",null,null,{"$f":"T20","v":"ΚΑΠΙΡΗΣ"}]
[17,{"$f":"VALUE(Setup!L9)","v":6},null,3,0,{"$f":"IF(NOT($G21=\"-\"),VLOOKUP($G21,'AL MD'!$A$3:$E$34,2,FALSE),\"\")","v":0},{"$f":"VLOOKUP($B21,Setup!$Q$4:$R$35,2,FALSE)","v":6},{"$f":"IF($G21>0,VLOOKUP($G21,'AL MD'!$A$3:$F$34,6,FALSE),0)","v":219},{"$f":"IF(Setup!$B$24=\"#\",0,IF($G21>0,VLOOKUP($G21,'AL MD'!$A$3:$E$34,3,FALSE),0))","v":27583},{"$f":"IF($I21>0,VLOOKUP($I21,'AL MD'!$C$3:$E$34,2,FALSE),\"bye\")","v":"ΠΑΧΑΚΗΣ ΝΙΚΟΛΑΟΣ-ΑΝΔΡΕΑΣ"},"ΠΑΧΑΚΗΣ",{"$f":"IF($I21>0,VLOOKUP($I21,'AL MD'!$C$3:$E$34,3,FALSE),\"\")","v":"Ο.Α.ΑΘΗΝΩΝ"},1,{"$f":"UPPER(IF($A$2=\"R\",IF(OR(M21=1,M21=\"a\"),I21,IF(OR(M21=2,M21=\"b\"),I22,\"\")),IF(OR(M21=1,M21=\"a\"),K21,IF(OR(M21=2,M21=\"b\"),K22,\"\"))))","v":"ΠΑΧΑΚΗΣ"},null,null,null,null,null,"75, 63",null,null,null,27583,"ΠΑΧΑΚΗΣ ΝΙΚΟΛΑΟΣ-ΑΝΔΡΕΑΣ",null,"ΠΑΧΑΚΗΣ",null,null,"75, 63"]
[18,{"$f":"13-D22+8","v":17},{"$f":"B21","v":6},4,{"$f":"IF($B$2>=C22,1,0)","v":1},{"$f":"IF(NOT($G22=\"-\"),VLOOKUP($G22,'AL MD'!$A$3:$E$34,2,FALSE),\"\")","v":""},{"$f":"IF($B$2>=C22,\"-\",VLOOKUP($B22,Setup!$Q$4:$R$35,2,FALSE))","v":"-"},{"$f":"IF(NOT($G22=\"-\"),VLOOKUP($G22,'AL MD'!$A$3:$F$34,6,FALSE),0)","v":0},{"$f":"IF(Setup!$B$24=\"#\",0,IF(NOT($G22=\"-\"),VLOOKUP($G22,'AL MD'!$A$3:$E$34,3,FALSE),0))","v":0},{"$f":"IF($I22>0,VLOOKUP($I22,'AL MD'!$C$3:$E$34,2,FALSE),\"bye\")","v":"bye"},"",{"$f":"IF($I22>0,VLOOKUP($I22,'AL MD'!$C$3:$E$34,3,FALSE),\"\")","v":""},null,null,1,{"$f":"UPPER(IF($A$2=\"R\",IF(OR(O22=1,O22=\"a\"),N21,IF(OR(O22=2,O22=\"b\"),N23,\"\")),IF(OR(O22=1,O22=\"a\"),N21,IF(OR(O22=2,O22=\"b\"),N23,\"\"))))","v":"ΠΑΧΑΚΗΣ"},null,null,null,null,null,null,null,0,"bye",null,0,"ΠΑΧΑΚΗΣ"]
[19,{"$f":"14-D23+8","v":18},null,4,0,{"$f":"IF(NOT($G23=\"-\"),VLOOKUP($G23,'AL MD'!$A$3:$E$34,2,FALSE),\"\")","v":0},{"$f":"VLOOKUP($B23,Setup!$Q$4:$R$35,2,FALSE)","v":23},{"$f":"IF($G23>0,VLOOKUP($G23,'AL MD'!$A$3:$F$34,6,FALSE),0)","v":13},{"$f":"IF(Setup!$B$24=\"#\",0,IF($G23>0,VLOOKUP($G23,'AL MD'!$A$3:$E$34,3,FALSE),0))","v":33872},{"$f":"IF($I23>0,VLOOKUP($I23,'AL MD'!$C$3:$E$34,2,FALSE),\"bye\")","v":"ΚΡΟΝΤΗΡΑΣ ΑΝΑΣΤΑΣΙΟΣ"},"ΚΡΟΝΤΗΡΑΣ",{"$f":"IF($I23>0,VLOOKUP($I23,'AL MD'!$C$3:$E$34,3,FALSE),\"\")","v":"ΗΡΑΚΛΕΙΟ Ο.Α.& Α."},2,{"$f":"UPPER(IF($A$2=\"R\",IF(OR(M23=1,M23=\"a\"),I23,IF(OR(M23=2,M23=\"b\"),I24,\"\")),IF(OR(M23=1,M23=\"a\"),K23,IF(OR(M23=2,M23=\"b\"),K24,\"\"))))","v":"ΚΟΥΚΟΥΛΙΘΡΑΣ"},null,"61, 62",null,null,null,null,null,null,null,33872,"ΚΡΟΝΤΗΡΑΣ ΑΝΑΣΤΑΣΙΟΣ",null,"ΚΟΥΚΟΥΛΙΘΡΑΣ","61, 62"]
[20,{"$f":"15-D24+8","v":19},12,4,{"$f":"IF($B$2>=C24,1,0)","v":0},{"$f":"IF(NOT($G24=\"-\"),VLOOKUP($G24,'AL MD'!$A$3:$E$34,2,FALSE),\"\")","v":0},{"$f":"IF($B$2>=C24,\"-\",VLOOKUP($B24,Setup!$Q$4:$R$35,2,FALSE))","v":22},{"$f":"IF(NOT($G24=\"-\"),VLOOKUP($G24,'AL MD'!$A$3:$F$34,6,FALSE),0)","v":25},{"$f":"IF(Setup!$B$24=\"#\",0,IF(NOT($G24=\"-\"),VLOOKUP($G24,'AL MD'!$A$3:$E$34,3,FALSE),0))","v":30064},{"$f":"IF($I24>0,VLOOKUP($I24,'AL MD'!$C$3:$E$34,2,FALSE),\"bye\")","v":"ΚΟΥΚΟΥΛΙΘΡΑΣ ΙΩΑΝΝΗΣ"},"ΚΟΥΚΟΥΛΙΘΡΑΣ",{"$f":"IF($I24>0,VLOOKUP($I24,'AL MD'!$C$3:$E$34,3,FALSE),\"\")","v":"Ο.Α.ΚΕΡΑΤΣΙΝΙΟΥ"},null,"60, 60",null,null,2,{"$f":"UPPER(IF($A$2=\"R\",IF(OR(Q24=1,Q24=\"a\"),P22,IF(OR(Q24=2,Q24=\"b\"),P26,\"\")),IF(OR(Q24=1,Q24=\"a\"),P22,IF(OR(Q24=2,Q24=\"b\"),P26,\"\"))))","v":"ΠΙΤΣΙΝΗΣ"},null,null,null,null,null,30064,"ΚΟΥΚΟΥΛΙΘΡΑΣ ΙΩΑΝΝΗΣ",null,"60, 60",null,{"$f":"R24","v":"ΠΙΤΣΙΝΗΣ"}]
[21,{"$f":"16-D25+8","v":20},null,4,0,{"$f":"IF(NOT($G25=\"-\"),VLOOKUP($G25,'AL MD'!$A$3:$E$34,2,FALSE),\"\")","v":0},{"$f":"VLOOKUP($B25,Setup!$Q$4:$R$35,2,FALSE)","v":12},{"$f":"IF($G25>0,VLOOKUP($G25,'AL MD'!$A$3:$F$34,6,FALSE),0)","v":109},{"$f":"IF(Setup!$B$24=\"#\",0,IF($G25>0,VLOOKUP($G25,'AL MD'!$A$3:$E$34,3,FALSE),0))","v":29789},{"$f":"IF($I25>0,VLOOKUP($I25,'AL MD'!$C$3:$E$34,2,FALSE),\"bye\")","v":"ΤΣΟΜΛΕΚΤΣΟΓΛΟΥ ΝΙΚΟΛΑΟΣ"},"ΤΣΟΜΛΕΚΤΣΟΓΛΟΥ",{"$f":"IF($I25>0,VLOOKUP($I25,'AL MD'!$C$3:$E$34,3,FALSE),\"\")","v":"Α.Ο.Α.ΦΙΛΟΘΕΗΣ"},2,{"$f":"UPPER(IF($A$2=\"R\",IF(OR(M25=1,M25=\"a\"),I25,IF(OR(M25=2,M25=\"b\"),I26,\"\")),IF(OR(M25=1,M25=\"a\"),K25,IF(OR(M25=2,M25=\"b\"),K26,\"\"))))","v":"ΣΑΚΕΛΛΑΡΙΔΗΣ"},null,null,null,"61, 63",null,null,null,null,null,29789,"ΤΣΟΜΛΕΚΤΣΟΓΛΟΥ ΝΙΚΟΛΑΟΣ",null,"ΣΑΚΕΛΛΑΡΙΔΗΣ",null,{"$f":"R25","v":"61, 63"}]
[22,{"$f":"17-D26+8","v":21},14,4,{"$f":"IF($B$2>=C26,1,0)","v":0},{"$f":"IF(NOT($G26=\"-\"),VLOOKUP($G26,'AL MD'!$A$3:$E$34,2,FALSE),\"\")","v":0},{"$f":"IF($B$2>=C26,\"-\",VLOOKUP($B26,Setup!$Q$4:$R$35,2,FALSE))","v":26},{"$f":"IF(NOT($G26=\"-\"),VLOOKUP($G26,'AL MD'!$A$3:$F$34,6,FALSE),0)","v":0},{"$f":"IF(Setup!$B$24=\"#\",0,IF(NOT($G26=\"-\"),VLOOKUP($G26,'AL MD'!$A$3:$E$34,3,FALSE),0))","v":30054},{"$f":"IF($I26>0,VLOOKUP($I26,'AL MD'!$C$3:$E$34,2,FALSE),\"bye\")","v":"ΣΑΚΕΛΛΑΡΙΔΗΣ ΜΙΧΑΛΗΣ"},"ΣΑΚΕΛΛΑΡΙΔΗΣ",{"$f":"IF($I26>0,VLOOKUP($I26,'AL MD'!$C$3:$E$34,3,FALSE),\"\")","v":"Ο.Α.ΑΓΙΑΣ ΠΑΡΑΣΚΕΥΗΣ"},null,"63, 67(3), 63",2,{"$f":"UPPER(IF($A$2=\"R\",IF(OR(O26=1,O26=\"a\"),N25,IF(OR(O26=2,O26=\"b\"),N27,\"\")),IF(OR(O26=1,O26=\"a\"),N25,IF(OR(O26=2,O26=\"b\"),N27,\"\"))))","v":"ΠΙΤΣΙΝΗΣ"},null,null,null,null,null,null,null,30054,"ΣΑΚΕΛΛΑΡΙΔΗΣ ΜΙΧΑΛΗΣ",null,"63, 67(3), 63","ΠΙΤΣΙΝΗΣ"]
[23,{"$f":"18-D27+8","v":21},{"$f":"B28","v":3},5,{"$f":"IF($B$2>=C27,1,0)","v":1},{"$f":"IF(NOT($G27=\"-\"),VLOOKUP($G27,'AL MD'!$A$3:$E$34,2,FALSE),\"\")","v":""},{"$f":"IF($B$2>=C27,\"-\",VLOOKUP($B27,Setup!$Q$4:$R$35,2,FALSE))","v":"-"},{"$f":"IF(NOT($G27=\"-\"),VLOOKUP($G27,'AL MD'!$A$3:$F$34,6,FALSE),0)","v":0},{"$f":"IF(Setup!$B$24=\"#\",0,IF(NOT($G27=\"-\"),VLOOKUP($G27,'AL MD'!$A$3:$E$34,3,FALSE),0))","v":0},{"$f":"IF($I27>0,VLOOKUP($I27,'AL MD'!$C$3:$E$34,2,FALSE),\"bye\")","v":"bye"},"",{"$f":"IF($I27>0,VLOOKUP($I27,'AL MD'!$C$3:$E$34,3,FALSE),\"\")","v":""},2,{"$f":"UPPER(IF($A$2=\"R\",IF(OR(M27=1,M27=\"a\"),I27,IF(OR(M27=2,M27=\"b\"),I28,\"\")),IF(OR(M27=1,M27=\"a\"),K27,IF(OR(M27=2,M27=\"b\"),K28,\"\"))))","v":"ΠΙΤΣΙΝΗΣ"},null,"64, 76(4)",null,null,null,null,null,null,null,0,"bye",null,"ΠΙΤΣΙΝΗΣ","64, 76(4)"]
[24,{"$f":"VALUE(Setup!L5)","v":3},null,5,0,{"$f":"IF(NOT($G28=\"-\"),VLOOKUP($G28,'AL MD'!$A$3:$E$34,2,FALSE),\"\")","v":0},{"$f":"VLOOKUP($B28,Setup!$Q$4:$R$35,2,FALSE)","v":3},{"$f":"IF($G28>0,VLOOKUP($G28,'AL MD'!$A$3:$F$34,6,FALSE),0)","v":440},{"$f":"IF(Setup!$B$24=\"#\",0,IF($G28>0,VLOOKUP($G28,'AL MD'!$A$3:$E$34,3,FALSE),0))","v":30186},{"$f":"IF($I28>0,VLOOKUP($I28,'AL MD'!$C$3:$E$34,2,FALSE),\"bye\")","v":"ΠΙΤΣΙΝΗΣ ΔΗΜΗΤΡΙΟΣ"},"ΠΙΤΣΙΝΗΣ",{"$f":"IF($I28>0,VLOOKUP($I28,'AL MD'!$C$3:$E$34,3,FALSE),\"\")","v":"Ο.Α.ΚΕΡΑΤΣΙΝΙΟΥ"},null,null,null,null,null,null,2,{"$f":"UPPER(IF($A$2=\"R\",IF(OR(S28=1,S28=\"a\"),R24,IF(OR(S28=2,S28=\"b\"),R32,\"\")),IF(OR(S28=1,S28=\"a\"),R24,IF(OR(S28=2,S28=\"b\"),R32,\"\"))))","v":"ΚΑΠΙΡΗΣ"},null,null,null,30186,"ΠΙΤΣΙΝΗΣ ΔΗΜΗΤΡΙΟΣ",null,0,null,null,"ΚΑΠΙΡΗΣ"]
[25,{"$f":"VALUE(Setup!L10)","v":7},null,5,0,{"$f":"IF(NOT($G29=\"-\"),VLOOKUP($G29,'AL MD'!$A$3:$E$34,2,FALSE),\"\")","v":0},{"$f":"VLOOKUP($B29,Setup!$Q$4:$R$35,2,FALSE)","v":7},{"$f":"IF($G29>0,VLOOKUP($G29,'AL MD'!$A$3:$F$34,6,FALSE),0)","v":212},{"$f":"IF(Setup!$B$24=\"#\",0,IF($G29>0,VLOOKUP($G29,'AL MD'!$A$3:$E$34,3,FALSE),0))","v":29274},{"$f":"IF($I29>0,VLOOKUP($I29,'AL MD'!$C$3:$E$34,2,FALSE),\"bye\")","v":"ΣΗΜΑΙΟΦΟΡΙΔΗΣ ΧΑΡΑΛΑΜΠΟΣ"},"ΣΗΜΑΙΟΦΟΡΙΔΗΣ",{"$f":"IF($I29>0,VLOOKUP($I29,'AL MD'!$C$3:$E$34,3,FALSE),\"\")","v":"ΠΕΥΚΗ Γ.ΚΑΛΟΒΕΛΩΝΗΣ"},1,{"$f":"UPPER(IF($A$2=\"R\",IF(OR(M29=1,M29=\"a\"),I29,IF(OR(M29=2,M29=\"b\"),I30,\"\")),IF(OR(M29=1,M29=\"a\"),K29,IF(OR(M29=2,M29=\"b\"),K30,\"\"))))","v":"ΣΗΜΑΙΟΦΟΡΙΔΗΣ"},null,null,null,null,null,"46, 62, 60",null,null,null,29274,"ΣΗΜΑΙΟΦΟΡΙΔΗΣ ΧΑΡΑΛΑΜΠΟΣ",null,"ΣΗΜΑΙΟΦΟΡΙΔΗΣ",null,null,"46, 62, 60"]
[26,{"$f":"19-D30+8","v":22},{"$f":"B29","v":7},5,{"$f":"IF($B$2>=C30,1,0)","v":0},{"$f":"IF(NOT($G30=\"-\"),VLOOKUP($G30,'AL MD'!$A$3:$E$34,2,FALSE),\"\")","v":0},{"$f":"IF($B$2>=C30,\"-\",VLOOKUP($B30,Setup!$Q$4:$R$35,2,FALSE))","v":14},{"$f":"IF(NOT($G30=\"-\"),VLOOKUP($G30,'AL MD'!$A$3:$F$34,6,FALSE),0)","v":73},{"$f":"IF(Setup!$B$24=\"#\",0,IF(NOT($G30=\"-\"),VLOOKUP($G30,'AL MD'!$A$3:$E$34,3,FALSE),0))","v":26547},{"$f":"IF($I30>0,VLOOKUP($I30,'AL MD'!$C$3:$E$34,2,FALSE),\"bye\")","v":"ΚΟΚΟΤΣΑΚΗΣ ΑΛΚΙΝΟΟΣ"},"ΚΟΚΟΤΣΑΚΗΣ",{"$f":"IF($I30>0,VLOOKUP($I30,'AL MD'!$C$3:$E$34,3,FALSE),\"\")","v":"Α.Ο.Α.ΗΛΙΟΥΠΟΛΗΣ"},null,"62, 62",1,{"$f":"UPPER(IF($A$2=\"R\",IF(OR(O30=1,O30=\"a\"),N29,IF(OR(O30=2,O30=\"b\"),N31,\"\")),IF(OR(O30=1,O30=\"a\"),N29,IF(OR(O30=2,O30=\"b\"),N31,\"\"))))","v":"ΣΗΜΑΙΟΦΟΡΙΔΗΣ"},null,null,null,null,null,null,null,26547,"ΚΟΚΟΤΣΑΚΗΣ ΑΛΚΙΝΟΟΣ",null,"62, 62","ΣΗΜΑΙΟΦΟΡΙΔΗΣ"]
[27,{"$f":"20-D31+8","v":23},null,5,0,{"$f":"IF(NOT($G31=\"-\"),VLOOKUP($G31,'AL MD'!$A$3:$E$34,2,FALSE),\"\")","v":0},{"$f":"VLOOKUP($B31,Setup!$Q$4:$R$35,2,FALSE)","v":18},{"$f":"IF($G31>0,VLOOKUP($G31,'AL MD'!$A$3:$F$34,6,FALSE),0)","v":44},{"$f":"IF(Setup!$B$24=\"#\",0,IF($G31>0,VLOOKUP($G31,'AL MD'!$A$3:$E$34,3,FALSE),0))","v":30944},{"$f":"IF($I31>0,VLOOKUP($I31,'AL MD'!$C$3:$E$34,2,FALSE),\"bye\")","v":"ΚΟΝΤΟΓΙΩΡΓΑΚΗΣ ΙΩΑΝΝΗΣ"},"ΚΟΝΤΟΓΙΩΡΓΑΚΗΣ",{"$f":"IF($I31>0,VLOOKUP($I31,'AL MD'!$C$3:$E$34,3,FALSE),\"\")","v":"Ο.Α.ΣΗΤΕΙΑΣ"},2,{"$f":"UPPER(IF($A$2=\"R\",IF(OR(M31=1,M31=\"a\"),I31,IF(OR(M31=2,M31=\"b\"),I32,\"\")),IF(OR(M31=1,M31=\"a\"),K31,IF(OR(M31=2,M31=\"b\"),K32,\"\"))))","v":"ΝΙΚΟΛΑΚΑΚΗΣ"},null,"63, 63",null,null,null,null,null,null,null,30944,"ΚΟΝΤΟΓΙΩΡΓΑΚΗΣ ΙΩΑΝΝΗΣ",null,"ΝΙΚΟΛΑΚΑΚΗΣ","63, 63"]
[28,{"$f":"21-D32+8","v":24},10,5,{"$f":"IF($B$2>=C32,1,0)","v":0},{"$f":"IF(NOT($G32=\"-\"),VLOOKUP($G32,'AL MD'!$A$3:$E$34,2,FALSE),\"\")","v":0},{"$f":"IF($B$2>=C32,\"-\",VLOOKUP($B32,Setup!$Q$4:$R$35,2,FALSE))","v":15},{"$f":"IF(NOT($G32=\"-\"),VLOOKUP($G32,'AL MD'!$A$3:$F$34,6,FALSE),0)","v":67},{"$f":"IF(Setup!$B$24=\"#\",0,IF(NOT($G32=\"-\"),VLOOKUP($G32,'AL MD'!$A$3:$E$34,3,FALSE),0))","v":29651},{"$f":"IF($I32>0,VLOOKUP($I32,'AL MD'!$C$3:$E$34,2,FALSE),\"bye\")","v":"ΝΙΚΟΛΑΚΑΚΗΣ ΙΩΑΝΝΗΣ"},"ΝΙΚΟΛΑΚΑΚΗΣ",{"$f":"IF($I32>0,VLOOKUP($I32,'AL MD'!$C$3:$E$34,3,FALSE),\"\")","v":"ΗΡΑΚΛΕΙΟ Ο.Α.& Α."},null,"63, 36, 60",null,null,2,{"$f":"UPPER(IF($A$2=\"R\",IF(OR(Q32=1,Q32=\"a\"),P30,IF(OR(Q32=2,Q32=\"b\"),P34,\"\")),IF(OR(Q32=1,Q32=\"a\"),P30,IF(OR(Q32=2,Q32=\"b\"),P34,\"\"))))","v":"ΚΑΠΙΡΗΣ"},null,null,null,null,null,29651,"ΝΙΚΟΛΑΚΑΚΗΣ ΙΩΑΝΝΗΣ",null,"63, 36, 60",null,{"$f":"R32","v":"ΚΑΠΙΡΗΣ"}]
[29,{"$f":"22-D33+8","v":25},null,5,0,{"$f":"IF(NOT($G33=\"-\"),VLOOKUP($G33,'AL MD'!$A$3:$E$34,2,FALSE),\"\")","v":"ALT"},{"$f":"VLOOKUP($B33,Setup!$Q$4:$R$35,2,FALSE)","v":11},{"$f":"IF($G33>0,VLOOKUP($G33,'AL MD'!$A$3:$F$34,6,FALSE),0)","v":114},{"$f":"IF(Setup!$B$24=\"#\",0,IF($G33>0,VLOOKUP($G33,'AL MD'!$A$3:$E$34,3,FALSE),0))","v":28285},{"$f":"IF($I33>0,VLOOKUP($I33,'AL MD'!$C$3:$E$34,2,FALSE),\"bye\")","v":"ΠΗΛΙΟΥΝΗΣ ΜΙΧΑΗΛ"},"ΠΗΛΙΟΥΝΗΣ",{"$f":"IF($I33>0,VLOOKUP($I33,'AL MD'!$C$3:$E$34,3,FALSE),\"\")","v":"Ο.Α. ΑΘΗΝΩΝ"},1,{"$f":"UPPER(IF($A$2=\"R\",IF(OR(M33=1,M33=\"a\"),I33,IF(OR(M33=2,M33=\"b\"),I34,\"\")),IF(OR(M33=1,M33=\"a\"),K33,IF(OR(M33=2,M33=\"b\"),K34,\"\"))))","v":"ΠΗΛΙΟΥΝΗΣ"},null,null,null,"61, 62",null,null,null,null,null,28285,"ΠΗΛΙΟΥΝΗΣ ΜΙΧΑΗΛ",null,"ΠΗΛΙΟΥΝΗΣ",null,{"$f":"R33","v":"61, 62"}]
[30,{"$f":"23-D34+8","v":26},16,5,{"$f":"IF($B$2>=C34,1,0)","v":0},{"$f":"IF(NOT($G34=\"-\"),VLOOKUP($G34,'AL MD'!$A$3:$E$34,2,FALSE),\"\")","v":0},{"$f":"IF($B$2>=C34,\"-\",VLOOKUP($B34,Setup!$Q$4:$R$35,2,FALSE))","v":24},{"$f":"IF(NOT($G34=\"-\"),VLOOKUP($G34,'AL MD'!$A$3:$F$34,6,FALSE),0)","v":0},{"$f":"IF(Setup!$B$24=\"#\",0,IF(NOT($G34=\"-\"),VLOOKUP($G34,'AL MD'!$A$3:$E$34,3,FALSE),0))","v":34445},{"$f":"IF($I34>0,VLOOKUP($I34,'AL MD'!$C$3:$E$34,2,FALSE),\"bye\")","v":"ΠΑΠΑΚΥΡΙΑΚΟΥ ΜΙΧΑΛΗΣ"},"ΠΑΠΑΚΥΡΙΑΚΟΥ",{"$f":"IF($I34>0,VLOOKUP($I34,'AL MD'!$C$3:$E$34,3,FALSE),\"\")","v":"Α.Ο.ΒΑΡΗΣ ΑΝΑΓΥΡΟΥΣ"},null,"61, 60",2,{"$f":"UPPER(IF($A$2=\"R\",IF(OR(O34=1,O34=\"a\"),N33,IF(OR(O34=2,O34=\"b\"),N35,\"\")),IF(OR(O34=1,O34=\"a\"),N33,IF(OR(O34=2,O34=\"b\"),N35,\"\"))))","v":"ΚΑΠΙΡΗΣ"},null,null,null,null,null,null,null,34445,"ΠΑΠΑΚΥΡΙΑΚΟΥ ΜΙΧΑΛΗΣ",null,"61, 60","ΚΑΠΙΡΗΣ"]
[31,{"$f":"24-D35+8","v":26},{"$f":"B36","v":2},6,{"$f":"IF($B$2>=C35,1,0)","v":1},{"$f":"IF(NOT($G35=\"-\"),VLOOKUP($G35,'AL MD'!$A$3:$E$34,2,FALSE),\"\")","v":""},{"$f":"IF($B$2>=C35,\"-\",VLOOKUP($B35,Setup!$Q$4:$R$35,2,FALSE))","v":"-"},{"$f":"IF(NOT($G35=\"-\"),VLOOKUP($G35,'AL MD'!$A$3:$F$34,6,FALSE),0)","v":0},{"$f":"IF(Setup!$B$24=\"#\",0,IF(NOT($G35=\"-\"),VLOOKUP($G35,'AL MD'!$A$3:$E$34,3,FALSE),0))","v":0},{"$f":"IF($I35>0,VLOOKUP($I35,'AL MD'!$C$3:$E$34,2,FALSE),\"bye\")","v":"bye"},"",{"$f":"IF($I35>0,VLOOKUP($I35,'AL MD'!$C$3:$E$34,3,FALSE),\"\")","v":""},2,{"$f":"UPPER(IF($A$2=\"R\",IF(OR(M35=1,M35=\"a\"),I35,IF(OR(M35=2,M35=\"b\"),I36,\"\")),IF(OR(M35=1,M35=\"a\"),K35,IF(OR(M35=2,M35=\"b\"),K36,\"\"))))","v":"ΚΑΠΙΡΗΣ"},null,"61, 62",null,null,null,null,null,null,null,0,"bye",null,"ΚΑΠΙΡΗΣ","61, 62"]
[32,2,null,6,0,{"$f":"IF(NOT($G36=\"-\"),VLOOKUP($G36,'AL MD'!$A$3:$E$34,2,FALSE),\"\")","v":0},{"$f":"VLOOKUP($B36,Setup!$Q$4:$R$35,2,FALSE)","v":2},{"$f":"IF($G36>0,VLOOKUP($G36,'AL MD'!$A$3:$F$34,6,FALSE),0)","v":506},{"$f":"IF(Setup!$B$24=\"#\",0,IF($G36>0,VLOOKUP($G36,'AL MD'!$A$3:$E$34,3,FALSE),0))","v":25297},{"$f":"IF($I36>0,VLOOKUP($I36,'AL MD'!$C$3:$E$34,2,FALSE),\"bye\")","v":"ΚΑΠΙΡΗΣ ΣΤΑΜΑΤΗΣ"},"ΚΑΠΙΡΗΣ",{"$f":"IF($I36>0,VLOOKUP($I36,'AL MD'!$C$3:$E$34,3,FALSE),\"\")","v":"Α.Ο.Α.ΗΛΙΟΥΠΟΛΗΣ"},null,null,null,null,null,null,null,null,null,null,null,{"$f":"I36","v":25297},{"$f":"J36","v":"ΚΑΠΙΡΗΣ ΣΤΑΜΑΤΗΣ"},null,0]
[null,null,null,null,null,null,null,null,null,null,null,null,null,null,null," ",null," ",null," "]
[]
[null,null,null,null,null,null,null,null,null,"seeded players"]
[null,null,null,null,null,null,null,null,null,{"$f":"\"1. \" & IF(Setup!B19>0,LEFT('AL MD'!D3,FIND(\" \",'AL MD'!D3)+1),\"\")","v":"1. ΚΩΣΤΑΡΑΣ Π"},null,{"$f":"\"5. \" & IF(Setup!B19>4,LEFT('AL MD'!D7,FIND(\" \",'AL MD'!D7)+1),\"\")","v":"5. ΑΡΕΤΑΚΗΣ Ι"}]
[null,null,null,null,null,null,null,null,null,{"$f":"\"2. \" & IF(Setup!B19>1,LEFT('AL MD'!D4,FIND(\" \",'AL MD'!D4)+1),\"\")","v":"2. ΚΑΠΙΡΗΣ Σ"},null,{"$f":"\"6. \" & IF(Setup!B19>5,LEFT('AL MD'!D8,FIND(\" \",'AL MD'!D8)+1),\"\")","v":"6. ΠΑΧΑΚΗΣ Ν"},null,null,null,null,null,"επιδιαιτητής"]
[null,null,null,null,null,null,null,null,null,{"$f":"\"3. \" & IF(Setup!B19>2,LEFT('AL MD'!D5,FIND(\" \",'AL MD'!D5)+1),\"\")","v":"3. ΠΙΤΣΙΝΗΣ Δ"},null,{"$f":"\"7. \" & IF(Setup!B19>6,LEFT('AL MD'!D9,FIND(\" \",'AL MD'!D9)+1),\"\")","v":"7. ΣΗΜΑΙΟΦΟΡΙΔΗΣ Χ"},null,null,null,null,null,{"$f":"Setup!B10","v":"Νικηφοράκης Σταύρος"}]
[null,null,null,null,null,null,null,null,null,{"$f":"\"4. \" & IF(Setup!B19>3,LEFT('AL MD'!D6,FIND(\" \",'AL MD'!D6)+1),\"\")","v":"4. ΝΑΟΥΜ Σ"},null,{"$f":"\"8. \" & IF(Setup!B19>7,LEFT('AL MD'!D10,FIND(\" \",'AL MD'!D10)+1),\"\")","v":"8. ΦΡΙΣΗΡΑΣ Σ"}]
[]
[]
[]
[]
[]
[]
[]
[]
[]
[]
[]
[]
[]
[]
[]
[null,null,null,null,null,null,null,null,null,"BoldPlayers"]
[null,null,null,null,null,null,null,null,null,{"$f":"IF(Setup!$B$19>0,LEFT('AL MD'!D3,FIND(\" \",'AL MD'!D3)-1))","v":"ΚΩΣΤΑΡΑΣ"}]
[null,null,null,null,null,null,null,null,null,{"$f":"IF(Setup!$B$19>1,LEFT('AL MD'!D4,FIND(\" \",'AL MD'!D4)-1))","v":"ΚΑΠΙΡΗΣ"}]
[null,null,null,null,null,null,null,null,null,{"$f":"IF(Setup!$B$19>2,LEFT('AL MD'!D5,FIND(\" \",'AL MD'!D5)-1))","v":"ΠΙΤΣΙΝΗΣ"}]
[null,null,null,null,null,null,null,null,null,{"$f":"IF(Setup!$B$19>3,LEFT('AL MD'!D6,FIND(\" \",'AL MD'!D6)-1))","v":"ΝΑΟΥΜ"}]
[null,null,null,null,null,null,null,null,null,{"$f":"IF(Setup!$B$19>4,LEFT('AL MD'!D7,FIND(\" \",'AL MD'!D7)-1))","v":"ΑΡΕΤΑΚΗΣ"}]
[null,null,null,null,null,null,null,null,null,{"$f":"IF(Setup!$B$19>5,LEFT('AL MD'!D8,FIND(\" \",'AL MD'!D8)-1))","v":"ΠΑΧΑΚΗΣ"}]
[null,null,null,null,null,null,null,null,null,{"$f":"IF(Setup!$B$19>6,LEFT('AL MD'!D9,FIND(\" \",'AL MD'!D9)-1))","v":"ΣΗΜΑΙΟΦΟΡΙΔΗΣ"}]
[null,null,null,null,null,null,null,null,null,{"$f":"IF(Setup!$B$19>7,LEFT('AL MD'!D10,FIND(\" \",'AL MD'!D10)-1))","v":"ΦΡΙΣΗΡΑΣ"}]

{"sheet":"MD16","index":5,"n_rows":44,"n_cols":18,"rows_kept":44,"cut":false,"hidden":false,"merged":[[2,9,2,11],[0,0,0,15],[26,17,26,18]]}
[{"$f":"Setup!B3 & \", \" & Setup!B4 & \", \" & Setup!B6 & \", \" & Setup!B8 & \"-\" & Setup!B9","v":"ΕΦΟΑ, 1ο Ε2 2014, ΗΡΑΚΛΕΙΟ Ο.Α. & Α, 28 Φεβρουαρίου-4 Μαρτίου"},null,null,null,null,null,null,null,null,null,null,null,null,null,null,null,null,{"$f":"Setup!B7","v":"Α16"}]
[null,{"$f":"Setup!$B$77","v":0},null,null,null,null,null,null,{"$f":"\"p\"&VLOOKUP(Setup!$B$5,tmp!$J$14:$P$23,3,FALSE)","v":"p5"},null,null,null,null,{"$f":"\"p\"&VLOOKUP(Setup!$B$5,tmp!$J$14:$P$23,4,FALSE)","v":"p7"},null,{"$f":"\"p\"&VLOOKUP(Setup!$B$5,tmp!$J$14:$P$23,5,FALSE)","v":"p10"},null,{"$f":"\"p\"&VLOOKUP(Setup!$B$5,tmp!$J$14:$P$23,6,FALSE)&\"-\"&VLOOKUP(Setup!$B$5,tmp!$J$14:$P$23,7,FALSE)","v":"p15-18"}]
[null,null,null,null,null,null,null,null,null,16,null,null,null,8,null,4,null,2]
["α/α",null,"ByeOrder","ByeSum","ByeCnt","από","seed","Pts","Α.Μ.","Ονοματεπώνυμο","επώνυμο","Σύλλογος"]
[1,1,null,null,0,{"$f":"IF(NOT($G5=\"-\"),VLOOKUP($G5,'AL MD'!$A$3:$G$18,2,FALSE),\"\")","v":0},{"$f":"VLOOKUP($B5,Setup!$G$71:$H$86,2,FALSE)","v":1},{"$f":"IF($I5>0,VLOOKUP($G5,'AL MD'!$A$3:$G$18,6,FALSE),0)","v":0},{"$f":"IF(Setup!$B$25=\"#\",0,IF($G5>0,VLOOKUP($G5,'AL MD'!$A$3:$G$18,3,FALSE),0))","v":0},{"$f":"IF($I5>0,VLOOKUP($I5,'AL MD'!$C$3:$G$18,2,FALSE),\"bye\")","v":"bye"},{"$f":"IF(NOT(I5>0),\"\", IF(ISERROR(FIND(\"-\",J5)), LEFT(J5,FIND(\" \",J5)-1), IF(FIND(\"-\",J5)>FIND(\" \",J5),LEFT(J5,FIND(\" \",J5)-1), LEFT(J5,FIND(\"-\",J5)-1) )))","v":""},{"$f":"IF($I5>0,VLOOKUP($I5,'AL MD'!$C$3:$G$18,3,FALSE),\"\")","v":""},null,{"$f":"UPPER(IF($A$2=\"R\",IF(OR(M5=1,M5=\"a\"),I5,IF(OR(M5=2,M5=\"b\"),I6,\"\")),IF(OR(M5=1,M5=\"1\"),K5,IF(OR(M5=2,M5=\"b\"),K6,\"\"))))","v":""}]
[2,{"$f":"1-D6+4","v":5},1,{"$f":"E6","v":0},{"$f":"IF($B$2>=C6,1,0)","v":0},{"$f":"IF(NOT($G6=\"-\"),VLOOKUP($G6,'AL MD'!$A$3:$G$18,2,FALSE),\"\")","v":0},{"$f":"IF($B$2>=C6,\"-\",VLOOKUP($B6,Setup!$G$71:$H$86,2,FALSE))","v":6},{"$f":"IF($I6>0,VLOOKUP($G6,'AL MD'!$A$3:$G$18,6,FALSE),0)","v":0},{"$f":"IF(Setup!$B$25=\"#\",0,IF(NOT($G6=\"-\"),VLOOKUP($G6,'AL MD'!$A$3:$G$18,3,FALSE),0))","v":0},{"$f":"IF($I6>0,VLOOKUP($I6,'AL MD'!$C$3:$G$18,2,FALSE),\"bye\")","v":"bye"},"",{"$f":"IF($I6>0,VLOOKUP($I6,'AL MD'!$C$3:$G$18,3,FALSE),\"\")","v":""},null,null,null,{"$f":"UPPER(IF($A$2=\"R\",IF(OR(O6=1,O6=\"a\"),N5,IF(OR(O6=2,O6=\"b\"),N7,\"\")),IF(OR(O6=1,O6=\"a\"),N5,IF(OR(O6=2,O6=\"b\"),N7,\"\"))))","v":""}]
[3,{"$f":"2-D7+4","v":6},null,{"$f":"D6+E7","v":0},0,{"$f":"IF(NOT($G7=\"-\"),VLOOKUP($G7,'AL MD'!$A$3:$G$18,2,FALSE),\"\")","v":0},{"$f":"VLOOKUP($B7,Setup!$G$71:$H$86,2,FALSE)","v":12},{"$f":"IF($I7>0,VLOOKUP($G7,'AL MD'!$A$3:$G$18,6,FALSE),0)","v":0},{"$f":"IF(Setup!$B$25=\"#\",0,IF($G7>0,VLOOKUP($G7,'AL MD'!$A$3:$G$18,3,FALSE),0))","v":0},{"$f":"IF($I7>0,VLOOKUP($I7,'AL MD'!$C$3:$G$18,2,FALSE),\"bye\")","v":"bye"},"",{"$f":"IF($I7>0,VLOOKUP($I7,'AL MD'!$C$3:$G$18,3,FALSE),\"\")","v":""},null,{"$f":"UPPER(IF($A$2=\"R\",IF(OR(M7=1,M7=\"a\"),I7,IF(OR(M7=2,M7=\"b\"),I8,\"\")),IF(OR(M7=1,M7=\"a\"),K7,IF(OR(M7=2,M7=\"b\"),K8,\"\"))))","v":""}]
[4,{"$f":"3-D8+4","v":7},7,0,{"$f":"IF($B$2>=C8,1,0)","v":0},{"$f":"IF(NOT($G8=\"-\"),VLOOKUP($G8,'AL MD'!$A$3:$G$18,2,FALSE),\"\")","v":"ALT"},{"$f":"IF($B$2>=C8,\"-\",VLOOKUP($B8,Setup!$G$71:$H$86,2,FALSE))","v":11},{"$f":"IF($I8>0,VLOOKUP($G8,'AL MD'!$A$3:$G$18,6,FALSE),0)","v":0},{"$f":"IF(Setup!$B$25=\"#\",0,IF(NOT($G8=\"-\"),VLOOKUP($G8,'AL MD'!$A$3:$G$18,3,FALSE),0))","v":0},{"$f":"IF($I8>0,VLOOKUP($I8,'AL MD'!$C$3:$G$18,2,FALSE),\"bye\")","v":"bye"},"",{"$f":"IF($I8>0,VLOOKUP($I8,'AL MD'!$C$3:$G$18,3,FALSE),\"\")","v":""},null,null,null,null,null,{"$f":"UPPER(IF($A$2=\"R\",IF(OR(Q8=1,Q8=\"a\"),P6,IF(OR(Q8=2,Q8=\"b\"),P10,\"\")),IF(OR(Q8=1,Q8=\"a\"),P6,IF(OR(Q8=2,Q8=\"b\"),P10,\"\"))))","v":""}]
[5,{"$f":"VALUE(Setup!E61)","v":4},null,0,0,{"$f":"IF(NOT($G9=\"-\"),VLOOKUP($G9,'AL MD'!$A$3:$G$18,2,FALSE),\"\")","v":0},{"$f":"VLOOKUP($B9,Setup!$G$71:$H$86,2,FALSE)","v":4},{"$f":"IF($I9>0,VLOOKUP($G9,'AL MD'!$A$3:$G$18,6,FALSE),0)","v":0},{"$f":"IF(Setup!$B$25=\"#\",0,IF($G9>0,VLOOKUP($G9,'AL MD'!$A$3:$G$18,3,FALSE),0))","v":0},{"$f":"IF($I9>0,VLOOKUP($I9,'AL MD'!$C$3:$G$18,2,FALSE),\"bye\")","v":"bye"},"",{"$f":"IF($I9>0,VLOOKUP($I9,'AL MD'!$C$3:$G$18,3,FALSE),\"\")","v":""},null,{"$f":"UPPER(IF($A$2=\"R\",IF(OR(M9=1,M9=\"a\"),I9,IF(OR(M9=2,M9=\"b\"),I10,\"\")),IF(OR(M9=1,M9=\"a\"),K9,IF(OR(M9=2,M9=\"b\"),K10,\"\"))))","v":""}]
[6,{"$f":"4-D10+4","v":8},{"$f":"IF(Setup!E2=3,3,4)","v":4},0,{"$f":"IF($B$2>=C10,1,0)","v":0},{"$f":"IF(NOT($G10=\"-\"),VLOOKUP($G10,'AL MD'!$A$3:$G$18,2,FALSE),\"\")","v":0},{"$f":"IF($B$2>=C10,\"-\",VLOOKUP($B10,Setup!$G$71:$H$86,2,FALSE))","v":5},{"$f":"IF( $I10>0,VLOOKUP($G10,'AL MD'!$A$3:$G$18,6,FALSE),0)","v":0},{"$f":"IF(Setup!$B$25=\"#\",0,IF(NOT($G10=\"-\"),VLOOKUP($G10,'AL MD'!$A$3:$G$18,3,FALSE),0))","v":0},{"$f":"IF($I10>0,VLOOKUP($I10,'AL MD'!$C$3:$G$18,2,FALSE),\"bye\")","v":"bye"},"",{"$f":"IF($I10>0,VLOOKUP($I10,'AL MD'!$C$3:$G$18,3,FALSE),\"\")","v":""},null,null,null,{"$f":"UPPER(IF($A$2=\"R\",IF(OR(O10=1,O10=\"a\"),N9,IF(OR(O10=2,O10=\"b\"),N11,\"\")),IF(OR(O10=1,O10=\"a\"),N9,IF(OR(O10=2,O10=\"b\"),N11,\"\"))))","v":""}]
[7,{"$f":"5-D11+4","v":9},5,0,{"$f":"IF($B$2>=C11,1,0)","v":0},{"$f":"IF(NOT($G11=\"-\"),VLOOKUP($G11,'AL MD'!$A$3:$G$18,2,FALSE),\"\")","v":0},{"$f":"IF($B$2>=C11,\"-\",VLOOKUP($B11,Setup!$G$71:$H$86,2,FALSE))","v":7},{"$f":"IF($I11>0,VLOOKUP($G11,'AL MD'!$A$3:$G$18,6,FALSE),0)","v":0},{"$f":"IF(Setup!$B$25=\"#\",0,IF(NOT($G11=\"-\"),VLOOKUP($G11,'AL MD'!$A$3:$G$18,3,FALSE),0))","v":0},{"$f":"IF($I11>0,VLOOKUP($I11,'AL MD'!$C$3:$G$18,2,FALSE),\"bye\")","v":"bye"},"",{"$f":"IF($I11>0,VLOOKUP($I11,'AL MD'!$C$3:$G$18,3,FALSE),\"\")","v":""},null,{"$f":"UPPER(IF($A$2=\"R\",IF(OR(M11=1,M11=\"a\"),I11,IF(OR(M11=2,M11=\"b\"),I12,\"\")),IF(OR(M11=1,M11=\"a\"),K11,IF(OR(M11=2,M11=\"b\"),K12,\"\"))))","v":""}]
[8,{"$f":"6-D12+4","v":10},null,0,0,{"$f":"IF(NOT($G12=\"-\"),VLOOKUP($G12,'AL MD'!$A$3:$G$18,2,FALSE),\"\")","v":0},{"$f":"VLOOKUP($B12,Setup!$G$71:$H$86,2,FALSE)","v":9},{"$f":"IF($I12>0,VLOOKUP($G12,'AL MD'!$A$3:$G$18,6,FALSE),0)","v":0},{"$f":"IF(Setup!$B$25=\"#\",0,IF($G12>0,VLOOKUP($G12,'AL MD'!$A$3:$G$18,3,FALSE),0))","v":0},{"$f":"IF($I12>0,VLOOKUP($I12,'AL MD'!$C$3:$G$18,2,FALSE),\"bye\")","v":"bye"},"",{"$f":"IF($I12>0,VLOOKUP($I12,'AL MD'!$C$3:$G$18,3,FALSE),\"\")","v":""},null,null,null,null,null,{"$f":"UPPER(IF($A$2=\"R\",IF(OR(Q12=1,Q12=\"a\"),R8,IF(OR(Q12=2,Q12=\"b\"),R16,\"\")),IF(OR(Q12=1,Q12=\"a\"),R8,IF(OR(Q12=2,Q12=\"b\"),R16,\"\"))))","v":""}]
[9,{"$f":"VALUE(Setup!E62)","v":3},null,0,0,{"$f":"IF(NOT($G13=\"-\"),VLOOKUP($G13,'AL MD'!$A$3:$G$18,2,FALSE),\"\")","v":0},{"$f":"VLOOKUP($B13,Setup!$G$71:$H$86,2,FALSE)","v":3},{"$f":"IF($I13>0,VLOOKUP($G13,'AL MD'!$A$3:$G$18,6,FALSE),0)","v":0},{"$f":"IF(Setup!$B$25=\"#\",0,IF($G13>0,VLOOKUP($G13,'AL MD'!$A$3:$G$18,3,FALSE),0))","v":0},{"$f":"IF($I13>0,VLOOKUP($I13,'AL MD'!$C$3:$G$18,2,FALSE),\"bye\")","v":"bye"},"",{"$f":"IF($I13>0,VLOOKUP($I13,'AL MD'!$C$3:$G$18,3,FALSE),\"\")","v":""},null,{"$f":"UPPER(IF($A$2=\"R\",IF(OR(M13=1,M13=\"a\"),I13,IF(OR(M13=2,M13=\"b\"),I14,\"\")),IF(OR(M13=1,M13=\"a\"),K13,IF(OR(M13=2,M13=\"b\"),K14,\"\"))))","v":""}]
[10,{"$f":"7-D14+4","v":11},{"$f":"IF(Setup!E2=3,4,3)","v":3},0,{"$f":"IF($B$2>=C14,1,0)","v":0},{"$f":"IF(NOT($G14=\"-\"),VLOOKUP($G14,'AL MD'!$A$3:$G$18,2,FALSE),\"\")","v":0},{"$f":"IF($B$2>=C14,\"-\",VLOOKUP($B14,Setup!$G$71:$H$86,2,FALSE))","v":15},{"$f":"IF($I14>0,VLOOKUP($G14,'AL MD'!$A$3:$G$18,6,FALSE),0)","v":0},{"$f":"IF(Setup!$B$25=\"#\",0,IF(NOT($G14=\"-\"),VLOOKUP($G14,'AL MD'!$A$3:$G$18,3,FALSE),0))","v":0},{"$f":"IF($I14>0,VLOOKUP($I14,'AL MD'!$C$3:$G$18,2,FALSE),\"bye\")","v":"bye"},"",{"$f":"IF($I14>0,VLOOKUP($I14,'AL MD'!$C$3:$G$18,3,FALSE),\"\")","v":""},null,null,null,{"$f":"UPPER(IF($A$2=\"R\",IF(OR(O14=1,O14=\"a\"),N13,IF(OR(O14=2,O14=\"b\"),N15,\"\")),IF(OR(O14=1,O14=\"a\"),N13,IF(OR(O14=2,O14=\"b\"),N15,\"\"))))","v":""}]
[11,{"$f":"8-D15+4","v":12},null,0,0,{"$f":"IF(NOT($G15=\"-\"),VLOOKUP($G15,'AL MD'!$A$3:$G$18,2,FALSE),\"\")","v":0},{"$f":"VLOOKUP($B15,Setup!$G$71:$H$86,2,FALSE)","v":16},{"$f":"IF($I15>0,VLOOKUP($G15,'AL MD'!$A$3:$G$18,6,FALSE),0)","v":0},{"$f":"IF(Setup!$B$25=\"#\",0,IF($G15>0,VLOOKUP($G15,'AL MD'!$A$3:$G$18,3,FALSE),0))","v":0},{"$f":"IF($I15>0,VLOOKUP($I15,'AL MD'!$C$3:$G$18,2,FALSE),\"bye\")","v":"bye"},"",{"$f":"IF($I15>0,VLOOKUP($I15,'AL MD'!$C$3:$G$18,3,FALSE),\"\")","v":""},null,{"$f":"UPPER(IF($A$2=\"R\",IF(OR(M15=1,M15=\"a\"),I15,IF(OR(M15=2,M15=\"b\"),I16,\"\")),IF(OR(M15=1,M15=\"a\"),K15,IF(OR(M15=2,M15=\"b\"),K16,\"\"))))","v":""}]
[12,{"$f":"9-D16+4","v":13},6,0,{"$f":"IF($B$2>=C16,1,0)","v":0},{"$f":"IF(NOT($G16=\"-\"),VLOOKUP($G16,'AL MD'!$A$3:$G$18,2,FALSE),\"\")","v":0},{"$f":"IF($B$2>=C16,\"-\",VLOOKUP($B16,Setup!$G$71:$H$86,2,FALSE))","v":14},{"$f":"IF($I16>0,VLOOKUP($G16,'AL MD'!$A$3:$G$18,6,FALSE),0)","v":0},{"$f":"IF(Setup!$B$25=\"#\",0,IF(NOT($G16=\"-\"),VLOOKUP($G16,'AL MD'!$A$3:$G$18,3,FALSE),0))","v":0},{"$f":"IF($I16>0,VLOOKUP($I16,'AL MD'!$C$3:$G$18,2,FALSE),\"bye\")","v":"bye"},"",{"$f":"IF($I16>0,VLOOKUP($I16,'AL MD'!$C$3:$G$18,3,FALSE),\"\")","v":""},null,null,null,null,null,{"$f":"UPPER(IF($A$2=\"R\",IF(OR(Q16=1,Q16=\"a\"),P14,IF(OR(Q16=2,Q16=\"b\"),P18,\"\")),IF(OR(Q16=1,Q16=\"a\"),P14,IF(OR(Q16=2,Q16=\"b\"),P18,\"\"))))","v":""}]
[13,{"$f":"10-D17+4","v":14},null,0,0,{"$f":"IF(NOT($G17=\"-\"),VLOOKUP($G17,'AL MD'!$A$3:$G$18,2,FALSE),\"\")","v":0},{"$f":"VLOOKUP($B17,Setup!$G$71:$H$86,2,FALSE)","v":8},{"$f":"IF($I17>0,VLOOKUP($G17,'AL MD'!$A$3:$G$18,6,FALSE),0)","v":0},{"$f":"IF(Setup!$B$25=\"#\",0,IF($G17>0,VLOOKUP($G17,'AL MD'!$A$3:$G$18,3,FALSE),0))","v":0},{"$f":"IF($I17>0,VLOOKUP($I17,'AL MD'!$C$3:$G$18,2,FALSE),\"bye\")","v":"bye"},"",{"$f":"IF($I17>0,VLOOKUP($I17,'AL MD'!$C$3:$G$18,3,FALSE),\"\")","v":""},null,{"$f":"UPPER(IF($A$2=\"R\",IF(OR(M17=1,M17=\"a\"),I17,IF(OR(M17=2,M17=\"b\"),I18,\"\")),IF(OR(M17=1,M17=\"a\"),K17,IF(OR(M17=2,M17=\"b\"),K18,\"\"))))","v":""}]
[14,{"$f":"11-D18+4","v":15},8,0,{"$f":"IF($B$2>=C18,1,0)","v":0},{"$f":"IF(NOT($G18=\"-\"),VLOOKUP($G18,'AL MD'!$A$3:$G$18,2,FALSE),\"\")","v":0},{"$f":"IF($B$2>=C18,\"-\",VLOOKUP($B18,Setup!$G$71:$H$86,2,FALSE))","v":13},{"$f":"IF($I18>0,VLOOKUP($G18,'AL MD'!$A$3:$G$18,6,FALSE),0)","v":0},{"$f":"IF(Setup!$B$25=\"#\",0,IF(NOT($G18=\"-\"),VLOOKUP($G18,'AL MD'!$A$3:$G$18,3,FALSE),0))","v":0},{"$f":"IF($I18>0,VLOOKUP($I18,'AL MD'!$C$3:$G$18,2,FALSE),\"bye\")","v":"bye"},"",{"$f":"IF($I18>0,VLOOKUP($I18,'AL MD'!$C$3:$G$18,3,FALSE),\"\")","v":""},null,null,null,{"$f":"UPPER(IF($A$2=\"R\",IF(OR(O18=1,O18=\"a\"),N17,IF(OR(O18=2,O18=\"b\"),N19,\"\")),IF(OR(O18=1,O18=\"a\"),N17,IF(OR(O18=2,O18=\"b\"),N19,\"\"))))","v":""}]
[15,{"$f":"12-D19+4","v":16},2,0,{"$f":"IF($B$2>=C19,1,0)","v":0},{"$f":"IF(NOT($G19=\"-\"),VLOOKUP($G19,'AL MD'!$A$3:$G$18,2,FALSE),\"\")","v":0},{"$f":"IF($B$2>=C19,\"-\",VLOOKUP($B19,Setup!$G$71:$H$86,2,FALSE))","v":10},{"$f":"IF($I19>0,VLOOKUP($G19,'AL MD'!$A$3:$G$18,6,FALSE),0)","v":0},{"$f":"IF(Setup!$B$25=\"#\",0,IF(NOT($G19=\"-\"),VLOOKUP($G19,'AL MD'!$A$3:$G$18,3,FALSE),0))","v":0},{"$f":"IF($I19>0,VLOOKUP($I19,'AL MD'!$C$3:$G$18,2,FALSE),\"bye\")","v":"bye"},"",{"$f":"IF($I19>0,VLOOKUP($I19,'AL MD'!$C$3:$G$18,3,FALSE),\"\")","v":""},null,{"$f":"UPPER(IF($A$2=\"R\",IF(OR(M19=1,M19=\"a\"),I19,IF(OR(M19=2,M19=\"b\"),I20,\"\")),IF(OR(M19=1,M19=\"a\"),K19,IF(OR(M19=2,M19=\"b\"),K20,\"\"))))","v":""}]
[16,2,null,0,0,{"$f":"IF(NOT($G20=\"-\"),VLOOKUP($G20,'AL MD'!$A$3:$G$18,2,FALSE),\"\")","v":0},{"$f":"VLOOKUP($B20,Setup!$G$71:$H$86,2,FALSE)","v":2},{"$f":"IF($I20>0,VLOOKUP($G20,'AL MD'!$A$3:$G$18,6,FALSE),0)","v":0},{"$f":"IF(Setup!$B$25=\"#\",0,IF($G20>0,VLOOKUP($G20,'AL MD'!$A$3:$G$18,3,FALSE),0))","v":0},{"$f":"IF($I20>0,VLOOKUP($I20,'AL MD'!$C$3:$G$18,2,FALSE),\"bye\")","v":"bye"},"",{"$f":"IF($I20>0,VLOOKUP($I20,'AL MD'!$C$3:$G$18,3,FALSE),\"\")","v":""}]
[null,null,null,null,null,null,null,null,null,null,null,null,null," ",null," ",null," "]
[]
[]
[null,null,null,null,null,null,null,null,null,"seeded players"]
[null,null,null,null,null,null,null,null,null,{"$f":"\"1. \" & IF(Setup!B78>0,LEFT('AL MD'!D3,FIND(\" \",'AL MD'!D3)+1),\"\")","v":"1. ΚΩΣΤΑΡΑΣ Π"}]
[null,null,null,null,null,null,null,null,null,{"$f":"\"2. \" & IF(Setup!B78>1,LEFT('AL MD'!D4,FIND(\" \",'AL MD'!D4)+1),\"\")","v":"2. ΚΑΠΙΡΗΣ Σ"},null,null,null,null,null,null,null,"επιδιαιτητής"]
[null,null,null,null,null,null,null,null,null,{"$f":"\"3. \" & IF(Setup!B78>2,LEFT('AL MD'!D5,FIND(\" \",'AL MD'!D5)+1),\"\")","v":"3. ΠΙΤΣΙΝΗΣ Δ"},null,null,null,null,null,null,null,{"$f":"Setup!$B$10","v":"Νικηφοράκης Σταύρος"}]
[null,null,null,null,null,null,null,null,null,{"$f":"\"4. \" & IF(Setup!B78>3,LEFT('AL MD'!D6,FIND(\" \",'AL MD'!D6)+1),\"\")","v":"4. ΝΑΟΥΜ Σ"}]
[]
[]
[]
[]
[]
[]
[]
[]
[]
[]
[]
[null,null,null,null,null,null,null,null,null,"BoldPlayers"]
[null,null,null,null,null,null,null,null,null,{"$f":"IF(Setup!$B$19>0,LEFT(AL MD!D3,FIND(\" \",AL MD!D3)-1))","v":{"$error":"#NAME?"}}]
[null,null,null,null,null,null,null,null,null,{"$f":"IF(Setup!$B$19>1,LEFT(AL MD!D4,FIND(\" \",AL MD!D4)-1))","v":{"$error":"#NAME?"}}]
[null,null,null,null,null,null,null,null,null,{"$f":"IF(Setup!$B$19>2,LEFT(AL MD!D5,FIND(\" \",AL MD!D5)-1))","v":{"$error":"#NAME?"}}]
[null,null,null,null,null,null,null,null,null,{"$f":"IF(Setup!$B$19>3,LEFT(AL MD!D6,FIND(\" \",AL MD!D6)-1))","v":{"$error":"#NAME?"}}]

{"sheet":"QDprg","index":6,"n_rows":32,"n_cols":5,"rows_kept":32,"cut":false,"hidden":false,"merged":[[0,0,0,4],[1,0,1,4],[22,0,22,2],[3,0,3,2]]}
[{"$f":"Setup!$B$3 & \", \" & Setup!$B$4 & \", \" & Setup!$B$6  & \" (\" & Setup!$B$7 & \")\"","v":"ΕΦΟΑ, 1ο Ε2 2014, ΗΡΑΚΛΕΙΟ Ο.Α. & Α (Α16)"}]
[{"$f":"Setup!$B$10","v":"Νικηφοράκης Σταύρος"}]
[]
["Πρόγραμμα Προκριματικών",null,null,null,"Round 1"]
["ΩΡΑ","Κτγρ.","Αθλητής-Σύλλογος",null,"Αθλητής-Σύλλογος"]
["Έναρξη","Α12 Δ",{"$error":"#VALUE!"},{"$error":"#VALUE!"},""]
[null,"Α12 Δ",""," ",""]
[null,"Α12 Δ",{"$error":"#VALUE!"},{"$error":"#VALUE!"},""]
[null,"Α12 Δ",""," ",""]
[null,"Α12 Δ",{"$error":"#VALUE!"},{"$error":"#VALUE!"},""]
["όχι πριν","Α12 Δ",""," ",""]
[null,"Α12 Δ",{"$error":"#VALUE!"},{"$error":"#VALUE!"},""]
[null,"Α12 Δ",""," ",""]
[null,"Α12 Δ",{"$error":"#VALUE!"},{"$error":"#VALUE!"},""]
[null,"Α12 Δ",""," ",""]
["όχι πριν","Α12 Δ",{"$error":"#VALUE!"},{"$error":"#VALUE!"},""]
[null,"Α12 Δ",""," ",""]
[null,"Α12 Δ",{"$error":"#VALUE!"},{"$error":"#VALUE!"},""]
[null,"Α12 Δ",""," ",""]
[null,"Α12 Δ",{"$error":"#VALUE!"},{"$error":"#VALUE!"},""]
[null,"Α12 Δ",""," ",""]
[]
["Πρόγραμμα Προκριματικών",null,null,null,"Round 2"]
["ΩΡΑ","Κτγρ.","Αθλητής-Σύλλογος",null,"Αθλητής-Σύλλογος"]
["Έναρξη","Α12 Δ",""," ",""]
[null,"Α12 Δ",""," ",""]
[null,"Α12 Δ",""," ",""]
[null,"Α12 Δ",""," ",""]
[null,"Α12 Δ",""," ",""]
["όχι πριν","Α12 Δ",""," ",""]
[null,"Α12 Δ",""," ",""]
[null,"Α12 Δ",""," ",""]

{"sheet":"MDprg","index":7,"n_rows":32,"n_cols":5,"rows_kept":32,"cut":false,"hidden":false,"merged":[[0,0,0,4],[1,0,1,4],[22,0,22,2],[3,0,3,2]]}
[{"$f":"Setup!$B$3 & \", \" & Setup!$B$4 & \", \" & Setup!$B$6  & \" (\" & Setup!$B$7 & \")\"","v":"ΕΦΟΑ, 1ο Ε2 2014, ΗΡΑΚΛΕΙΟ Ο.Α. & Α (Α16)"}]
[{"$f":"Setup!$B$10","v":"Νικηφοράκης Σταύρος"}]
[]
["Πρόγραμμα αγώνων Κ.Τ.",null,null,null,"Round 1"]
["ΩΡΑ","Κτγρ.","Αθλητής-Σύλλογος",null,"Αθλητής-Σύλλογος"]
["Έναρξη","Α16","ΚΩΣΤΑΡΑΣ Π (Ο.Α.ΠΕΤΡΟΥΠΟΛΗΣ)"," ",""]
[null,"Α16","ΚΡΑΣΟΥΔΑΚΗΣ Ι (Ο.Α.ΧΑΝΙΩΝ)","-","ΚΥΡΙΑΚΑΚΗΣ-ΜΕΣΣΑΡΙΤΑΚΗΣ Γ (ΗΡΑΚΛΕΙΟ Ο.Α.& Α.)"]
[null,"Α16","ΚΑΪΜΑΡΑΣ Χ (Α.Κ.Α.ΜΑΡΑΘΩΝΑ)","-","ΠΑΤΕΡΑΣ Δ (Α.Ο.ΤΑΤΟΪΟΥ)"]
[null,"Α16",""," ","ΑΡΕΤΑΚΗΣ Ι (Ο.Α.ΧΑΝΙΩΝ)"]
[null,"Α16","ΝΑΟΥΜ Σ (Ο.Α.ΧΑΝΙΩΝ)"," ",""]
["όχι πριν","Α16","ΜΑΝΟΥΣΑΚΗΣ Κ (ΗΡΑΚΛΕΙΟ Ο.Α.& Α.)","-","ΣΤΑΥΡΟΥΛΑΚΗΣ Γ (ΗΡΑΚΛΕΙΟ Ο.Α.& Α.)"]
[null,"Α16","ΓΙΑΚΟΥΜΑΚΗΣ Ι (Ο.Α.ΧΑΝΙΩΝ)","-","ΠΑΡΑΣΚΕΥΑΣ Μ (Α.Π.Μ.Σ.ΑΣΚΗΣΗ ΗΡΑΚΛΕΙΟΥ)"]
[null,"Α16","ΑΓΓΕΛΟΠΟΥΛΟΣ Μ (ΠΕΥΚΗ Γ.ΚΑΛΟΒΕΛΩΝΗΣ)","-","ΦΡΙΣΗΡΑΣ Σ (Ο.Α.ΑΘΛΗΤ.ΠΑΙΔΕΙΑ)"]
[null,"Α16","ΠΑΧΑΚΗΣ Ν (Ο.Α.ΑΘΗΝΩΝ)"," ",""]
[null,"Α16","ΚΡΟΝΤΗΡΑΣ Α (ΗΡΑΚΛΕΙΟ Ο.Α.& Α.)","-","ΚΟΥΚΟΥΛΙΘΡΑΣ Ι (Ο.Α.ΚΕΡΑΤΣΙΝΙΟΥ)"]
["όχι πριν","Α16","ΤΣΟΜΛΕΚΤΣΟΓΛΟΥ Ν (Α.Ο.Α.ΦΙΛΟΘΕΗΣ)","-","ΣΑΚΕΛΛΑΡΙΔΗΣ Μ (Ο.Α.ΑΓΙΑΣ ΠΑΡΑΣΚΕΥΗΣ)"]
[null,"Α16",""," ","ΠΙΤΣΙΝΗΣ Δ (Ο.Α.ΚΕΡΑΤΣΙΝΙΟΥ)"]
[null,"Α16","ΣΗΜΑΙΟΦΟΡΙΔΗΣ Χ (ΠΕΥΚΗ Γ.ΚΑΛΟΒΕΛΩΝΗΣ)","-","ΚΟΚΟΤΣΑΚΗΣ Α (Α.Ο.Α.ΗΛΙΟΥΠΟΛΗΣ)"]
[null,"Α16","ΚΟΝΤΟΓΙΩΡΓΑΚΗΣ Ι (Ο.Α.ΣΗΤΕΙΑΣ)","-","ΝΙΚΟΛΑΚΑΚΗΣ Ι (ΗΡΑΚΛΕΙΟ Ο.Α.& Α.)"]
[null,"Α16","ΠΗΛΙΟΥΝΗΣ Μ (Ο.Α. ΑΘΗΝΩΝ)","-","ΠΑΠΑΚΥΡΙΑΚΟΥ Μ (Α.Ο.ΒΑΡΗΣ ΑΝΑΓΥΡΟΥΣ)"]
[null,"Α16",""," ","ΚΑΠΙΡΗΣ Σ (Α.Ο.Α.ΗΛΙΟΥΠΟΛΗΣ)"]
[]
["Πρόγραμμα αγώνων Κ.Τ.",null,null,null,"Round 2"]
["ΩΡΑ","Κτγρ.","Αθλητής-Σύλλογος",null,"Αθλητής-Σύλλογος"]
["Έναρξη","Α16","ΚΩΣΤΑΡΑΣ Π (Ο.Α.ΠΕΤΡΟΥΠΟΛΗΣ)","-","ΚΥΡΙΑΚΑΚΗΣ-ΜΕΣΣΑΡΙΤΑΚΗΣ Γ (ΗΡΑΚΛΕΙΟ Ο.Α.& Α.)"]
[null,"Α16","ΚΑΪΜΑΡΑΣ Χ (Α.Κ.Α.ΜΑΡΑΘΩΝΑ)","-","ΑΡΕΤΑΚΗΣ Ι (Ο.Α.ΧΑΝΙΩΝ)"]
[null,"Α16","ΝΑΟΥΜ Σ (Ο.Α.ΧΑΝΙΩΝ)","-","ΜΑΝΟΥΣΑΚΗΣ Κ (ΗΡΑΚΛΕΙΟ Ο.Α.& Α.)"]
[null,"Α16","ΓΙΑΚΟΥΜΑΚΗΣ Ι (Ο.Α.ΧΑΝΙΩΝ)","-","ΦΡΙΣΗΡΑΣ Σ (Ο.Α.ΑΘΛΗΤ.ΠΑΙΔΕΙΑ)"]
[null,"Α16","ΠΑΧΑΚΗΣ Ν (Ο.Α.ΑΘΗΝΩΝ)","-","ΚΟΥΚΟΥΛΙΘΡΑΣ Ι (Ο.Α.ΚΕΡΑΤΣΙΝΙΟΥ)"]
["όχι πριν","Α16","ΣΑΚΕΛΛΑΡΙΔΗΣ Μ (Ο.Α.ΑΓΙΑΣ ΠΑΡΑΣΚΕΥΗΣ)","-","ΠΙΤΣΙΝΗΣ Δ (Ο.Α.ΚΕΡΑΤΣΙΝΙΟΥ)"]
[null,"Α16","ΣΗΜΑΙΟΦΟΡΙΔΗΣ Χ (ΠΕΥΚΗ Γ.ΚΑΛΟΒΕΛΩΝΗΣ)","-","ΝΙΚΟΛΑΚΑΚΗΣ Ι (ΗΡΑΚΛΕΙΟ Ο.Α.& Α.)"]
[null,"Α16","ΠΗΛΙΟΥΝΗΣ Μ (Ο.Α. ΑΘΗΝΩΝ)","-","ΚΑΠΙΡΗΣ Σ (Α.Ο.Α.ΗΛΙΟΥΠΟΛΗΣ)"]

{"sheet":"notes","index":8,"n_rows":0,"n_cols":0,"rows_kept":0,"cut":false,"hidden":false,"merged":[]}

{"sheet":"Rankings","index":9,"n_rows":2,"n_cols":6,"rows_kept":2,"cut":false,"hidden":false,"merged":[]}
["ΑΜ","Ονοματεπώνυμο","Βαθμ","Διπλ"]
[null,null,null,null,null,"=IF(C3=\"\";0;VLOOKUP(C3;Rankings!$A:$E;3;FALSE))"]

{"sheet":"CalcPrg","index":10,"n_rows":93,"n_cols":7,"rows_kept":93,"cut":false,"hidden":false,"merged":[[72,0,72,2],[83,0,83,2],[54,0,54,2],[0,0,0,4],[1,0,1,4],[22,0,22,2],[35,0,35,2],[3,0,3,2]]}
[{"$f":"Setup!$B$3 & \", \" & Setup!$B$4 & \", \" & Setup!$B$6  & \" (\" & Setup!$B$7 & \")\"","v":"ΕΦΟΑ, 1ο Ε2 2014, ΗΡΑΚΛΕΙΟ Ο.Α. & Α (Α16)"},null,null,null,null,null,"Don't Change this Worksheet !"]
[{"$f":"Setup!$B$10","v":"Νικηφοράκης Σταύρος"}]
[]
["Πρόγραμμα Προκριματικών",null,null,null,"Round 1"]
["ΩΡΑ","Κτγρ.","Αθλητής-Σύλλογος",null,"Αθλητής-Σύλλογος"]
["Έναρξη",{"$f":"Setup!$B$7","v":"Α16"},{"$f":"IF(OR(QD!H5=\"bye\",QD!H5=\"LWD\"),\"\",LEFT(QD!H5,FIND(\" \",QD!H5)+1)&\" (\"&QD!J5&\")\")","v":{"$error":"#VALUE!"}},{"$f":"IF(OR(C6=\"\",E6=\"\"),\" \",\"-\")","v":{"$error":"#VALUE!"}},{"$f":"IF(OR(QD!H6=\"bye\",QD!H6=\"LWD\"),\"\",LEFT(QD!H6,FIND(\" \",QD!H6)+1)&\" (\"&QD!J6&\")\")","v":""}]
[null,{"$f":"Setup!$B$7","v":"Α16"},{"$f":"IF(OR(QD!H7=\"bye\",QD!H7=\"LWD\"),\"\",LEFT(QD!H7,FIND(\" \",QD!H7)+1)&\" (\"&QD!J7&\")\")","v":""},{"$f":"IF(OR(C7=\"\",E7=\"\"),\" \",\"-\")","v":" "},{"$f":"IF(OR(QD!H8=\"bye\",QD!H8=\"LWD\"), \"\", LEFT(QD!H8,FIND(\" \",QD!H8)+1)&\" (\"&QD!J8&\")\")","v":""}]
[null,{"$f":"Setup!$B$7","v":"Α16"},{"$f":"IF(OR(QD!H9=\"bye\",QD!H9=\"LWD\"),\"\",LEFT(QD!H9,FIND(\" \",QD!H9)+1)&\" (\"&QD!J9&\")\")","v":{"$error":"#VALUE!"}},{"$error":"#VALUE!"},{"$f":"IF(OR(QD!H10=\"bye\",QD!H10=\"LWD\"), \"\", LEFT(QD!H10,FIND(\" \",QD!H10)+1)&\" (\"&QD!J10&\")\")","v":""}]
[null,{"$f":"Setup!$B$7","v":"Α16"},{"$f":"IF(OR(QD!H11=\"bye\",QD!H11=\"LWD\"),\"\",LEFT(QD!H11,FIND(\" \",QD!H11)+1)&\" (\"&QD!J11&\")\")","v":""}," ",{"$f":"IF(OR(QD!H12=\"bye\",QD!H12=\"LWD\"), \"\", LEFT(QD!H12,FIND(\" \",QD!H12)+1)&\" (\"&QD!J12&\")\")","v":""}]
["όχι πριν",{"$f":"Setup!$B$7","v":"Α16"},{"$f":"IF(OR(QD!H13=\"bye\",QD!H13=\"LWD\"),\"\",LEFT(QD!H13,FIND(\" \",QD!H13)+1)&\" (\"&QD!J13&\")\")","v":{"$error":"#VALUE!"}},{"$error":"#VALUE!"},{"$f":"IF(OR(QD!H14=\"bye\",QD!H14=\"LWD\"), \"\", LEFT(QD!H14,FIND(\" \",QD!H14)+1)&\" (\"&QD!J14&\")\")","v":""}]
[null,{"$f":"Setup!$B$7","v":"Α16"},{"$f":"IF(OR(QD!H15=\"bye\",QD!H15=\"LWD\"),\"\",LEFT(QD!H15,FIND(\" \",QD!H15)+1)&\" (\"&QD!J15&\")\")","v":""}," ",{"$f":"IF(OR(QD!H16=\"bye\",QD!H16=\"LWD\"), \"\", LEFT(QD!H16,FIND(\" \",QD!H16)+1)&\" (\"&QD!J16&\")\")","v":""}]
[null,{"$f":"Setup!$B$7","v":"Α16"},{"$f":"IF(OR(QD!H17=\"bye\",QD!H17=\"LWD\"),\"\",LEFT(QD!H17,FIND(\" \",QD!H17)+1)&\" (\"&QD!J17&\")\")","v":{"$error":"#VALUE!"}},{"$error":"#VALUE!"},{"$f":"IF(OR(QD!H18=\"bye\",QD!H18=\"LWD\"), \"\", LEFT(QD!H18,FIND(\" \",QD!H18)+1)&\" (\"&QD!J18&\")\")","v":""}]
[null,{"$f":"Setup!$B$7","v":"Α16"},{"$f":"IF(OR(QD!H19=\"bye\",QD!H19=\"LWD\"),\"\",LEFT(QD!H19,FIND(\" \",QD!H19)+1)&\" (\"&QD!J19&\")\")","v":""}," ",{"$f":"IF(OR(QD!H20=\"bye\",QD!H20=\"LWD\"), \"\", LEFT(QD!H20,FIND(\" \",QD!H20)+1)&\" (\"&QD!J20&\")\")","v":""}]
["όχι πριν",{"$f":"Setup!$B$7","v":"Α16"},{"$f":"IF(OR(QD!H21=\"bye\",QD!H21=\"LWD\"),\"\",LEFT(QD!H21,FIND(\" \",QD!H21)+1)&\" (\"&QD!J21&\")\")","v":{"$error":"#VALUE!"}},{"$error":"#VALUE!"},{"$f":"IF(OR(QD!H22=\"bye\",QD!H22=\"LWD\"), \"\", LEFT(QD!H22,FIND(\" \",QD!H22)+1)&\" (\"&QD!J22&\")\")","v":""}]
[null,{"$f":"Setup!$B$7","v":"Α16"},{"$f":"IF(OR(QD!H23=\"bye\",QD!H23=\"LWD\"),\"\",LEFT(QD!H23,FIND(\" \",QD!H23)+1)&\" (\"&QD!J23&\")\")","v":""}," ",{"$f":"IF(OR(QD!H24=\"bye\",QD!H24=\"LWD\"), \"\", LEFT(QD!H24,FIND(\" \",QD!H24)+1)&\" (\"&QD!J24&\")\")","v":""}]
[null,{"$f":"Setup!$B$7","v":"Α16"},{"$f":"IF(OR(QD!H25=\"bye\",QD!H25=\"LWD\"),\"\",LEFT(QD!H25,FIND(\" \",QD!H25)+1)&\" (\"&QD!J25&\")\")","v":{"$error":"#VALUE!"}},{"$error":"#VALUE!"},{"$f":"IF(OR(QD!H26=\"bye\",QD!H26=\"LWD\"), \"\", LEFT(QD!H26,FIND(\" \",QD!H26)+1)&\" (\"&QD!J26&\")\")","v":""}]
[null,{"$f":"Setup!$B$7","v":"Α16"},{"$f":"IF(OR(QD!H27=\"bye\",QD!H27=\"LWD\"),\"\",LEFT(QD!H27,FIND(\" \",QD!H27)+1)&\" (\"&QD!J27&\")\")","v":""}," ",{"$f":"IF(OR(QD!H28=\"bye\",QD!H28=\"LWD\"), \"\", LEFT(QD!H28,FIND(\" \",QD!H28)+1)&\" (\"&QD!J28&\")\")","v":""}]
["όχι πριν",{"$f":"Setup!$B$7","v":"Α16"},{"$f":"IF(OR(QD!H29=\"bye\",QD!H29=\"LWD\"),\"\",LEFT(QD!H29,FIND(\" \",QD!H29)+1)&\" (\"&QD!J29&\")\")","v":{"$error":"#VALUE!"}},{"$error":"#VALUE!"},{"$f":"IF(OR(QD!H30=\"bye\",QD!H30=\"LWD\"), \"\", LEFT(QD!H30,FIND(\" \",QD!H30)+1)&\" (\"&QD!J30&\")\")","v":""}]
[null,{"$f":"Setup!$B$7","v":"Α16"},{"$f":"IF(OR(QD!H31=\"bye\",QD!H31=\"LWD\"),\"\",LEFT(QD!H31,FIND(\" \",QD!H31)+1)&\" (\"&QD!J31&\")\")","v":""}," ",{"$f":"IF(OR(QD!H32=\"bye\",QD!H32=\"LWD\"), \"\", LEFT(QD!H32,FIND(\" \",QD!H32)+1)&\" (\"&QD!J32&\")\")","v":""}]
[null,{"$f":"Setup!$B$7","v":"Α16"},{"$f":"IF(OR(QD!H33=\"bye\",QD!H33=\"LWD\"),\"\",LEFT(QD!H33,FIND(\" \",QD!H33)+1)&\" (\"&QD!J33&\")\")","v":{"$error":"#VALUE!"}},{"$error":"#VALUE!"},{"$f":"IF(OR(QD!H34=\"bye\",QD!H34=\"LWD\"), \"\", LEFT(QD!H34,FIND(\" \",QD!H34)+1)&\" (\"&QD!J34&\")\")","v":""}]
[null,{"$f":"Setup!$B$7","v":"Α16"},{"$f":"IF(OR(QD!H35=\"bye\",QD!H35=\"LWD\"),\"\",LEFT(QD!H35,FIND(\" \",QD!H35)+1)&\" (\"&QD!J35&\")\")","v":""}," ",{"$f":"IF(OR(QD!H36=\"bye\",QD!H36=\"LWD\"), \"\", LEFT(QD!H36,FIND(\" \",QD!H36)+1)&\" (\"&QD!J36&\")\")","v":""}]
[]
["Πρόγραμμα Προκριματικών",null,null,null,"Round 2"]
["ΩΡΑ","Κτγρ.","Αθλητής-Σύλλογος",null,"Αθλητής-Σύλλογος"]
["Έναρξη",{"$f":"Setup!$B$7","v":"Α16"},{"$f":"QD!L5","v":""},{"$f":"IF(OR(C25=\"\",E25=\"\"),\" \",\"-\")","v":" "},{"$f":"QD!L7","v":""}]
[null,{"$f":"Setup!$B$7","v":"Α16"},{"$f":"QD!L9","v":""}," ",{"$f":"QD!L11","v":""}]
[null,{"$f":"Setup!$B$7","v":"Α16"},{"$f":"QD!L13","v":""}," ",{"$f":"QD!L15","v":""}]
[null,{"$f":"Setup!$B$7","v":"Α16"},{"$f":"QD!L17","v":""}," ",{"$f":"QD!L19","v":""}]
["όχι πριν",{"$f":"Setup!$B$7","v":"Α16"},{"$f":"QD!L21","v":""}," ",{"$f":"QD!L23","v":""}]
[null,{"$f":"Setup!$B$7","v":"Α16"},{"$f":"QD!L25","v":""}," ",{"$f":"QD!L27","v":""}]
[null,{"$f":"Setup!$B$7","v":"Α16"},{"$f":"QD!L29","v":""}," ",{"$f":"QD!L31","v":""}]
[null,{"$f":"Setup!$B$7","v":"Α16"},{"$f":"QD!L33","v":""}," ",{"$f":"QD!L35","v":""}]
[]
[]
[]
["Πρόγραμμα αγώνων Κ.Τ.",null,null,null,"Round 1"]
["ΩΡΑ","Κτγρ.","Αθλητής-Σύλλογος",null,"Αθλητής-Σύλλογος"]
["Έναρξη",{"$f":"Setup!$B$7","v":"Α16"},{"$f":"IF(OR(MD!J5=\"bye\",MD!J5=\"LWD\"),\"\",CONCATENATE(LEFT(MD!J5,FIND(\" \",MD!J5)+1),\" (\",MD!L5,\")\"))","v":"ΚΩΣΤΑΡΑΣ Π (Ο.Α.ΠΕΤΡΟΥΠΟΛΗΣ)"},{"$f":"IF(OR(C38=\"\",E38=\"\"),\" \",\"-\")","v":" "},{"$f":"IF(OR(MD!J6=\"bye\",MD!J6=\"LWD\"), \"\", CONCATENATE(LEFT(MD!J6,FIND(\" \",MD!J6)+1),\" (\",MD!L6,\")\"))","v":""}]
[null,{"$f":"Setup!$B$7","v":"Α16"},{"$f":"IF(OR(MD!J7=\"bye\",MD!J7=\"LWD\"),\"\",CONCATENATE(LEFT(MD!J7,FIND(\" \",MD!J7)+1),\" (\",MD!L7,\")\"))","v":"ΚΡΑΣΟΥΔΑΚΗΣ Ι (Ο.Α.ΧΑΝΙΩΝ)"},"-",{"$f":"IF(OR(MD!J8=\"bye\",MD!J8=\"LWD\"), \"\", CONCATENATE(LEFT(MD!J8,FIND(\" \",MD!J8)+1),\" (\",MD!L8,\")\"))","v":"ΚΥΡΙΑΚΑΚΗΣ-ΜΕΣΣΑΡΙΤΑΚΗΣ Γ (ΗΡΑΚΛΕΙΟ Ο.Α.& Α.)"}]
[null,{"$f":"Setup!$B$7","v":"Α16"},{"$f":"IF(OR(MD!J9=\"bye\",MD!J9=\"LWD\"),\"\",CONCATENATE(LEFT(MD!J9,FIND(\" \",MD!J9)+1),\" (\",MD!L9,\")\"))","v":"ΚΑΪΜΑΡΑΣ Χ (Α.Κ.Α.ΜΑΡΑΘΩΝΑ)"},"-",{"$f":"IF(OR(MD!J10=\"bye\",MD!J10=\"LWD\"), \"\", CONCATENATE(LEFT(MD!J10,FIND(\" \",MD!J10)+1),\" (\",MD!L10,\")\"))","v":"ΠΑΤΕΡΑΣ Δ (Α.Ο.ΤΑΤΟΪΟΥ)"}]
[null,{"$f":"Setup!$B$7","v":"Α16"},{"$f":"IF(OR(MD!J11=\"bye\",MD!J11=\"LWD\"),\"\",CONCATENATE(LEFT(MD!J11,FIND(\" \",MD!J11)+1),\" (\",MD!L11,\")\"))","v":""}," ",{"$f":"IF(OR(MD!J12=\"bye\",MD!J12=\"LWD\"), \"\", CONCATENATE(LEFT(MD!J12,FIND(\" \",MD!J12)+1),\" (\",MD!L12,\")\"))","v":"ΑΡΕΤΑΚΗΣ Ι (Ο.Α.ΧΑΝΙΩΝ)"}]
["όχι πριν",{"$f":"Setup!$B$7","v":"Α16"},{"$f":"IF(OR(MD!J13=\"bye\",MD!J13=\"LWD\"),\"\",CONCATENATE(LEFT(MD!J13,FIND(\" \",MD!J13)+1),\" (\",MD!L13,\")\"))","v":"ΝΑΟΥΜ Σ (Ο.Α.ΧΑΝΙΩΝ)"}," ",{"$f":"IF(OR(MD!J14=\"bye\",MD!J14=\"LWD\"), \"\", CONCATENATE(LEFT(MD!J14,FIND(\" \",MD!J14)+1),\" (\",MD!L14,\")\"))","v":""}]
[null,{"$f":"Setup!$B$7","v":"Α16"},{"$f":"IF(OR(MD!J15=\"bye\",MD!J15=\"LWD\"),\"\",CONCATENATE(LEFT(MD!J15,FIND(\" \",MD!J15)+1),\" (\",MD!L15,\")\"))","v":"ΜΑΝΟΥΣΑΚΗΣ Κ (ΗΡΑΚΛΕΙΟ Ο.Α.& Α.)"},"-",{"$f":"IF(OR(MD!J16=\"bye\",MD!J16=\"LWD\"), \"\", CONCATENATE(LEFT(MD!J16,FIND(\" \",MD!J16)+1),\" (\",MD!L16,\")\"))","v":"ΣΤΑΥΡΟΥΛΑΚΗΣ Γ (ΗΡΑΚΛΕΙΟ Ο.Α.& Α.)"}]
[null,{"$f":"Setup!$B$7","v":"Α16"},{"$f":"IF(OR(MD!J17=\"bye\",MD!J17=\"LWD\"),\"\",CONCATENATE(LEFT(MD!J17,FIND(\" \",MD!J17)+1),\" (\",MD!L17,\")\"))","v":"ΓΙΑΚΟΥΜΑΚΗΣ Ι (Ο.Α.ΧΑΝΙΩΝ)"},"-",{"$f":"IF(OR(MD!J18=\"bye\",MD!J18=\"LWD\"), \"\", CONCATENATE(LEFT(MD!J18,FIND(\" \",MD!J18)+1),\" (\",MD!L18,\")\"))","v":"ΠΑΡΑΣΚΕΥΑΣ Μ (Α.Π.Μ.Σ.ΑΣΚΗΣΗ ΗΡΑΚΛΕΙΟΥ)"}]
[null,{"$f":"Setup!$B$7","v":"Α16"},{"$f":"IF(OR(MD!J19=\"bye\",MD!J19=\"LWD\"),\"\",CONCATENATE(LEFT(MD!J19,FIND(\" \",MD!J19)+1),\" (\",MD!L19,\")\"))","v":"ΑΓΓΕΛΟΠΟΥΛΟΣ Μ (ΠΕΥΚΗ Γ.ΚΑΛΟΒΕΛΩΝΗΣ)"},"-",{"$f":"IF(OR(MD!J20=\"bye\",MD!J20=\"LWD\"), \"\", CONCATENATE(LEFT(MD!J20,FIND(\" \",MD!J20)+1),\" (\",MD!L20,\")\"))","v":"ΦΡΙΣΗΡΑΣ Σ (Ο.Α.ΑΘΛΗΤ.ΠΑΙΔΕΙΑ)"}]
["όχι πριν",{"$f":"Setup!$B$7","v":"Α16"},{"$f":"IF(OR(MD!J21=\"bye\",MD!J21=\"LWD\"),\"\",CONCATENATE(LEFT(MD!J21,FIND(\" \",MD!J21)+1),\" (\",MD!L21,\")\"))","v":"ΠΑΧΑΚΗΣ Ν (Ο.Α.ΑΘΗΝΩΝ)"}," ",{"$f":"IF(OR(MD!J22=\"bye\",MD!J22=\"LWD\"), \"\", CONCATENATE(LEFT(MD!J22,FIND(\" \",MD!J22)+1),\" (\",MD!L22,\")\"))","v":""}]
[null,{"$f":"Setup!$B$7","v":"Α16"},{"$f":"IF(OR(MD!J23=\"bye\",MD!J23=\"LWD\"),\"\",CONCATENATE(LEFT(MD!J23,FIND(\" \",MD!J23)+1),\" (\",MD!L23,\")\"))","v":"ΚΡΟΝΤΗΡΑΣ Α (ΗΡΑΚΛΕΙΟ Ο.Α.& Α.)"},"-",{"$f":"IF(OR(MD!J24=\"bye\",MD!J24=\"LWD\"), \"\", CONCATENATE(LEFT(MD!J24,FIND(\" \",MD!J24)+1),\" (\",MD!L24,\")\"))","v":"ΚΟΥΚΟΥΛΙΘΡΑΣ Ι (Ο.Α.ΚΕΡΑΤΣΙΝΙΟΥ)"}]
[null,{"$f":"Setup!$B$7","v":"Α16"},{"$f":"IF(OR(MD!J25=\"bye\",MD!J25=\"LWD\"),\"\",CONCATENATE(LEFT(MD!J25,FIND(\" \",MD!J25)+1),\" (\",MD!L25,\")\"))","v":"ΤΣΟΜΛΕΚΤΣΟΓΛΟΥ Ν (Α.Ο.Α.ΦΙΛΟΘΕΗΣ)"},"-",{"$f":"IF(OR(MD!J26=\"bye\",MD!J26=\"LWD\"), \"\", CONCATENATE(LEFT(MD!J26,FIND(\" \",MD!J26)+1),\" (\",MD!L26,\")\"))","v":"ΣΑΚΕΛΛΑΡΙΔΗΣ Μ (Ο.Α.ΑΓΙΑΣ ΠΑΡΑΣΚΕΥΗΣ)"}]
[null,{"$f":"Setup!$B$7","v":"Α16"},{"$f":"IF(OR(MD!J27=\"bye\",MD!J27=\"LWD\"),\"\",CONCATENATE(LEFT(MD!J27,FIND(\" \",MD!J27)+1),\" (\",MD!L27,\")\"))","v":""}," ",{"$f":"IF(OR(MD!J28=\"bye\",MD!J28=\"LWD\"), \"\", CONCATENATE(LEFT(MD!J28,FIND(\" \",MD!J28)+1),\" (\",MD!L28,\")\"))","v":"ΠΙΤΣΙΝΗΣ Δ (Ο.Α.ΚΕΡΑΤΣΙΝΙΟΥ)"}]
["όχι πριν",{"$f":"Setup!$B$7","v":"Α16"},{"$f":"IF(OR(MD!J29=\"bye\",MD!J29=\"LWD\"),\"\",CONCATENATE(LEFT(MD!J29,FIND(\" \",MD!J29)+1),\" (\",MD!L29,\")\"))","v":"ΣΗΜΑΙΟΦΟΡΙΔΗΣ Χ (ΠΕΥΚΗ Γ.ΚΑΛΟΒΕΛΩΝΗΣ)"},"-",{"$f":"IF(OR(MD!J30=\"bye\",MD!J30=\"LWD\"), \"\", CONCATENATE(LEFT(MD!J30,FIND(\" \",MD!J30)+1),\" (\",MD!L30,\")\"))","v":"ΚΟΚΟΤΣΑΚΗΣ Α (Α.Ο.Α.ΗΛΙΟΥΠΟΛΗΣ)"}]
[null,{"$f":"Setup!$B$7","v":"Α16"},{"$f":"IF(OR(MD!J31=\"bye\",MD!J31=\"LWD\"),\"\",CONCATENATE(LEFT(MD!J31,FIND(\" \",MD!J31)+1),\" (\",MD!L31,\")\"))","v":"ΚΟΝΤΟΓΙΩΡΓΑΚΗΣ Ι (Ο.Α.ΣΗΤΕΙΑΣ)"},"-",{"$f":"IF(OR(MD!J32=\"bye\",MD!J32=\"LWD\"), \"\", CONCATENATE(LEFT(MD!J32,FIND(\" \",MD!J32)+1),\" (\",MD!L32,\")\"))","v":"ΝΙΚΟΛΑΚΑΚΗΣ Ι (ΗΡΑΚΛΕΙΟ Ο.Α.& Α.)"}]
[null,{"$f":"Setup!$B$7","v":"Α16"},{"$f":"IF(OR(MD!J33=\"bye\",MD!J33=\"LWD\"),\"\",CONCATENATE(LEFT(MD!J33,FIND(\" \",MD!J33)+1),\" (\",MD!L33,\")\"))","v":"ΠΗΛΙΟΥΝΗΣ Μ (Ο.Α. ΑΘΗΝΩΝ)"},"-",{"$f":"IF(OR(MD!J34=\"bye\",MD!J34=\"LWD\"), \"\", CONCATENATE(LEFT(MD!J34,FIND(\" \",MD!J34)+1),\" (\",MD!L34,\")\"))","v":"ΠΑΠΑΚΥΡΙΑΚΟΥ Μ (Α.Ο.ΒΑΡΗΣ ΑΝΑΓΥΡΟΥΣ)"}]
[null,{"$f":"Setup!$B$7","v":"Α16"},{"$f":"IF(OR(MD!J35=\"bye\",MD!J35=\"LWD\"),\"\",CONCATENATE(LEFT(MD!J35,FIND(\" \",MD!J35)+1),\" (\",MD!L35,\")\"))","v":""}," ",{"$f":"IF(OR(MD!J36=\"bye\",MD!J36=\"LWD\"), \"\", CONCATENATE(LEFT(MD!J36,FIND(\" \",MD!J36)+1),\" (\",MD!L36,\")\"))","v":"ΚΑΠΙΡΗΣ Σ (Α.Ο.Α.ΗΛΙΟΥΠΟΛΗΣ)"}]
[]
["Πρόγραμμα αγώνων Κ.Τ.",null,null,null,"Round 2"]
["ΩΡΑ","Κτγρ.","Αθλητής-Σύλλογος",null,"Αθλητής-Σύλλογος"]
["Έναρξη",{"$f":"Setup!$B$7","v":"Α16"},{"$f":"IF(MD!M5=\"\", \"\", IF(MD!M5=1, CONCATENATE(LEFT(MD!J5,FIND(\" \",MD!J5)+1),\" (\",MD!L5,\")\"),CONCATENATE(LEFT(MD!J6,FIND(\" \",MD!J6)+1),\" (\",MD!L6,\")\")))","v":"ΚΩΣΤΑΡΑΣ Π (Ο.Α.ΠΕΤΡΟΥΠΟΛΗΣ)"},{"$f":"IF(OR(C57=\"\",E57=\"\"),\" \",\"-\")","v":"-"},{"$f":"IF(MD!M7=\"\", \"\", IF(MD!M7=1, CONCATENATE(LEFT(MD!J7,FIND(\" \",MD!J7)+1),\" (\",MD!L7,\")\"),CONCATENATE(LEFT(MD!J8,FIND(\" \",MD!J8)+1),\" (\",MD!L8,\")\")))","v":"ΚΥΡΙΑΚΑΚΗΣ-ΜΕΣΣΑΡΙΤΑΚΗΣ Γ (ΗΡΑΚΛΕΙΟ Ο.Α.& Α.)"}]
[null,{"$f":"Setup!$B$7","v":"Α16"},{"$f":"IF(MD!M9=\"\", \"\", IF(MD!M9=1, CONCATENATE(LEFT(MD!J9,FIND(\" \",MD!J9)+1),\" (\",MD!L9,\")\"),CONCATENATE(LEFT(MD!J10,FIND(\" \",MD!J10)+1),\" (\",MD!L10,\")\")))","v":"ΚΑΪΜΑΡΑΣ Χ (Α.Κ.Α.ΜΑΡΑΘΩΝΑ)"},"-",{"$f":"IF(MD!M11=\"\", \"\", IF(MD!M11=1, CONCATENATE(LEFT(MD!J11,FIND(\" \",MD!J11)+1),\" (\",MD!L11,\")\"),CONCATENATE(LEFT(MD!J12,FIND(\" \",MD!J12)+1),\" (\",MD!L12,\")\")))","v":"ΑΡΕΤΑΚΗΣ Ι (Ο.Α.ΧΑΝΙΩΝ)"}]
[null,{"$f":"Setup!$B$7","v":"Α16"},{"$f":"IF(MD!M13=\"\", \"\", IF(MD!M13=1, CONCATENATE(LEFT(MD!J13,FIND(\" \",MD!J13)+1),\" (\",MD!L13,\")\"),CONCATENATE(LEFT(MD!J14,FIND(\" \",MD!J14)+1),\" (\",MD!L14,\")\")))","v":"ΝΑΟΥΜ Σ (Ο.Α.ΧΑΝΙΩΝ)"},"-",{"$f":"IF(MD!M15=\"\", \"\", IF(MD!M15=1, CONCATENATE(LEFT(MD!J15,FIND(\" \",MD!J15)+1),\" (\",MD!L15,\")\"),CONCATENATE(LEFT(MD!J16,FIND(\" \",MD!J16)+1),\" (\",MD!L16,\")\")))","v":"ΜΑΝΟΥΣΑΚΗΣ Κ (ΗΡΑΚΛΕΙΟ Ο.Α.& Α.)"}]
[null,{"$f":"Setup!$B$7","v":"Α16"},{"$f":"IF(MD!M17=\"\", \"\", IF(MD!M17=1, CONCATENATE(LEFT(MD!J17,FIND(\" \",MD!J17)+1),\" (\",MD!L17,\")\"),CONCATENATE(LEFT(MD!J18,FIND(\" \",MD!J18)+1),\" (\",MD!L18,\")\")))","v":"ΓΙΑΚΟΥΜΑΚΗΣ Ι (Ο.Α.ΧΑΝΙΩΝ)"},"-",{"$f":"IF(MD!M19=\"\", \"\", IF(MD!M19=1, CONCATENATE(LEFT(MD!J19,FIND(\" \",MD!J19)+1),\" (\",MD!L19,\")\"),CONCATENATE(LEFT(MD!J20,FIND(\" \",MD!J20)+1),\" (\",MD!L20,\")\")))","v":"ΦΡΙΣΗΡΑΣ Σ (Ο.Α.ΑΘΛΗΤ.ΠΑΙΔΕΙΑ)"}]
["όχι πριν",{"$f":"Setup!$B$7","v":"Α16"},{"$f":"IF(MD!M21=\"\", \"\", IF(MD!M21=1, CONCATENATE(LEFT(MD!J21,FIND(\" \",MD!J21)+1),\" (\",MD!L21,\")\"),CONCATENATE(LEFT(MD!J22,FIND(\" \",MD!J22)+1),\" (\",MD!L22,\")\")))","v":"ΠΑΧΑΚΗΣ Ν (Ο.Α.ΑΘΗΝΩΝ)"},"-",{"$f":"IF(MD!M23=\"\", \"\", IF(MD!M23=1, CONCATENATE(LEFT(MD!J23,FIND(\" \",MD!J23)+1),\" (\",MD!L23,\")\"),CONCATENATE(LEFT(MD!J24,FIND(\" \",MD!J24)+1),\" (\",MD!L24,\")\")))","v":"ΚΟΥΚΟΥΛΙΘΡΑΣ Ι (Ο.Α.ΚΕΡΑΤΣΙΝΙΟΥ)"}]
[null,{"$f":"Setup!$B$7","v":"Α16"},{"$f":"IF(MD!M25=\"\", \"\", IF(MD!M25=1, CONCATENATE(LEFT(MD!J25,FIND(\" \",MD!J25)+1),\" (\",MD!L25,\")\"),CONCATENATE(LEFT(MD!J26,FIND(\" \",MD!J26)+1),\" (\",MD!L26,\")\")))","v":"ΣΑΚΕΛΛΑΡΙΔΗΣ Μ (Ο.Α.ΑΓΙΑΣ ΠΑΡΑΣΚΕΥΗΣ)"},"-",{"$f":"IF(MD!M27=\"\", \"\", IF(MD!M27=1, CONCATENATE(LEFT(MD!J27,FIND(\" \",MD!J27)+1),\" (\",MD!L27,\")\"),CONCATENATE(LEFT(MD!J28,FIND(\" \",MD!J28)+1),\" (\",MD!L28,\")\")))","v":"ΠΙΤΣΙΝΗΣ Δ (Ο.Α.ΚΕΡΑΤΣΙΝΙΟΥ)"}]
[null,{"$f":"Setup!$B$7","v":"Α16"},{"$f":"IF(MD!M29=\"\", \"\", IF(MD!M29=1, CONCATENATE(LEFT(MD!J29,FIND(\" \",MD!J29)+1),\" (\",MD!L29,\")\"),CONCATENATE(LEFT(MD!J30,FIND(\" \",MD!J30)+1),\" (\",MD!L30,\")\")))","v":"ΣΗΜΑΙΟΦΟΡΙΔΗΣ Χ (ΠΕΥΚΗ Γ.ΚΑΛΟΒΕΛΩΝΗΣ)"},"-",{"$f":"IF(MD!M31=\"\", \"\", IF(MD!M31=1, CONCATENATE(LEFT(MD!J31,FIND(\" \",MD!J31)+1),\" (\",MD!L31,\")\"),CONCATENATE(LEFT(MD!J32,FIND(\" \",MD!J32)+1),\" (\",MD!L32,\")\")))","v":"ΝΙΚΟΛΑΚΑΚΗΣ Ι (ΗΡΑΚΛΕΙΟ Ο.Α.& Α.)"}]
[null,{"$f":"Setup!$B$7","v":"Α16"},{"$f":"IF(MD!M33=\"\", \"\", IF(MD!M33=1, CONCATENATE(LEFT(MD!J33,FIND(\" \",MD!J33)+1),\" (\",MD!L33,\")\"),CONCATENATE(LEFT(MD!J34,FIND(\" \",MD!J34)+1),\" (\",MD!L34,\")\")))","v":"ΠΗΛΙΟΥΝΗΣ Μ (Ο.Α. ΑΘΗΝΩΝ)"},"-",{"$f":"IF(MD!M35=\"\", \"\", IF(MD!M35=1, CONCATENATE(LEFT(MD!J35,FIND(\" \",MD!J35)+1),\" (\",MD!L35,\")\"),CONCATENATE(LEFT(MD!J36,FIND(\" \",MD!J36)+1),\" (\",MD!L36,\")\")))","v":"ΚΑΠΙΡΗΣ Σ (Α.Ο.Α.ΗΛΙΟΥΠΟΛΗΣ)"}]
[]
[]
[]
[]
[]
[]
[]
[]
["Πρόγραμμα αγώνων Κ.Τ. (md16)",null,null,null,"Round 1"]
["ΩΡΑ","Κτγρ.","Αθλητής-Σύλλογος",null,"Αθλητής-Σύλλογος"]
["Έναρξη",{"$f":"Setup!$B$7","v":"Α16"},{"$f":"IF(OR('MD16'!J5=\"bye\",'MD16'!J5=\"LWD\"),\"\",CONCATENATE(LEFT('MD16'!J5,FIND(\" \",'MD16'!J5)+1),\" (\",'MD16'!L5,\")\"))","v":""},{"$f":"IF(OR(C75=\"\",E75=\"\"),\" \",\"-\")","v":" "},{"$f":"IF(OR('MD16'!J6=\"bye\",'MD16'!J6=\"LWD\"), \"\", CONCATENATE(LEFT('MD16'!J6,FIND(\" \",'MD16'!J6)+1),\" (\",'MD16'!L6,\")\"))","v":""}]
[null,{"$f":"Setup!$B$7","v":"Α16"},{"$f":"IF(OR('MD16'!J7=\"bye\",'MD16'!J7=\"LWD\"),\"\",CONCATENATE(LEFT('MD16'!J7,FIND(\" \",'MD16'!J7)+1),\" (\",'MD16'!L7,\")\"))","v":""}," ",{"$f":"IF(OR('MD16'!J8=\"bye\",'MD16'!J8=\"LWD\"), \"\", CONCATENATE(LEFT('MD16'!J8,FIND(\" \",'MD16'!J8)+1),\" (\",'MD16'!L8,\")\"))","v":""}]
[null,{"$f":"Setup!$B$7","v":"Α16"},{"$f":"IF(OR('MD16'!J9=\"bye\",'MD16'!J9=\"LWD\"),\"\",CONCATENATE(LEFT('MD16'!J9,FIND(\" \",'MD16'!J9)+1),\" (\",'MD16'!L9,\")\"))","v":""}," ",{"$f":"IF(OR('MD16'!J10=\"bye\",'MD16'!J10=\"LWD\"), \"\", CONCATENATE(LEFT('MD16'!J10,FIND(\" \",'MD16'!J10)+1),\" (\",'MD16'!L10,\")\"))","v":""}]
[null,{"$f":"Setup!$B$7","v":"Α16"},{"$f":"IF(OR('MD16'!J11=\"bye\",'MD16'!J11=\"LWD\"),\"\",CONCATENATE(LEFT('MD16'!J11,FIND(\" \",'MD16'!J11)+1),\" (\",'MD16'!L11,\")\"))","v":""}," ",{"$f":"IF(OR('MD16'!J12=\"bye\",'MD16'!J12=\"LWD\"), \"\", CONCATENATE(LEFT('MD16'!J12,FIND(\" \",'MD16'!J12)+1),\" (\",'MD16'!L12,\")\"))","v":""}]
["όχι πριν",{"$f":"Setup!$B$7","v":"Α16"},{"$f":"IF(OR('MD16'!J13=\"bye\",'MD16'!J13=\"LWD\"),\"\",CONCATENATE(LEFT('MD16'!J13,FIND(\" \",'MD16'!J13)+1),\" (\",'MD16'!L13,\")\"))","v":""}," ",{"$f":"IF(OR('MD16'!J14=\"bye\",'MD16'!J14=\"LWD\"), \"\", CONCATENATE(LEFT('MD16'!J14,FIND(\" \",'MD16'!J14)+1),\" (\",'MD16'!L14,\")\"))","v":""}]
[null,{"$f":"Setup!$B$7","v":"Α16"},{"$f":"IF(OR('MD16'!J15=\"bye\",'MD16'!J15=\"LWD\"),\"\",CONCATENATE(LEFT('MD16'!J15,FIND(\" \",'MD16'!J15)+1),\" (\",'MD16'!L15,\")\"))","v":""}," ",{"$f":"IF(OR('MD16'!J16=\"bye\",'MD16'!J16=\"LWD\"), \"\", CONCATENATE(LEFT('MD16'!J16,FIND(\" \",'MD16'!J16)+1),\" (\",'MD16'!L16,\")\"))","v":""}]
[null,{"$f":"Setup!$B$7","v":"Α16"},{"$f":"IF(OR('MD16'!J17=\"bye\",'MD16'!J17=\"LWD\"),\"\",CONCATENATE(LEFT('MD16'!J17,FIND(\" \",'MD16'!J17)+1),\" (\",'MD16'!L17,\")\"))","v":""}," ",{"$f":"IF(OR('MD16'!J18=\"bye\",'MD16'!J18=\"LWD\"), \"\", CONCATENATE(LEFT('MD16'!J18,FIND(\" \",'MD16'!J18)+1),\" (\",'MD16'!L18,\")\"))","v":""}]
[null,{"$f":"Setup!$B$7","v":"Α16"},{"$f":"IF(OR('MD16'!J19=\"bye\",'MD16'!J19=\"LWD\"),\"\",CONCATENATE(LEFT('MD16'!J19,FIND(\" \",'MD16'!J19)+1),\" (\",'MD16'!L19,\")\"))","v":""}," ",{"$f":"IF(OR('MD16'!J20=\"bye\",'MD16'!J20=\"LWD\"), \"\", CONCATENATE(LEFT('MD16'!J20,FIND(\" \",'MD16'!J20)+1),\" (\",'MD16'!L20,\")\"))","v":""}]
[]
["Πρόγραμμα αγώνων Κ.Τ. (md16)",null,null,null,"Round 2"]
["ΩΡΑ","Κτγρ.","Αθλητής-Σύλλογος",null,"Αθλητής-Σύλλογος"]
["Έναρξη",{"$f":"Setup!$B$7","v":"Α16"},{"$f":"IF('MD16'!M5=\"\", \"\", IF('MD16'!M5=1, CONCATENATE(LEFT('MD16'!J5,FIND(\" \",'MD16'!J5)+1),\" (\",'MD16'!L5,\")\"),CONCATENATE(LEFT('MD16'!J6,FIND(\" \",'MD16'!J6)+1),\" (\",'MD16'!L6,\")\")))","v":""},{"$f":"IF(OR(C86=\"\",E86=\"\"),\" \",\"-\")","v":" "},{"$f":"IF('MD16'!M7=\"\", \"\", IF('MD16'!M7=1, CONCATENATE(LEFT('MD16'!J7,FIND(\" \",'MD16'!J7)+1),\" (\",'MD16'!L7,\")\"),CONCATENATE(LEFT('MD16'!J8,FIND(\" \",'MD16'!J8)+1),\" (\",'MD16'!L8,\")\")))","v":""}]
[null,{"$f":"Setup!$B$7","v":"Α16"},{"$f":"IF('MD16'!M9=\"\", \"\", IF('MD16'!M9=1, CONCATENATE(LEFT('MD16'!J9,FIND(\" \",'MD16'!J9)+1),\" (\",'MD16'!L9,\")\"),CONCATENATE(LEFT('MD16'!J10,FIND(\" \",'MD16'!J10)+1),\" (\",'MD16'!L10,\")\")))","v":""},{"$f":"IF(OR(C87=\"\",E87=\"\"),\" \",\"-\")","v":" "},{"$f":"IF('MD16'!M11=\"\", \"\", IF('MD16'!M11=1, CONCATENATE(LEFT('MD16'!J11,FIND(\" \",'MD16'!J11)+1),\" (\",'MD16'!L11,\")\"),CONCATENATE(LEFT('MD16'!J12,FIND(\" \",'MD16'!J12)+1),\" (\",'MD16'!L12,\")\")))","v":""}]
[null,{"$f":"Setup!$B$7","v":"Α16"},{"$f":"IF('MD16'!M13=\"\", \"\", IF('MD16'!M13=1, CONCATENATE(LEFT('MD16'!J13,FIND(\" \",'MD16'!J13)+1),\" (\",'MD16'!L13,\")\"),CONCATENATE(LEFT('MD16'!J14,FIND(\" \",'MD16'!J14)+1),\" (\",'MD16'!L14,\")\")))","v":""},{"$f":"IF(OR(C88=\"\",E88=\"\"),\" \",\"-\")","v":" "},{"$f":"IF('MD16'!M15=\"\", \"\", IF('MD16'!M15=1, CONCATENATE(LEFT('MD16'!J15,FIND(\" \",'MD16'!J15)+1),\" (\",'MD16'!L15,\")\"),CONCATENATE(LEFT('MD16'!J16,FIND(\" \",'MD16'!J16)+1),\" (\",'MD16'!L16,\")\")))","v":""}]
[null,{"$f":"Setup!$B$7","v":"Α16"},{"$f":"IF('MD16'!M17=\"\", \"\", IF('MD16'!M17=1, CONCATENATE(LEFT('MD16'!J17,FIND(\" \",'MD16'!J17)+1),\" (\",'MD16'!L17,\")\"),CONCATENATE(LEFT('MD16'!J18,FIND(\" \",'MD16'!J18)+1),\" (\",'MD16'!L18,\")\")))","v":""},{"$f":"IF(OR(C89=\"\",E89=\"\"),\" \",\"-\")","v":" "},{"$f":"IF('MD16'!M19=\"\", \"\", IF('MD16'!M19=1, CONCATENATE(LEFT('MD16'!J19,FIND(\" \",'MD16'!J19)+1),\" (\",'MD16'!L19,\")\"),CONCATENATE(LEFT('MD16'!J20,FIND(\" \",'MD16'!J20)+1),\" (\",'MD16'!L20,\")\")))","v":""}]
[]
[]
[]
["Don't Change this Worksheet !"]

{"sheet":"tmp","index":11,"n_rows":34,"n_cols":24,"rows_kept":34,"cut":false,"hidden":false,"merged":[[31,9,33,9],[31,16,33,16],[20,8,22,8],[20,16,22,16],[25,9,25,22],[26,9,26,10],[26,16,26,17],[27,9,30,9],[27,16,30,16],[11,8,11,23],[12,16,12,17],[13,8,16,8],[13,16,16,16],[17,8,19,8],[17,16,19,16],[0,8,0,23],[1,16,1,17],[2,8,5,8],[2,16,5,16],[6,8,8,8],[6,16,8,16]]}
["RndIndx","random","FixRandom",null,"α/α","seed","ByeOrder",null,"ΠΡΟΚΡΙΜΑΤΙΚΑ E1, E2 (32 για 8)"]
[1,{"$f":"RAND()/25","v":8.5763732708090852E-3},2.4457981489311383E-2,null,1,1,null,null,null,null,"17-32","9-16","5-8","3-4","2ος","1ος",null,null,"17-32","9-16","5-8","3-4","2ος","1ος"]
[2,{"$f":"RAND()/25","v":1.1354254335349125E-2},4.0646988542447282E-3,null,2,null,1,null,"E1","E1-12",1,2,2,0,0,0,"E1","E1-12",1,1,0,0,0,0]
[3,{"$f":"RAND()/25","v":3.755889567764964E-2},3.5309102256323867E-2,null,3,null,null,null,null,"E1-14",3,4,4,0,0,0,null,"E1-14",3,1,0,0,0,0]
[4,{"$f":"RAND()/25","v":1.1232801816760372E-2},8.2871600467021092E-3,null,4,null,15,null,null,"E1-16",6,8,8,0,0,0,null,"E1-16",6,2,0,0,0,0]
[5,{"$f":"RAND()/25","v":4.5684177168142173E-3},7.5961168885925901E-3,null,5,null,null,null,null,"E1-18",7.5,10,10,null,null,null,null,"E1-18",7.5,2.5,0,0,0,0]
[6,2.0807149747017809E-2,1.9135796487158369E-2,null,6,null,9,null,"E2","E2-12",0.3,0.5,0.5,0,0,0,"E2","E2-12",0.3,0.2,0,0,0,0]
[7,2.1618181365462875E-2,5.3108638688796807E-3,null,7,null,5,null,null,"E2-14",1,2,2,0,0,0,null,"E2-14",1,1,0,0,0,0]
[8,4.7042903771409071E-4,2.3776747078706278E-2,null,8,5,null,null,null,"E2-16",2,4,4,0,0,0,null,"E2-16",2,2,0,0,0,0]
[9,1.0027120024316582E-2,2.8821068867363912E-2,null,9,3]
[10,3.2725394685120805E-2,1.8544124121176363E-2,null,10,null,3]
[11,2.2830643798488294E-2,1.4727294567760652E-3,null,11,null,null,null,"ΚΥΡΙΩΣ ΤΑΜΠΛΟ E1, E2 & E3"]
[12,2.4697680336441107E-2,5.9601648200855806E-3,null,12,null,13,null,null,null,"17-32","9-16","5-8","3-4","2ος","1ος",null,null,"17-32","9-16","5-8","3-4","2ος","1ος"]
[13,2.3441868684482944E-2,4.3846470783480114E-3,null,13,null,null,null,"E1","E1-12",7,10,14,21,35,42,"E1","E1-12",7,3,4,7,14,7]
[14,3.4086253051349741E-2,5.8602699016837786E-4,null,14,null,11,null,null,"E1-14",10,15,20,30,50,60,null,"E1-14",10,5,5,10,20,10]
[15,3.0565731383786689E-2,1.5939852665617132E-2,null,15,null,7,null,null,"E1-16",20,30,40,60,100,120,null,"E1-16",20,10,10,20,40,20]
[16,3.3161288873615212E-2,3.712715494688941E-2,null,16,6,null,null,null,"E1-18",25,37,50,75,125,150,null,"E1-18",25,12,13,25,50,25]
[17,1.3893234023467683E-2,3.6143213527570953E-2,null,17,7,null,null,"E2","E2-12",4,5,7,10,15,18,"E2","E2-12",4,1,2,3,5,3]
[18,1.317577795932781E-2,2.2537002543092068E-2,null,18,null,6,null,null,"E2-14",5,8,10,15,25,30,null,"E2-14",5,3,2,5,10,5]
[19,2.3545068271939727E-2,5.826776003653329E-3,null,19,null,null,null,null,"E2-16",10,15,20,30,50,60,null,"E2-16",10,5,5,10,20,10]
[20,2.5994113206910825E-2,1.3215640213968829E-2,null,20,null,12,null,"E3","E3-12",0.5,2,3,4,7,8,"E3","E3-12",0.5,1.5,1,1,3,1]
[21,2.3718740274840291E-2,5.744889394460522E-3,null,21,null,null,null,null,"E3-14",2,3,4,6,10,12,null,"E3-14",2,1,1,2,4,2]
[22,3.6373016584677342E-2,2.7476962414815835E-2,null,22,null,14,null,null,"E3-16",4,6,8,12,20,24,null,"E3-16",4,2,2,4,8,4]
[23,3.2023156028417044E-2,3.9275071678805847E-2,null,23,null,4]
[24,2.3064934312240482E-2,2.2161363530340098E-2,null,24,4]
[25,1.8270136707959964E-2,1.2876077784495248E-2,null,25,8,null,null,null,"ΔΙΠΛΑ E1, E2"]
[26,1.5831001212694068E-2,3.8645904157832298E-2,null,26,null,8,null,null,null,null,"9-16","5-8","3-4","2ος","1ος",null,null,"9-16","5-8","3-4","2ος","1ος"]
[27,9.8713803694752047E-3,2.4613119562463516E-2,null,27,null,null,null,null,"E1","E1-12",3,4,5,9,11,"E1","E1-12",3,1,1,4,2]
[28,1.5445146753245709E-3,1.4628744235009501E-2,null,28,null,10,null,null,null,"E1-14",4,5,8,13,15,null,"E1-14",4,1,3,5,2]
[29,2.5986201649552072E-2,1.1978541603131436E-2,null,29,null,null,null,null,null,"E1-16",8,10,15,25,30,null,"E1-16",8,2,5,10,5]
[30,2.4968690258685199E-4,1.5829326203151552E-2,null,30,null,16,null,null,null,"E1-18",9,12,19,31,37,null,"E1-18",9,3,7,12,6]
[31,1.7286898706470666E-3,4.7513255553265311E-3,null,31,null,2,null,null,"E2","E2-12",1,2,3,4,8,"E2","E2-12",1,1,1,1,4]
[32,3.2947140140931308E-2,2.7403534004256373E-2,null,32,2,null,null,null,null,"E2-14",2,3,4,6,8,null,"E2-14",2,1,1,2,2]
[null,null,null,null,null,null,null,null,null,null,"E2-16",4,6,8,12,16,null,"E2-16",4,2,2,4,4]