{"text_format":"1","workbook":"xlsx","n_sheets":8,"sheets":["Setup","DrawPrep","MD","Matches","notes","Rankings","CalcPrg","tmp"],"not_rendered":{"charts":0,"images":0,"macros":1,"external_links":0,"defined_names":4,"comments":0,"pivot_tables":0},"unopened":[],"bounds":{"document_bytes":16777216,"sheet_cells":100000,"rows_first":2000,"rows_last":500,"rows_between":2000,"halvings":0,"cell_chars":16384,"cell_head_chars":4096},"cells_cut":0,"cells_raw":0,"read":"whole","date_system":"1900"}

{"sheet":"Setup","index":0,"n_rows":31,"n_cols":8,"rows_kept":31,"cut":false,"hidden":false,"merged":[[1,3,2,3],[0,0,0,1]]}
["ΔΙΠΛΑ 16άρι ΤΑΜΠΛΟ",null,null,"Θέσεις","seed"]
[null,null,null,"3-4",{"$f":"VALUE(LEFT(F2,1))","v":3},"3 4"]
["Διοργανωτής: ","Υπ.Παιδείας",null,null,{"$f":"VALUE(RIGHT(F2,1))","v":4}]
["Τίτλος Τουρνουά: ","Σχολικό Πρωτάθλημα 2014"]
["type: "]
["Έδρα αγώνων: ","ΑΕΤ ΝΙΚΗ ΠΑΤΡΩΝ"]
["Κατηγορία: ","Αγόρια Δ",null,"0 1 2 3 4 11 5 8 14 10 15 12 6 9 7 13 "]
["Έναρξη: ","5",null,"1 2 3 4 "]
["Λήξη: ","11 Μαίου",null,"0 0 0 0 0 0 0 0 0 0 0 0 0 0 0 0 0 0 0 0 0 0 0 0 0 0 0 0 0 0 0 0 0 0 0 0 0 0 0 0 "]
["Επιδιατητής: ","Γ.Καζάνης"]
{"$rows_left_out":22}
{"sheet":"DrawPrep","index":1,"n_rows":66,"n_cols":23,"rows_kept":66,"cut":false,"hidden":false,"merged":[]}
[{"$f":"IF(Setup!B6>\" \",Setup!B3 & \", \" & Setup!B4 & \", \" & Setup!B6 & \", \" & Setup!B8 & \"-\" & Setup!B9,Setup!B3 & \", \" & Setup!B4 & \", \" & Setup!B8 & \"-\" & Setup!B9)","v":"Υπ.Παιδείας, Σχολικό Πρωτάθλημα 2014, ΑΕΤ ΝΙΚΗ ΠΑΤΡΩΝ, 5-11 Μαίου"},null,null,null,null,null,null,null,null,null,null,null,null,{"$f":"Setup!$B$7","v":"Αγόρια Δ"}]
["α/α","β-Δ","β-Μ","SortV","D>0","S>0","   Α.Μ.  ","Ονοματεπώνυμο","Σύλλογος","ptsD","ptsS","   Α.Μ.   ","Ονοματεπώνυμο","Σύλλογος","ptsD","ptsS","s1","s2","s3","s4","s5","SortPts","Rand"]
[1,{"$f":"J3+O3","v":0},{"$f":"K3+P3","v":1243.5},{"$f":"IF(E3=2,1,IF(E3=1,2,IF(F3=2,3,IF(F3=1,4,5))))","v":3},{"$f":"COUNTIF(J3,\">0\")+COUNTIF(O3,\">0\")","v":0},{"$f":"COUNTIF(K3,\">0\")+COUNTIF(P3,\">0\")","v":2},23775,{"$f":"IF($G3=\"\",\"\",VLOOKUP(Setup!$B$13&\"-\"&$G3,Rankings!$A:$E,2,FALSE))","v":"ΑΝΤΩΝΟΠΟΥΛΟΣ ΧΡΗΣΤΟΣ"},{"$f":"IF($G3=\"\",\"\",VLOOKUP(Setup!$B$13&\"-\"&$G3,Rankings!$A:$E,3,FALSE))","v":"1ο ΓΕΛ ΝΙΚΑΙΑΣ"},{"$f":"IF(COUNTIF(Rankings!$A:$A,Setup!$B$13&\"-\"&$G3)>0,VLOOKUP(Setup!$B$13&\"-\"&$G3,Rankings!$A:$E,5,FALSE),0)","v":0},{"$f":"IF(COUNTIF(Rankings!$A:$A,Setup!$B$13&\"-\"&$G3)>0,VLOOKUP(Setup!$B$13&\"-\"&$G3,Rankings!$A:$E,4,FALSE),0)","v":940},23234,{"$f":"IF($L3=\"\",\"\",VLOOKUP(Setup!$B$13&\"-\"&$L3,Rankings!$A:$E,2,FALSE))","v":"ΚΑΖΑΝΤΖΗΣ ΜΙΧΑΗΛ-ΤΟΥΒ"},{"$f":"IF($L3=\"\",\"\",VLOOKUP(Setup!$B$13&\"-\"&$L3,Rankings!$A:$E,3,FALSE))","v":"ΚΟΛΛΕΓΙΟ ΑΘΗΝΩΝ"},{"$f":"IF(COUNTIF(Rankings!$A:$A,Setup!$B$13&\"-\"&$L3)>0,VLOOKUP(Setup!$B$13&\"-\"&$L3,Rankings!$A:$E,5,FALSE),0)","v":0},{"$f":"IF(COUNTIF(Rankings!$A:$A,Setup!$B$13&\"-\"&$L3)>0,VLOOKUP(Setup!$B$13&\"-\"&$L3,Rankings!$A:$E,4,FALSE),0)","v":303.5},{"$f":"B3+W3","v":2.2323415892039181E-2},{"$f":"IF(J3>0,(B3+P3/1000+W3/1000),(B3+K3/1000+W3/1000))","v":0.94002232341589198},{"$f":"C3+W3","v":1243.5223234158921},{"$f":"C3+W3","v":1243.5223234158921},{"$f":"W3","v":2.2323415892039181E-2},{"$f":"IF(G3=\"\",0,VLOOKUP(D3,D3:U3,13+D3,FALSE))","v":1243.5223234158921},2.2323415892039181E-2]
[2,{"$f":"J4+O4","v":0},{"$f":"K4+P4","v":737.5},{"$f":"IF(E4=2,1,IF(E4=1,2,IF(F4=2,3,IF(F4=1,4,5))))","v":3},{"$f":"COUNTIF(J4,\">0\")+COUNTIF(O4,\">0\")","v":0},{"$f":"COUNTIF(K4,\">0\")+COUNTIF(P4,\">0\")","v":2},23517,{"$f":"IF($G4=\"\",\"\",VLOOKUP(Setup!$B$13&\"-\"&$G4,Rankings!$A:$E,2,FALSE))","v":"ΤΣΙΡΑΝΙΔΗΣ ΕΥΣΤΑΘΙΟΣ"},{"$f":"IF($G4=\"\",\"\",VLOOKUP(Setup!$B$13&\"-\"&$G4,Rankings!$A:$E,3,FALSE))","v":"2ο ΓΕΛ ΠΤΟΛΕΜΑΪΔΑΣ"},{"$f":"IF(COUNTIF(Rankings!$A:$A,Setup!$B$13&\"-\"&$G4)>0,VLOOKUP(Setup!$B$13&\"-\"&$G4,Rankings!$A:$E,5,FALSE),0)","v":0},{"$f":"IF(COUNTIF(Rankings!$A:$A,Setup!$B$13&\"-\"&$G4)>0,VLOOKUP(Setup!$B$13&\"-\"&$G4,Rankings!$A:$E,4,FALSE),0)","v":690},23645,{"$f":"IF($L4=\"\",\"\",VLOOKUP(Setup!$B$13&\"-\"&$L4,Rankings!$A:$E,2,FALSE))","v":"ΝΑΚΑΣ ΚΩΝΣΤΑΝΤΙΝΟΣ"},{"$f":"IF($L4=\"\",\"\",VLOOKUP(Setup!$B$13&\"-\"&$L4,Rankings!$A:$E,3,FALSE))","v":"1ο ΓΕΛ ΚΟΖΑΝΗΣ"},{"$f":"IF(COUNTIF(Rankings!$A:$A,Setup!$B$13&\"-\"&$L4)>0,VLOOKUP(Setup!$B$13&\"-\"&$L4,Rankings!$A:$E,5,FALSE),0)","v":0},{"$f":"IF(COUNTIF(Rankings!$A:$A,Setup!$B$13&\"-\"&$L4)>0,VLOOKUP(Setup!$B$13&\"-\"&$L4,Rankings!$A:$E,4,FALSE),0)","v":47.5},{"$f":"B4+W4","v":4.3046994674434763E-2},{"$f":"IF(J4>0,(B4+P4/1000+W4/1000),(B4+K4/1000+W4/1000))","v":0.69004304699467434},{"$f":"C4+W4","v":737.54304699467446},{"$f":"C4+W4","v":737.54304699467446},{"$f":"W4","v":4.3046994674434763E-2},{"$f":"IF(G4=\"\",0,VLOOKUP(D4,D4:U4,13+D4,FALSE))","v":737.54304699467446},4.3046994674434763E-2]
[3,{"$f":"J5+O5","v":0},{"$f":"K5+P5","v":619},{"$f":"IF(E5=2,1,IF(E5=1,2,IF(F5=2,3,IF(F5=1,4,5))))","v":3},{"$f":"COUNTIF(J5,\">0\")+COUNTIF(O5,\">0\")","v":0},{"$f":"COUNTIF(K5,\">0\")+COUNTIF(P5,\">0\")","v":2},23661,{"$f":"IF($G5=\"\",\"\",VLOOKUP(Setup!$B$13&\"-\"&$G5,Rankings!$A:$E,2,FALSE))","v":"ΦΩΤΕΙΝΟΠΟΥΛΟΣ ΚΩΝΣΤΑΝΤΙΝΟΣ"},{"$f":"IF($G5=\"\",\"\",VLOOKUP(Setup!$B$13&\"-\"&$G5,Rankings!$A:$E,3,FALSE))","v":"ΙΔ.ΕΝ.ΛΥΚΕΙΟ ΘΕΟΜΗΤΩΡ"},{"$f":"IF(COUNTIF(Rankings!$A:$A,Setup!$B$13&\"-\"&$G5)>0,VLOOKUP(Setup!$B$13&\"-\"&$G5,Rankings!$A:$E,5,FALSE),0)","v":0},{"$f":"IF(COUNTIF(Rankings!$A:$A,Setup!$B$13&\"-\"&$G5)>0,VLOOKUP(Setup!$B$13&\"-\"&$G5,Rankings!$A:$E,4,FALSE),0)","v":368.5},23192,{"$f":"IF($L5=\"\",\"\",VLOOKUP(Setup!$B$13&\"-\"&$L5,Rankings!$A:$E,2,FALSE))","v":"ΚΟΥΤΣΑΦΤΗΣ ΑΠΟΣΤΟΛΟΣ"},{"$f":"IF($L5=\"\",\"\",VLOOKUP(Setup!$B$13&\"-\"&$L5,Rankings!$A:$E,3,FALSE))","v":"2ο ΓΕΛ ΒΡΙΛΗΣΣΙΩΝ"},{"$f":"IF(COUNTIF(Rankings!$A:$A,Setup!$B$13&\"-\"&$L5)>0,VLOOKUP(Setup!$B$13&\"-\"&$L5,Rankings!$A:$E,5,FALSE),0)","v":0},{"$f":"IF(COUNTIF(Rankings!$A:$A,Setup!$B$13&\"-\"&$L5)>0,VLOOKUP(Setup!$B$13&\"-\"&$L5,Rankings!$A:$E,4,FALSE),0)","v":250.5},{"$f":"B5+W5","v":3.2043364800093073E-2},{"$f":"IF(J5>0,(B5+P5/1000+W5/1000),(B5+K5/1000+W5/1000))","v":0.36853204336480011},{"$f":"C5+W5","v":619.03204336480007},{"$f":"C5+W5","v":619.03204336480007},{"$f":"W5","v":3.2043364800093073E-2},{"$f":"IF(G5=\"\",0,VLOOKUP(D5,D5:U5,13+D5,FALSE))","v":619.03204336480007},3.2043364800093073E-2]
[4,{"$f":"J6+O6","v":0},{"$f":"K6+P6","v":504},{"$f":"IF(E6=2,1,IF(E6=1,2,IF(F6=2,3,IF(F6=1,4,5))))","v":4},{"$f":"COUNTIF(J6,\">0\")+COUNTIF(O6,\">0\")","v":0},{"$f":"COUNTIF(K6,\">0\")+COUNTIF(P6,\">0\")","v":1},29120,{"$f":"IF($G6=\"\",\"\",VLOOKUP(Setup!$B$13&\"-\"&$G6,Rankings!$A:$E,2,FALSE))","v":"ΜΑΝΤΟΠΟΥΛΟΣ ΑΝΔΡΕΑΣ"},{"$f":"IF($G6=\"\",\"\",VLOOKUP(Setup!$B$13&\"-\"&$G6,Rankings!$A:$E,3,FALSE))","v":"ΙΔ.ΓΕΛ ΕΛΛΗΝΙΚΟ ΚΟΛΛΕΓΙΟ"},{"$f":"IF(COUNTIF(Rankings!$A:$A,Setup!$B$13&\"-\"&$G6)>0,VLOOKUP(Setup!$B$13&\"-\"&$G6,Rankings!$A:$E,5,FALSE),0)","v":0},{"$f":"IF(COUNTIF(Rankings!$A:$A,Setup!$B$13&\"-\"&$G6)>0,VLOOKUP(Setup!$B$13&\"-\"&$G6,Rankings!$A:$E,4,FALSE),0)","v":0},25875,{"$f":"IF($L6=\"\",\"\",VLOOKUP(Setup!$B$13&\"-\"&$L6,Rankings!$A:$E,2,FALSE))","v":"ΛΑΖΑΡΙΔΗΣ ΚΩΝΣΤΑΝΤΙΝΟΣ"},{"$f":"IF($L6=\"\",\"\",VLOOKUP(Setup!$B$13&\"-\"&$L6,Rankings!$A:$E,3,FALSE))","v":"ΙΔ.ΓΕΛ ΕΛΛΗΝΙΚΟ ΚΟΛΛΕΓΙΟ"},{"$f":"IF(COUNTIF(Rankings!$A:$A,Setup!$B$13&\"-\"&$L6)>0,VLOOKUP(Setup!$B$13&\"-\"&$L6,Rankings!$A:$E,5,FALSE),0)","v":0},{"$f":"IF(COUNTIF(Rankings!$A:$A,Setup!$B$13&\"-\"&$L6)>0,VLOOKUP(Setup!$B$13&\"-\"&$L6,Rankings!$A:$E,4,FALSE),0)","v":504},{"$f":"B6+W6","v":2.7540076643545772E-2},{"$f":"IF(J6>0,(B6+P6/1000+W6/1000),(B6+K6/1000+W6/1000))","v":2.7540076643545772E-5},{"$f":"C6+W6","v":504.02754007664356},{"$f":"C6+W6","v":504.02754007664356},{"$f":"W6","v":2.7540076643545772E-2},{"$f":"IF(G6=\"\",0,VLOOKUP(D6,D6:U6,13+D6,FALSE))","v":504.02754007664356},2.7540076643545772E-2]
[5,{"$f":"J7+O7","v":0},{"$f":"K7+P7","v":495.5},{"$f":"IF(E7=2,1,IF(E7=1,2,IF(F7=2,3,IF(F7=1,4,5))))","v":3},{"$f":"COUNTIF(J7,\">0\")+COUNTIF(O7,\">0\")","v":0},{"$f":"COUNTIF(K7,\">0\")+COUNTIF(P7,\">0\")","v":2},23662,{"$f":"IF($G7=\"\",\"\",VLOOKUP(Setup!$B$13&\"-\"&$G7,Rankings!$A:$E,2,FALSE))","v":"ΤΑΣΟΥΛΗΣ ΒΑΣΙΛΕΙΟΣ"},{"$f":"IF($G7=\"\",\"\",VLOOKUP(Setup!$B$13&\"-\"&$G7,Rankings!$A:$E,3,FALSE))","v":"3ο ΓΕΛ ΗΛΙΟΥΠΟΛΗΣ"},{"$f":"IF(COUNTIF(Rankings!$A:$A,Setup!$B$13&\"-\"&$G7)>0,VLOOKUP(Setup!$B$13&\"-\"&$G7,Rankings!$A:$E,5,FALSE),0)","v":0},{"$f":"IF(COUNTIF(Rankings!$A:$A,Setup!$B$13&\"-\"&$G7)>0,VLOOKUP(Setup!$B$13&\"-\"&$G7,Rankings!$A:$E,4,FALSE),0)","v":219.5},22965,{"$f":"IF($L7=\"\",\"\",VLOOKUP(Setup!$B$13&\"-\"&$L7,Rankings!$A:$E,2,FALSE))","v":"ΚΟΡΔΟΣ ΙΩΑΝΝΗΣ"},{"$f":"IF($L7=\"\",\"\",VLOOKUP(Setup!$B$13&\"-\"&$L7,Rankings!$A:$E,3,FALSE))","v":"ΙΔΙΩΤ.ΓΕΝ. ΛΥΚΕΙΟ ΠΡΟΤΥΠΟ ΑΘΗΝΩΝ"},{"$f":"IF(COUNTIF(Rankings!$A:$A,Setup!$B$13&\"-\"&$L7)>0,VLOOKUP(Setup!$B$13&\"-\"&$L7,Rankings!$A:$E,5,FALSE),0)","v":0},{"$f":"IF(COUNTIF(Rankings!$A:$A,Setup!$B$13&\"-\"&$L7)>0,VLOOKUP(Setup!$B$13&\"-\"&$L7,Rankings!$A:$E,4,FALSE),0)","v":276},{"$f":"B7+W7","v":2.2875343804069918E-2},{"$f":"IF(J7>0,(B7+P7/1000+W7/1000),(B7+K7/1000+W7/1000))","v":0.21952287534380407},{"$f":"C7+W7","v":495.52287534380406},{"$f":"C7+W7","v":495.52287534380406},{"$f":"W7","v":2.2875343804069918E-2},{"$f":"IF(G7=\"\",0,VLOOKUP(D7,D7:U7,13+D7,FALSE))","v":495.52287534380406},2.2875343804069918E-2]
[6,{"$f":"J8+O8","v":0},{"$f":"K8+P8","v":466},{"$f":"IF(E8=2,1,IF(E8=1,2,IF(F8=2,3,IF(F8=1,4,5))))","v":3},{"$f":"COUNTIF(J8,\">0\")+COUNTIF(O8,\">0\")","v":0},{"$f":"COUNTIF(K8,\">0\")+COUNTIF(P8,\">0\")","v":2},27879,{"$f":"IF($G8=\"\",\"\",VLOOKUP(Setup!$B$13&\"-\"&$G8,Rankings!$A:$E,2,FALSE))","v":"ΚΙΣΣΑΣ ΧΡΗΣΤΟΣ-ΕΥΑΓΓΕΛΟΣ"},{"$f":"IF($G8=\"\",\"\",VLOOKUP(Setup!$B$13&\"-\"&$G8,Rankings!$A:$E,3,FALSE))","v":"1ο ΓΕΛ ΚΙΑΤΟΥ"},{"$f":"IF(COUNTIF(Rankings!$A:$A,Setup!$B$13&\"-\"&$G8)>0,VLOOKUP(Setup!$B$13&\"-\"&$G8,Rankings!$A:$E,5,FALSE),0)","v":0},{"$f":"IF(COUNTIF(Rankings!$A:$A,Setup!$B$13&\"-\"&$G8)>0,VLOOKUP(Setup!$B$13&\"-\"&$G8,Rankings!$A:$E,4,FALSE),0)","v":180},22866,{"$f":"IF($L8=\"\",\"\",VLOOKUP(Setup!$B$13&\"-\"&$L8,Rankings!$A:$E,2,FALSE))","v":"ΚΟΝΤΟΠΟΥΛΟΣ ΘΕΟΦΑΝΗΣ"},{"$f":"IF($L8=\"\",\"\",VLOOKUP(Setup!$B$13&\"-\"&$L8,Rankings!$A:$E,3,FALSE))","v":"2ο ΓΕΛ ΚΟΡΙΝΘΟΥ"},{"$f":"IF(COUNTIF(Rankings!$A:$A,Setup!$B$13&\"-\"&$L8)>0,VLOOKUP(Setup!$B$13&\"-\"&$L8,Rankings!$A:$E,5,FALSE),0)","v":0},{"$f":"IF(COUNTIF(Rankings!$A:$A,Setup!$B$13&\"-\"&$L8)>0,VLOOKUP(Setup!$B$13&\"-\"&$L8,Rankings!$A:$E,4,FALSE),0)","v":286},{"$f":"B8+W8","v":2.9524581948367944E-2},{"$f":"IF(J8>0,(B8+P8/1000+W8/1000),(B8+K8/1000+W8/1000))","v":0.18002952458194837},{"$f":"C8+W8","v":466.02952458194835},{"$f":"C8+W8","v":466.02952458194835},{"$f":"W8","v":2.9524581948367944E-2},{"$f":"IF(G8=\"\",0,VLOOKUP(D8,D8:U8,13+D8,FALSE))","v":466.02952458194835},2.9524581948367944E-2]
[7,{"$f":"J9+O9","v":0},{"$f":"K9+P9","v":462.5},{"$f":"IF(E9=2,1,IF(E9=1,2,IF(F9=2,3,IF(F9=1,4,5))))","v":3},{"$f":"COUNTIF(J9,\">0\")+COUNTIF(O9,\">0\")","v":0},{"$f":"COUNTIF(K9,\">0\")+COUNTIF(P9,\">0\")","v":2},22834,{"$f":"IF($G9=\"\",\"\",VLOOKUP(Setup!$B$13&\"-\"&$G9,Rankings!$A:$E,2,FALSE))","v":"ΑΔΑΛΟΓΛΟΥ ΛΑΖΑΡΟΣ"},{"$f":"IF($G9=\"\",\"\",VLOOKUP(Setup!$B$13&\"-\"&$G9,Rankings!$A:$E,3,FALSE))","v":"3ο ΓΕΛ ΒΕΡΟΙΑΣ"},{"$f":"IF(COUNTIF(Rankings!$A:$A,Setup!$B$13&\"-\"&$G9)>0,VLOOKUP(Setup!$B$13&\"-\"&$G9,Rankings!$A:$E,5,FALSE),0)","v":0},{"$f":"IF(COUNTIF(Rankings!$A:$A,Setup!$B$13&\"-\"&$G9)>0,VLOOKUP(Setup!$B$13&\"-\"&$G9,Rankings!$A:$E,4,FALSE),0)","v":210.5},29652,{"$f":"IF($L9=\"\",\"\",VLOOKUP(Setup!$B$13&\"-\"&$L9,Rankings!$A:$E,2,FALSE))","v":"ΚΟΣΚΙΝΑΣ ΝΙΚΟΛΑΟΣ"},{"$f":"IF($L9=\"\",\"\",VLOOKUP(Setup!$B$13&\"-\"&$L9,Rankings!$A:$E,3,FALSE))","v":"3ο ΓΕΛ ΚΕΡΚΥΡΑΣ"},{"$f":"IF(COUNTIF(Rankings!$A:$A,Setup!$B$13&\"-\"&$L9)>0,VLOOKUP(Setup!$B$13&\"-\"&$L9,Rankings!$A:$E,5,FALSE),0)","v":0},{"$f":"IF(COUNTIF(Rankings!$A:$A,Setup!$B$13&\"-\"&$L9)>0,VLOOKUP(Setup!$B$13&\"-\"&$L9,Rankings!$A:$E,4,FALSE),0)","v":252},{"$f":"B9+W9","v":4.8960349210016981E-3},{"$f":"IF(J9>0,(B9+P9/1000+W9/1000),(B9+K9/1000+W9/1000))","v":0.21050489603492101},{"$f":"C9+W9","v":462.50489603492099},{"$f":"C9+W9","v":462.50489603492099},{"$f":"W9","v":4.8960349210016981E-3},{"$f":"IF(G9=\"\",0,VLOOKUP(D9,D9:U9,13+D9,FALSE))","v":462.50489603492099},4.8960349210016981E-3]
[8,{"$f":"J10+O10","v":0},{"$f":"K10+P10","v":444},{"$f":"IF(E10=2,1,IF(E10=1,2,IF(F10=2,3,IF(F10=1,4,5))))","v":3},{"$f":"COUNTIF(J10,\">0\")+COUNTIF(O10,\">0\")","v":0},{"$f":"COUNTIF(K10,\">0\")+COUNTIF(P10,\">0\")","v":2},26603,{"$f":"IF($G10=\"\",\"\",VLOOKUP(Setup!$B$13&\"-\"&$G10,Rankings!$A:$E,2,FALSE))","v":"ΔΕΛΛΗΣ ΑΝΔΡΕΑΣ-ΑΛΕΞΑΝΔΡΟΣ"},{"$f":"IF($G10=\"\",\"\",VLOOKUP(Setup!$B$13&\"-\"&$G10,Rankings!$A:$E,3,FALSE))","v":"2ο ΓΕΛ ΑΡΓΟΥΣ"},{"$f":"IF(COUNTIF(Rankings!$A:$A,Setup!$B$13&\"-\"&$G10)>0,VLOOKUP(Setup!$B$13&\"-\"&$G10,Rankings!$A:$E,5,FALSE),0)","v":0},{"$f":"IF(COUNTIF(Rankings!$A:$A,Setup!$B$13&\"-\"&$G10)>0,VLOOKUP(Setup!$B$13&\"-\"&$G10,Rankings!$A:$E,4,FALSE),0)","v":293},26604,{"$f":"IF($L10=\"\",\"\",VLOOKUP(Setup!$B$13&\"-\"&$L10,Rankings!$A:$E,2,FALSE))","v":"ΔΕΛΛΗΣ ΧΡΙΣΤΟΣ-ΕΡΡΙΚΟΣ"},{"$f":"IF($L10=\"\",\"\",VLOOKUP(Setup!$B$13&\"-\"&$L10,Rankings!$A:$E,3,FALSE))","v":"2ο ΓΕΛ ΑΡΓΟΥΣ"},{"$f":"IF(COUNTIF(Rankings!$A:$A,Setup!$B$13&\"-\"&$L10)>0,VLOOKUP(Setup!$B$13&\"-\"&$L10,Rankings!$A:$E,5,FALSE),0)","v":0},{"$f":"IF(COUNTIF(Rankings!$A:$A,Setup!$B$13&\"-\"&$L10)>0,VLOOKUP(Setup!$B$13&\"-\"&$L10,Rankings!$A:$E,4,FALSE),0)","v":151},{"$f":"B10+W10","v":1.6222924282678958E-3},{"$f":"IF(J10>0,(B10+P10/1000+W10/1000),(B10+K10/1000+W10/1000))","v":0.29300162229242827},{"$f":"C10+W10","v":444.00162229242829},{"$f":"C10+W10","v":444.00162229242829},{"$f":"W10","v":1.6222924282678958E-3},{"$f":"IF(G10=\"\",0,VLOOKUP(D10,D10:U10,13+D10,FALSE))","v":444.00162229242829},1.6222924282678958E-3]
{"$rows_left_out":57}
{"sheet":"MD","index":2,"n_rows":67,"n_cols":29,"rows_kept":67,"cut":false,"hidden":false,"merged":[[41,7,41,9],[34,0,35,0],[40,7,40,9],[4,0,5,0],[6,0,7,0],[8,0,9,0],[10,0,11,0],[12,0,13,0],[14,0,15,0],[16,0,17,0],[32,0,33,0],[30,0,31,0],[18,0,19,0],[20,0,21,0],[22,0,23,0],[24,0,25,0],[10,5,11,5],[12,5,13,5],[26,0,27,0],[28,0,29,0],[26,5,27,5],[20,5,21,5],[0,0,0,13],[22,5,23,5],[24,5,25,5],[42,7,42,9],[43,7,43,9],[28,5,29,5],[30,5,31,5],[32,5,33,5],[34,5,35,5],[14,5,15,5],[16,5,17,5],[18,5,19,5],[2,7,2,9],[4,5,5,5],[6,5,7,5],[8,5,9,5]]}
[{"$f":"Setup!B3 & \", \" & Setup!B4 & \", \" & Setup!B6 & \", \" & Setup!B8 & \"-\" & Setup!B9","v":"Υπ.Παιδείας, Σχολικό Πρωτάθλημα 2014, ΑΕΤ ΝΙΚΗ ΠΑΤΡΩΝ, 5-11 Μαίου"},null,null,null,null,null,null,null,null,null,null,null,null,null,null,{"$f":"Setup!$B$7","v":"Αγόρια Δ"}]
[null,{"$f":"Setup!$B$18","v":1},null,null,null,null,{"$f":"\"p\"&VLOOKUP(Setup!$B$5,tmp!$K$23:$P$34,2,FALSE)","v":{"$error":"#N/A"}},null,null,null,null,{"$f":"\"p\"&VLOOKUP(Setup!$B$5,tmp!$K$23:$P$34,3,FALSE)","v":{"$error":"#N/A"}},null,{"$f":"\"p\"&VLOOKUP(Setup!$B$5,tmp!$K$23:$P$34,4,FALSE)","v":{"$error":"#N/A"}},null,{"$f":"\"p\"&VLOOKUP(Setup!$B$5,tmp!$K$28:$P$34,5,FALSE)&\"-\"&VLOOKUP(Setup!$B$5,tmp!$K$28:$P$34,6,FALSE)","v":{"$error":"#N/A"}}]
[null,null,null,null,null,null,null,16,null,null,null,8,null,4,null,"2 & w"]
["α/α",null,"ByeOrder","ByeSum","ByeCnt","seed","  Α.Μ.  ","Ονοματεπώνυμο","επώνυμο","Σύλλογος",null,null,null,null,null,null,null,null,null,null,null,null,null,null,null," "]
[1,1,null,null,0,{"$f":"VLOOKUP($B5,Setup!$G$12:$H$27,2,FALSE)","v":1},{"$f":"IF(Setup!$B$25=\"#\",0,IF(F5>0,VLOOKUP(F5,DrawPrep!$A$3:$N$18,7,FALSE),0))","v":23775},{"$f":"IF(G5>0,VLOOKUP(G5,DrawPrep!$G$3:$N$18,2,FALSE),\"bye\")","v":"ΑΝΤΩΝΟΠΟΥΛΟΣ ΧΡΗΣΤΟΣ"},{"$f":"IF(NOT(G5>0),\"\", IF(ISERROR(FIND(\"-\",H5)), LEFT(H5,FIND(\" \",H5)-1),  IF(FIND(\"-\",H5)>FIND(\" \",H5),LEFT(H5,FIND(\" \",H5)-1),   LEFT(H5,FIND(\"-\",H5)-1)    )))","v":"ΑΝΤΩΝΟΠΟΥΛΟΣ"},{"$f":"IF($G5>0,VLOOKUP($G5,DrawPrep!$G$3:$L$18,3,FALSE),\"\")","v":"1ο ΓΕΛ ΝΙΚΑΙΑΣ"},null,{"$f":"UPPER(IF($A$2=\"R\",IF(OR(K6=1,K6=\"a\"),G5,IF(OR(K6=2,K6=\"b\"),G7,\"\")),IF(OR(K6=1,K6=\"1\"),I5,IF(OR(K6=2,K6=\"b\"),I7,\"\"))))","v":"ΑΝΤΩΝΟΠΟΥΛΟΣ"},null,null,null,null,null,null,null,null,null,null,null,{"$f":"G5","v":23775},{"$f":"H5","v":"ΑΝΤΩΝΟΠΟΥΛΟΣ ΧΡΗΣΤΟΣ"},null,{"$f":"L5","v":"ΑΝΤΩΝΟΠΟΥΛΟΣ"}]
[null,null,null,null,null,null,{"$f":"IF(Setup!$B$25=\"#\",0,IF(F5>0,VLOOKUP(F5,DrawPrep!$A$3:$N$18,12,FALSE),0))","v":23234},{"$f":"IF(G6>0,VLOOKUP(G6,DrawPrep!$L$3:$N$18,2,FALSE),\" \")","v":"ΚΑΖΑΝΤΖΗΣ ΜΙΧΑΗΛ-ΤΟΥΒ"},{"$f":"IF(NOT(G6>0),\"\", IF(ISERROR(FIND(\"-\",H6)), LEFT(H6,FIND(\" \",H6)-1),  IF(FIND(\"-\",H6)>FIND(\" \",H6),LEFT(H6,FIND(\" \",H6)-1),   LEFT(H6,FIND(\"-\",H6)-1)    )))","v":"ΚΑΖΑΝΤΖΗΣ"},{"$f":"IF($G6>0,VLOOKUP($G6,DrawPrep!$L$3:$N$18,3,FALSE),\"\")","v":"ΚΟΛΛΕΓΙΟ ΑΘΗΝΩΝ"},1,{"$f":"UPPER(IF($A$2=\"R\",IF(OR(K6=1,K6=\"a\"),G6,IF(OR(K6=2,K6=\"b\"),G8,\"\")),IF(OR(K6=1,K6=\"1\"),I6,IF(OR(K6=2,K6=\"b\"),I8,\"\"))))","v":"ΚΑΖΑΝΤΖΗΣ"},null,null,null,null,null,null,null,null,null,null,null,{"$f":"G6","v":23234},"ΚΑΖΑΝΤΖΗΣ ΜΙΧΑΗΛ-ΤΟΥΒ",null,{"$f":"L6","v":"ΚΑΖΑΝΤΖΗΣ"}]
[2,{"$f":"1-D7+4","v":4},1,{"$f":"E7","v":1},{"$f":"IF($B$2>=C7,1,0)","v":1},{"$f":"IF($B$2>=C7,\"-\",VLOOKUP($B7,Setup!$G$12:$H$27,2,FALSE))","v":"-"},{"$f":"IF(Setup!$B$25=\"#\",0,IF(NOT(F7=\"-\"),VLOOKUP(F7,DrawPrep!$A$3:$N$18,7,FALSE),0))","v":0},{"$f":"IF(G7>0,VLOOKUP(G7,DrawPrep!$G$3:$L$18,2,FALSE),\"bye\")","v":"bye"},"",{"$f":"IF($G7>0,VLOOKUP($G7,DrawPrep!$G$3:$L$18,3,FALSE),\"\")","v":""},null,null,null,{"$f":"UPPER(IF($A$2=\"R\",IF(OR(M8=1,M8=\"a\"),L5,IF(OR(M8=2,M7=\"b\"),L9,\"\")),IF(OR(M8=1,M8=\"a\"),L5,IF(OR(M8=2,M8=\"b\"),L9,\"\"))))","v":""},null,null,null,null,null,null,null,null,null,0,"bye",null,0,{"$f":"N7","v":""}]
[null,null,null,null,null,null,{"$f":"IF(Setup!$B$25=\"#\",0,IF(NOT(F7=\"-\"),VLOOKUP(F7,DrawPrep!$A$3:$N$18,12,FALSE),0))","v":0},{"$f":"IF(G8>0,VLOOKUP(G8,DrawPrep!$L$3:$N$18,2,FALSE),\" \")","v":" "},"",{"$f":"IF($G8>0,VLOOKUP($G8,DrawPrep!$L$3:$N$18,3,FALSE),\"\")","v":""},null,null,null,{"$f":"UPPER(IF($A$2=\"R\",IF(OR(M8=1,M8=\"a\"),L6,IF(OR(M8=2,M8=\"b\"),L10,\"\")),IF(OR(M8=1,M8=\"a\"),L6,IF(OR(M8=2,M8=\"b\"),L10,\"\"))))","v":""},null,null,null,null,null,null,null,null,null,0," ",null,null,{"$f":"N8","v":""}]
[3,{"$f":"2-D9+4","v":5},null,{"$f":"D7+E9","v":1},0,{"$f":"VLOOKUP($B9,Setup!$G$12:$H$27,2,FALSE)","v":11},{"$f":"IF(Setup!$B$25=\"#\",0,IF(F9>0,VLOOKUP(F9,DrawPrep!$A$3:$N$18,7,FALSE),0))","v":25503},{"$f":"IF(G9>0,VLOOKUP(G9,DrawPrep!$G$3:$L$18,2,FALSE),\"bye\")","v":"ΠΑΡΑΣΧΑΚΗΣ ΝΙΚΟΛΑΟΣ"},"ΠΑΡΑΣΧΑΚΗΣ",{"$f":"IF($G9>0,VLOOKUP($G9,DrawPrep!$G$3:$L$18,3,FALSE),\"\")","v":"1ο ΓΕΛ Ν.ΙΩΝΙΑΣ"},null,{"$f":"UPPER(IF($A$2=\"R\",IF(OR(K10=1,K10=\"a\"),G9,IF(OR(K10=2,K10=\"b\"),G11,\"\")),IF(OR(K10=1,K10=\"1\"),I9,IF(OR(K10=2,K10=\"b\"),I11,\"\"))))","v":""},null,null,null,null,null,null,null,null,null,null,null,25503,"ΠΑΡΑΣΧΑΚΗΣ ΝΙΚΟΛΑΟΣ",null,"",0]
[null,null,null,null,null,null,{"$f":"IF(Setup!$B$25=\"#\",0,IF(F9>0,VLOOKUP(F9,DrawPrep!$A$3:$N$18,12,FALSE),0))","v":23093},{"$f":"IF(G10>0,VLOOKUP(G10,DrawPrep!$L$3:$N$18,2,FALSE),\" \")","v":"ΚΑΛΔΕΡΩΝ ΖΑΚ"},"ΚΑΛΔΕΡΩΝ",{"$f":"IF($G10>0,VLOOKUP($G10,DrawPrep!$L$3:$N$18,3,FALSE),\"\")","v":"ΓΕΛ ΛΑΡΙΣΑΣ"},null,{"$f":"UPPER(IF($A$2=\"R\",IF(OR(K10=1,K10=\"a\"),G10,IF(OR(K10=2,K10=\"b\"),G12,\"\")),IF(OR(K10=1,K10=\"1\"),I10,IF(OR(K10=2,K10=\"b\"),I12,\"\"))))","v":""},null,null,null,null,null,null,null,null,null,null,null,23093,"ΚΑΛΔΕΡΩΝ ΖΑΚ",null,""]
{"$rows_left_out":58}
{"sheet":"Matches","index":3,"n_rows":18,"n_cols":6,"rows_kept":18,"cut":false,"hidden":false,"merged":[[2,5,3,5],[15,5,16,5],[0,0,0,5],[1,0,1,5]]}
[{"$f":"CONCATENATE(Setup!B3,\", \",Setup!B4,\", \",Setup!B6)","v":"Υπ.Παιδείας, Σχολικό Πρωτάθλημα 2014, ΑΕΤ ΝΙΚΗ ΠΑΤΡΩΝ"}]
[{"$f":"Setup!$B$10","v":"Γ.Καζάνης"}]
["Πρόγραμμα αγώνων",null,null,null,"Round 1","i"]
["ΩΡΑ","Κτγρ.","Αθλητές ζευγάρι α'",null,"Αθλητές ζευγάρι β'"]
["Έναρξη"]
[]
[]
[]
["όχι πριν"]
[]
{"$rows_left_out":9}
{"sheet":"notes","index":4,"n_rows":0,"n_cols":0,"rows_kept":0,"cut":false,"hidden":false,"merged":[]}

{"sheet":"Rankings","index":5,"n_rows":4371,"n_cols":6,"rows_kept":4371,"cut":false,"hidden":false,"merged":[]}
["Α.Μ.","Ονοματεπώνυμο","Σύλλογος","Βαθμ","Διπλά","week 12"]
[]
[]
[]
[]
[]
[]
[]
[]
[]
{"$rows_left_out":4362}
{"sheet":"CalcPrg","index":6,"n_rows":25,"n_cols":7,"rows_kept":25,"cut":false,"hidden":false,"merged":[[0,0,0,5],[2,0,2,2],[15,0,15,2],[2,5,3,5],[15,5,16,5],[1,0,1,5]]}
[{"$f":"CONCATENATE(Setup!B3,\", \",Setup!B4,\", \",Setup!B6)","v":"Υπ.Παιδείας, Σχολικό Πρωτάθλημα 2014, ΑΕΤ ΝΙΚΗ ΠΑΤΡΩΝ"},null,null,null,null,null," Don't Change this Worksheet !"]
[{"$f":"Setup!$B$10","v":"Γ.Καζάνης"}]
["Πρόγραμμα αγώνων",null,null,null,"Round 1","i"]
["ΩΡΑ","Κτγρ.","Αθλητές ζευγάρι α'",null,"Αθλητές ζευγάρι β'"]
["Έναρξη",{"$f":"Setup!$B$7","v":"Αγόρια Δ"},{"$f":"IF(MD!H5=\"bye\",\"\", LEFT(MD!H5,FIND(\" \",MD!H5)+1) & \" - \" & LEFT(MD!H6,FIND(\" \",MD!H6)+1))","v":"ΑΝΤΩΝΟΠΟΥΛΟΣ Χ - ΚΑΖΑΝΤΖΗΣ Μ"},{"$f":"IF(OR(C5=\"\",E5=\"\"),\" \",\"-\")","v":" "},{"$f":"IF(MD!H7=\"bye\",\"\", LEFT(MD!H7,FIND(\" \",MD!H7)+1) & \" - \" & LEFT(MD!H8,FIND(\" \",MD!H8)+1))","v":""}]
[null,{"$f":"Setup!$B$7","v":"Αγόρια Δ"},{"$f":"IF(MD!H9=\"bye\",\"\", LEFT(MD!H9,FIND(\" \",MD!H9)+1) & \" - \" & LEFT(MD!H10,FIND(\" \",MD!H10)+1))","v":"ΠΑΡΑΣΧΑΚΗΣ Ν - ΚΑΛΔΕΡΩΝ Ζ"},"-",{"$f":"IF(MD!H11=\"bye\",\"\", LEFT(MD!H11,FIND(\" \",MD!H11)+1) & \" - \" & LEFT(MD!H12,FIND(\" \",MD!H12)+1))","v":"ΤΑΣΟΥΛΗΣ Β - ΚΟΡΔΟΣ Ι"}]
[null,{"$f":"Setup!$B$7","v":"Αγόρια Δ"},{"$f":"IF(MD!H13=\"bye\",\"\", LEFT(MD!H13,FIND(\" \",MD!H13)+1) & \" - \" & LEFT(MD!H14,FIND(\" \",MD!H14)+1))","v":"ΔΕΛΛΗΣ Α - ΔΕΛΛΗΣ Χ"},"-",{"$f":"IF(MD!H15=\"bye\",\"\", LEFT(MD!H15,FIND(\" \",MD!H15)+1) & \" - \" & LEFT(MD!H16,FIND(\" \",MD!H16)+1))","v":"ΤΖΕΛΑΤΗΣ Σ - ΤΣΟΝΑΚΗΣ Κ"}]
[null,{"$f":"Setup!$B$7","v":"Αγόρια Δ"},{"$f":"IF(MD!H17=\"bye\",\"\", LEFT(MD!H17,FIND(\" \",MD!H17)+1) & \" - \" & LEFT(MD!H18,FIND(\" \",MD!H18)+1))","v":"ΔΙΑΜΑΝΤΟΠΟΥΛΟΣ Γ - ΚΟΝΤΩΣΗΣ Γ"},"-",{"$f":"IF(MD!H19=\"bye\",\"\", LEFT(MD!H19,FIND(\" \",MD!H19)+1) & \" - \" & LEFT(MD!H20,FIND(\" \",MD!H20)+1))","v":"ΦΩΤΕΙΝΟΠΟΥΛΟΣ Κ - ΚΟΥΤΣΑΦΤΗΣ Α"}]
["όχι πριν",{"$f":"Setup!$B$7","v":"Αγόρια Δ"},{"$f":"IF(MD!H21=\"bye\",\"\", LEFT(MD!H21,FIND(\" \",MD!H21)+1) & \" - \" & LEFT(MD!H22,FIND(\" \",MD!H22)+1))","v":"ΜΑΝΤΟΠΟΥΛΟΣ Α - ΛΑΖΑΡΙΔΗΣ Κ"},"-",{"$f":"IF(MD!H23=\"bye\",\"\", LEFT(MD!H23,FIND(\" \",MD!H23)+1) & \" - \" & LEFT(MD!H24,FIND(\" \",MD!H24)+1))","v":"ΜΑΡΟΥΛΗΣ Χ - ΛΑYΡΑΝΟΣ Γ"}]
[null,{"$f":"Setup!$B$7","v":"Αγόρια Δ"},{"$f":"IF(MD!H25=\"bye\",\"\", LEFT(MD!H25,FIND(\" \",MD!H25)+1) & \" - \" & LEFT(MD!H26,FIND(\" \",MD!H26)+1))","v":"ΙΩΑΝΝΙΔΗΣ Ι - ΙΩΑΝΝΙΔΗΣ Π"},"-",{"$f":"IF(MD!H27=\"bye\",\"\", LEFT(MD!H27,FIND(\" \",MD!H27)+1) & \" - \" & LEFT(MD!H28,FIND(\" \",MD!H28)+1))","v":"ΚΙΣΣΑΣ Χ - ΚΟΝΤΟΠΟΥΛΟΣ Θ"}]
{"$rows_left_out":16}
{"sheet":"tmp","index":7,"n_rows":65,"n_cols":24,"rows_kept":65,"cut":false,"hidden":false,"merged":[[31,9,33,9],[31,16,33,16],[20,8,22,8],[20,16,22,16],[25,9,25,22],[26,9,26,10],[26,16,26,17],[27,9,30,9],[27,16,30,16],[11,8,11,23],[12,16,12,17],[13,8,16,8],[13,16,16,16],[17,8,19,8],[17,16,19,16],[0,8,0,23],[1,16,1,17],[2,8,5,8],[2,16,5,16],[6,8,8,8],[6,16,8,16]]}
["RndIndx","random","FixRandom",null,null,null,null,null,"ΠΡΟΚΡΙΜΑΤΙΚΑ E1, E2 (32 για 8)"]
[1,{"$f":"RAND()/22","v":2.8407327288257213E-2},4.3046994674434763E-2,null,null,null,null,null,null,null,"17-32","9-16","5-8","3-4","2ος","1ος",null,null,"17-32","9-16","5-8","3-4","2ος","1ος"]
[2,{"$f":"RAND()/22","v":2.7357710071823294E-2},3.8442504627631345E-2,null,null,null,null,null,"E1","E1-12",1.5,2,2,0,0,0,"E1","E1-12",1.5,0.5,0,0,0,0]
[3,{"$f":"RAND()/22","v":2.1876104400835115E-2},2.737359674750417E-2,null,null,null,null,null,null,"E1-14",3,4,4,0,0,0,null,"E1-14",3,1,0,0,0,0]
[4,{"$f":"RAND()/22","v":1.612948892825555E-2},2.9524581948367944E-2,null,null,null,null,null,null,"E1-16",6,8,8,0,0,0,null,"E1-16",6,2,0,0,0,0]
[5,2.7425361005921998E-2,1.6222924282678958E-3,null,null,null,null,null,null,"E1-18",7.5,10,10,0,0,0,null,"E1-18",7.5,2.5,0,0,0,0]
[6,3.3100849208501273E-2,4.0696027380390423E-2,null,null,null,null,null,"E2","E2-12",0.5,1,1,0,0,0,"E2","E2-12",0.5,0.5,0,0,0,0]
[7,4.3693460723209607E-2,1.8883382916195936E-2,null,null,null,null,null,null,"E2-14",1,2,2,0,0,0,null,"E2-14",1,1,0,0,0,0]
[8,4.489917119443596E-3,3.2043364800093073E-2,null,null,null,null,null,null,"E2-16",2,4,4,0,0,0,null,"E2-16",2,2,0,0,0,0]
[9,2.6184031017887546E-2,2.2323415892039181E-2]
{"$rows_left_out":55}