{"text_format":"1","workbook":"xlsx","n_sheets":2,"sheets":["Setup","DB"],"not_rendered":{"charts":0,"images":0,"macros":0,"external_links":1,"defined_names":3,"comments":0,"pivot_tables":0},"unopened":[],"bounds":{"document_bytes":16777216,"sheet_cells":100000,"rows_first":2000,"rows_last":500,"rows_between":2000,"halvings":0,"cell_chars":16384,"cell_head_chars":4096},"cells_cut":0,"cells_raw":0,"read":"whole","date_system":"1900"}

{"sheet":"Setup","index":0,"n_rows":15,"n_cols":3,"rows_kept":15,"cut":false,"hidden":false,"merged":[[0,0,0,2],[6,0,6,2]]}
["ΦΟΡΜΑ ΔΗΛΩΣΗΣ ΣΥΜΜΕΤΟΧΗΣ"]
["ΕΤΟΣ: ",2016]
["ΤΟΥΡΝΟΥΑ: ","1ο Ε1"]
["ΠΕΡΙΟΔΟΣ: ","26/2-2/3/2016"]
[]
[]
["ΣΥΝΤΟΜΕΥΣΕΙΣ"]
["ΠΑΠ","ΑΟΑ ΠΑΠΑΓΟΥ","b12, g12"]
["ΓΛΥ","ΟΑ ΓΛΥΦΑΔΑΣ","b14, g14, b18, g18"]
["ΗΛΙ","ΑΟΑ ΗΛΙΟΥΠΟΛΗΣ","b16, g16"]
[]
[]
[]
[]
["Καταχωρείτε μόνο στις κίτρινες στήλες, στο Φύλλο που ακολουθεί (DB)"]

{"sheet":"DB","index":1,"n_rows":607,"n_cols":13,"rows_kept":607,"cut":false,"hidden":false,"merged":[[0,3,0,12]]}
[null,null,null,"ΦΟΡΜΑ ΔΗΛΩΣΗΣ ΣΥΜΜΕΤΟΧΗΣ ΣΤΟ1ο Ε1"]
[null,null,null,"ΗΜΕΡΟΜΗΝΙΑ","26 /2 - 2/3/2016"]
[null,null,null,"ΣΥΝΤΟΜΕΥΣΕΙΣ","ΠΑΠ b12 - g12  (ΑΟΑ ΠΑΠΑΓΟΥ)"]
[null,null,null,null,"ΓΛΥ b14 - g14 - b18 - g18 (ΟΑ ΓΛΥΦΑΔΑΣ)"]
[null,null,null,null,"ΗΛΙ b16 - g16 (ΑΟΑ ΗΛΙΟΥΠΟΛΗΣ)"]
[]
["#","α/α","Α.Μ.","Ονοματεπώνυμο","Σύλλογος","Βαθμοί","Έτος","Πόλη1","Κτγ1","Πόλη2","Κτγ2","Πόλη3","Κτγ3"]
[1,{"$f":"IF(H8&I8=H7&I7,B7+1,1)","v":1},null,{"$f":"IF($C8>0,VLOOKUP($C8,[1]Μητρώο!$A:$F,3,FALSE),\"\")","v":""},{"$f":"IF($C8>0,VLOOKUP($C8,[1]Μητρώο!$A:$F,5,FALSE),\"\")","v":""},{"$f":"IF(COUNTIF([1]Rankings!$B:$B,RIGHT($I8,2)&\"-\"&$C8)>0,IF($C8>0,VLOOKUP(RIGHT($I8,2)&\"-\"&$C8,[1]Rankings!$B:$H,7,FALSE),\"\"),0)","v":0},{"$f":"IF($C8>0,VLOOKUP($C8,[1]Μητρώο!$A:$F,4,FALSE),\"\")","v":""}]
[2,2,null,{"$f":"IF($C9>0,VLOOKUP($C9,[1]Μητρώο!$A:$F,3,FALSE),\"\")","v":""},{"$f":"IF($C9>0,VLOOKUP($C9,[1]Μητρώο!$A:$F,5,FALSE),\"\")","v":""},{"$f":"IF(COUNTIF([1]Rankings!$B:$B,RIGHT($I9,2)&\"-\"&$C9)>0,IF($C9>0,VLOOKUP(RIGHT($I9,2)&\"-\"&$C9,[1]Rankings!$B:$H,7,FALSE),\"\"),0)","v":0},{"$f":"IF($C9>0,VLOOKUP($C9,[1]Μητρώο!$A:$F,4,FALSE),\"\")","v":""}]
[3,3,null,{"$f":"IF($C10>0,VLOOKUP($C10,[1]Μητρώο!$A:$F,3,FALSE),\"\")","v":""},{"$f":"IF($C10>0,VLOOKUP($C10,[1]Μητρώο!$A:$F,5,FALSE),\"\")","v":""},{"$f":"IF(COUNTIF([1]Rankings!$B:$B,RIGHT($I10,2)&\"-\"&$C10)>0,IF($C10>0,VLOOKUP(RIGHT($I10,2)&\"-\"&$C10,[1]Rankings!$B:$H,7,FALSE),\"\"),0)","v":0},{"$f":"IF($C10>0,VLOOKUP($C10,[1]Μητρώο!$A:$F,4,FALSE),\"\")","v":""}]
[4,4,null,{"$f":"IF($C11>0,VLOOKUP($C11,[1]Μητρώο!$A:$F,3,FALSE),\"\")","v":""},{"$f":"IF($C11>0,VLOOKUP($C11,[1]Μητρώο!$A:$F,5,FALSE),\"\")","v":""},{"$f":"IF(COUNTIF([1]Rankings!$B:$B,RIGHT($I11,2)&\"-\"&$C11)>0,IF($C11>0,VLOOKUP(RIGHT($I11,2)&\"-\"&$C11,[1]Rankings!$B:$H,7,FALSE),\"\"),0)","v":0},{"$f":"IF($C11>0,VLOOKUP($C11,[1]Μητρώο!$A:$F,4,FALSE),\"\")","v":""}]
[5,5,null,{"$f":"IF($C12>0,VLOOKUP($C12,[1]Μητρώο!$A:$F,3,FALSE),\"\")","v":""},{"$f":"IF($C12>0,VLOOKUP($C12,[1]Μητρώο!$A:$F,5,FALSE),\"\")","v":""},{"$f":"IF(COUNTIF([1]Rankings!$B:$B,RIGHT($I12,2)&\"-\"&$C12)>0,IF($C12>0,VLOOKUP(RIGHT($I12,2)&\"-\"&$C12,[1]Rankings!$B:$H,7,FALSE),\"\"),0)","v":0},{"$f":"IF($C12>0,VLOOKUP($C12,[1]Μητρώο!$A:$F,4,FALSE),\"\")","v":""}]
[6,6,null,{"$f":"IF($C13>0,VLOOKUP($C13,[1]Μητρώο!$A:$F,3,FALSE),\"\")","v":""},{"$f":"IF($C13>0,VLOOKUP($C13,[1]Μητρώο!$A:$F,5,FALSE),\"\")","v":""},{"$f":"IF(COUNTIF([1]Rankings!$B:$B,RIGHT($I13,2)&\"-\"&$C13)>0,IF($C13>0,VLOOKUP(RIGHT($I13,2)&\"-\"&$C13,[1]Rankings!$B:$H,7,FALSE),\"\"),0)","v":0},{"$f":"IF($C13>0,VLOOKUP($C13,[1]Μητρώο!$A:$F,4,FALSE),\"\")","v":""}]
[7,7,null,{"$f":"IF($C14>0,VLOOKUP($C14,[1]Μητρώο!$A:$F,3,FALSE),\"\")","v":""},{"$f":"IF($C14>0,VLOOKUP($C14,[1]Μητρώο!$A:$F,5,FALSE),\"\")","v":""},{"$f":"IF(COUNTIF([1]Rankings!$B:$B,RIGHT($I14,2)&\"-\"&$C14)>0,IF($C14>0,VLOOKUP(RIGHT($I14,2)&\"-\"&$C14,[1]Rankings!$B:$H,7,FALSE),\"\"),0)","v":0},{"$f":"IF($C14>0,VLOOKUP($C14,[1]Μητρώο!$A:$F,4,FALSE),\"\")","v":""}]
[8,8,null,{"$f":"IF($C15>0,VLOOKUP($C15,[1]Μητρώο!$A:$F,3,FALSE),\"\")","v":""},{"$f":"IF($C15>0,VLOOKUP($C15,[1]Μητρώο!$A:$F,5,FALSE),\"\")","v":""},{"$f":"IF(COUNTIF([1]Rankings!$B:$B,RIGHT($I15,2)&\"-\"&$C15)>0,IF($C15>0,VLOOKUP(RIGHT($I15,2)&\"-\"&$C15,[1]Rankings!$B:$H,7,FALSE),\"\"),0)","v":0},{"$f":"IF($C15>0,VLOOKUP($C15,[1]Μητρώο!$A:$F,4,FALSE),\"\")","v":""}]
[9,9,null,{"$f":"IF($C16>0,VLOOKUP($C16,[1]Μητρώο!$A:$F,3,FALSE),\"\")","v":""},{"$f":"IF($C16>0,VLOOKUP($C16,[1]Μητρώο!$A:$F,5,FALSE),\"\")","v":""},{"$f":"IF(COUNTIF([1]Rankings!$B:$B,RIGHT($I16,2)&\"-\"&$C16)>0,IF($C16>0,VLOOKUP(RIGHT($I16,2)&\"-\"&$C16,[1]Rankings!$B:$H,7,FALSE),\"\"),0)","v":0},{"$f":"IF($C16>0,VLOOKUP($C16,[1]Μητρώο!$A:$F,4,FALSE),\"\")","v":""}]
[10,10,null,{"$f":"IF($C17>0,VLOOKUP($C17,[1]Μητρώο!$A:$F,3,FALSE),\"\")","v":""},{"$f":"IF($C17>0,VLOOKUP($C17,[1]Μητρώο!$A:$F,5,FALSE),\"\")","v":""},{"$f":"IF(COUNTIF([1]Rankings!$B:$B,RIGHT($I17,2)&\"-\"&$C17)>0,IF($C17>0,VLOOKUP(RIGHT($I17,2)&\"-\"&$C17,[1]Rankings!$B:$H,7,FALSE),\"\"),0)","v":0},{"$f":"IF($C17>0,VLOOKUP($C17,[1]Μητρώο!$A:$F,4,FALSE),\"\")","v":""}]
[11,11,null,{"$f":"IF($C18>0,VLOOKUP($C18,[1]Μητρώο!$A:$F,3,FALSE),\"\")","v":""},{"$f":"IF($C18>0,VLOOKUP($C18,[1]Μητρώο!$A:$F,5,FALSE),\"\")","v":""},{"$f":"IF(COUNTIF([1]Rankings!$B:$B,RIGHT($I18,2)&\"-\"&$C18)>0,IF($C18>0,VLOOKUP(RIGHT($I18,2)&\"-\"&$C18,[1]Rankings!$B:$H,7,FALSE),\"\"),0)","v":0},{"$f":"IF($C18>0,VLOOKUP($C18,[1]Μητρώο!$A:$F,4,FALSE),\"\")","v":""}]
[12,12,null,{"$f":"IF($C19>0,VLOOKUP($C19,[1]Μητρώο!$A:$F,3,FALSE),\"\")","v":""},{"$f":"IF($C19>0,VLOOKUP($C19,[1]Μητρώο!$A:$F,5,FALSE),\"\")","v":""},{"$f":"IF(COUNTIF([1]Rankings!$B:$B,RIGHT($I19,2)&\"-\"&$C19)>0,IF($C19>0,VLOOKUP(RIGHT($I19,2)&\"-\"&$C19,[1]Rankings!$B:$H,7,FALSE),\"\"),0)","v":0},{"$f":"IF($C19>0,VLOOKUP($C19,[1]Μητρώο!$A:$F,4,FALSE),\"\")","v":""}]
[13,13,null,{"$f":"IF($C20>0,VLOOKUP($C20,[1]Μητρώο!$A:$F,3,FALSE),\"\")","v":""},{"$f":"IF($C20>0,VLOOKUP($C20,[1]Μητρώο!$A:$F,5,FALSE),\"\")","v":""},{"$f":"IF(COUNTIF([1]Rankings!$B:$B,RIGHT($I20,2)&\"-\"&$C20)>0,IF($C20>0,VLOOKUP(RIGHT($I20,2)&\"-\"&$C20,[1]Rankings!$B:$H,7,FALSE),\"\"),0)","v":0},{"$f":"IF($C20>0,VLOOKUP($C20,[1]Μητρώο!$A:$F,4,FALSE),\"\")","v":""}]
[14,14,null,{"$f":"IF($C21>0,VLOOKUP($C21,[1]Μητρώο!$A:$F,3,FALSE),\"\")","v":""},{"$f":"IF($C21>0,VLOOKUP($C21,[1]Μητρώο!$A:$F,5,FALSE),\"\")","v":""},{"$f":"IF(COUNTIF([1]Rankings!$B:$B,RIGHT($I21,2)&\"-\"&$C21)>0,IF($C21>0,VLOOKUP(RIGHT($I21,2)&\"-\"&$C21,[1]Rankings!$B:$H,7,FALSE),\"\"),0)","v":0},{"$f":"IF($C21>0,VLOOKUP($C21,[1]Μητρώο!$A:$F,4,FALSE),\"\")","v":""}]
[15,15,null,{"$f":"IF($C22>0,VLOOKUP($C22,[1]Μητρώο!$A:$F,3,FALSE),\"\")","v":""},{"$f":"IF($C22>0,VLOOKUP($C22,[1]Μητρώο!$A:$F,5,FALSE),\"\")","v":""},{"$f":"IF(COUNTIF([1]Rankings!$B:$B,RIGHT($I22,2)&\"-\"&$C22)>0,IF($C22>0,VLOOKUP(RIGHT($I22,2)&\"-\"&$C22,[1]Rankings!$B:$H,7,FALSE),\"\"),0)","v":0},{"$f":"IF($C22>0,VLOOKUP($C22,[1]Μητρώο!$A:$F,4,FALSE),\"\")","v":""}]
[16,16,null,{"$f":"IF($C23>0,VLOOKUP($C23,[1]Μητρώο!$A:$F,3,FALSE),\"\")","v":""},{"$f":"IF($C23>0,VLOOKUP($C23,[1]Μητρώο!$A:$F,5,FALSE),\"\")","v":""},{"$f":"IF(COUNTIF([1]Rankings!$B:$B,RIGHT($I23,2)&\"-\"&$C23)>0,IF($C23>0,VLOOKUP(RIGHT($I23,2)&\"-\"&$C23,[1]Rankings!$B:$H,7,FALSE),\"\"),0)","v":0},{"$f":"IF($C23>0,VLOOKUP($C23,[1]Μητρώο!$A:$F,4,FALSE),\"\")","v":""}]
[17,17,null,{"$f":"IF($C24>0,VLOOKUP($C24,[1]Μητρώο!$A:$F,3,FALSE),\"\")","v":""},{"$f":"IF($C24>0,VLOOKUP($C24,[1]Μητρώο!$A:$F,5,FALSE),\"\")","v":""},{"$f":"IF(COUNTIF([1]Rankings!$B:$B,RIGHT($I24,2)&\"-\"&$C24)>0,IF($C24>0,VLOOKUP(RIGHT($I24,2)&\"-\"&$C24,[1]Rankings!$B:$H,7,FALSE),\"\"),0)","v":0},{"$f":"IF($C24>0,VLOOKUP($C24,[1]Μητρώο!$A:$F,4,FALSE),\"\")","v":""}]
[18,18,null,{"$f":"IF($C25>0,VLOOKUP($C25,[1]Μητρώο!$A:$F,3,FALSE),\"\")","v":""},{"$f":"IF($C25>0,VLOOKUP($C25,[1]Μητρώο!$A:$F,5,FALSE),\"\")","v":""},{"$f":"IF(COUNTIF([1]Rankings!$B:$B,RIGHT($I25,2)&\"-\"&$C25)>0,IF($C25>0,VLOOKUP(RIGHT($I25,2)&\"-\"&$C25,[1]Rankings!$B:$H,7,FALSE),\"\"),0)","v":0},{"$f":"IF($C25>0,VLOOKUP($C25,[1]Μητρώο!$A:$F,4,FALSE),\"\")","v":""}]
[19,19,null,{"$f":"IF($C26>0,VLOOKUP($C26,[1]Μητρώο!$A:$F,3,FALSE),\"\")","v":""},{"$f":"IF($C26>0,VLOOKUP($C26,[1]Μητρώο!$A:$F,5,FALSE),\"\")","v":""},{"$f":"IF(COUNTIF([1]Rankings!$B:$B,RIGHT($I26,2)&\"-\"&$C26)>0,IF($C26>0,VLOOKUP(RIGHT($I26,2)&\"-\"&$C26,[1]Rankings!$B:$H,7,FALSE),\"\"),0)","v":0},{"$f":"IF($C26>0,VLOOKUP($C26,[1]Μητρώο!$A:$F,4,FALSE),\"\")","v":""}]
[20,20,null,{"$f":"IF($C27>0,VLOOKUP($C27,[1]Μητρώο!$A:$F,3,FALSE),\"\")","v":""},{"$f":"IF($C27>0,VLOOKUP($C27,[1]Μητρώο!$A:$F,5,FALSE),\"\")","v":""},{"$f":"IF(COUNTIF([1]Rankings!$B:$B,RIGHT($I27,2)&\"-\"&$C27)>0,IF($C27>0,VLOOKUP(RIGHT($I27,2)&\"-\"&$C27,[1]Rankings!$B:$H,7,FALSE),\"\"),0)","v":0},{"$f":"IF($C27>0,VLOOKUP($C27,[1]Μητρώο!$A:$F,4,FALSE),\"\")","v":""}]
[21,21,null,{"$f":"IF($C28>0,VLOOKUP($C28,[1]Μητρώο!$A:$F,3,FALSE),\"\")","v":""},{"$f":"IF($C28>0,VLOOKUP($C28,[1]Μητρώο!$A:$F,5,FALSE),\"\")","v":""},{"$f":"IF(COUNTIF([1]Rankings!$B:$B,RIGHT($I28,2)&\"-\"&$C28)>0,IF($C28>0,VLOOKUP(RIGHT($I28,2)&\"-\"&$C28,[1]Rankings!$B:$H,7,FALSE),\"\"),0)","v":0},{"$f":"IF($C28>0,VLOOKUP($C28,[1]Μητρώο!$A:$F,4,FALSE),\"\")","v":""}]
[22,22,null,{"$f":"IF($C29>0,VLOOKUP($C29,[1]Μητρώο!$A:$F,3,FALSE),\"\")","v":""},{"$f":"IF($C29>0,VLOOKUP($C29,[1]Μητρώο!$A:$F,5,FALSE),\"\")","v":""},{"$f":"IF(COUNTIF([1]Rankings!$B:$B,RIGHT($I29,2)&\"-\"&$C29)>0,IF($C29>0,VLOOKUP(RIGHT($I29,2)&\"-\"&$C29,[1]Rankings!$B:$H,7,FALSE),\"\"),0)","v":0},{"$f":"IF($C29>0,VLOOKUP($C29,[1]Μητρώο!$A:$F,4,FALSE),\"\")","v":""}]
[23,23,null,{"$f":"IF($C30>0,VLOOKUP($C30,[1]Μητρώο!$A:$F,3,FALSE),\"\")","v":""},{"$f":"IF($C30>0,VLOOKUP($C30,[1]Μητρώο!$A:$F,5,FALSE),\"\")","v":""},{"$f":"IF(COUNTIF([1]Rankings!$B:$B,RIGHT($I30,2)&\"-\"&$C30)>0,IF($C30>0,VLOOKUP(RIGHT($I30,2)&\"-\"&$C30,[1]Rankings!$B:$H,7,FALSE),\"\"),0)","v":0},{"$f":"IF($C30>0,VLOOKUP($C30,[1]Μητρώο!$A:$F,4,FALSE),\"\")","v":""}]
[24,24,null,{"$f":"IF($C31>0,VLOOKUP($C31,[1]Μητρώο!$A:$F,3,FALSE),\"\")","v":""},{"$f":"IF($C31>0,VLOOKUP($C31,[1]Μητρώο!$A:$F,5,FALSE),\"\")","v":""},{"$f":"IF(COUNTIF([1]Rankings!$B:$B,RIGHT($I31,2)&\"-\"&$C31)>0,IF($C31>0,VLOOKUP(RIGHT($I31,2)&\"-\"&$C31,[1]Rankings!$B:$H,7,FALSE),\"\"),0)","v":0},{"$f":"IF($C31>0,VLOOKUP($C31,[1]Μητρώο!$A:$F,4,FALSE),\"\")","v":""}]
[25,25,null,{"$f":"IF($C32>0,VLOOKUP($C32,[1]Μητρώο!$A:$F,3,FALSE),\"\")","v":""},{"$f":"IF($C32>0,VLOOKUP($C32,[1]Μητρώο!$A:$F,5,FALSE),\"\")","v":""},{"$f":"IF(COUNTIF([1]Rankings!$B:$B,RIGHT($I32,2)&\"-\"&$C32)>0,IF($C32>0,VLOOKUP(RIGHT($I32,2)&\"-\"&$C32,[1]Rankings!$B:$H,7,FALSE),\"\"),0)","v":0},{"$f":"IF($C32>0,VLOOKUP($C32,[1]Μητρώο!$A:$F,4,FALSE),\"\")","v":""}]
[26,26,null,{"$f":"IF($C33>0,VLOOKUP($C33,[1]Μητρώο!$A:$F,3,FALSE),\"\")","v":""},{"$f":"IF($C33>0,VLOOKUP($C33,[1]Μητρώο!$A:$F,5,FALSE),\"\")","v":""},{"$f":"IF(COUNTIF([1]Rankings!$B:$B,RIGHT($I33,2)&\"-\"&$C33)>0,IF($C33>0,VLOOKUP(RIGHT($I33,2)&\"-\"&$C33,[1]Rankings!$B:$H,7,FALSE),\"\"),0)","v":0},{"$f":"IF($C33>0,VLOOKUP($C33,[1]Μητρώο!$A:$F,4,FALSE),\"\")","v":""}]
[27,27,null,{"$f":"IF($C34>0,VLOOKUP($C34,[1]Μητρώο!$A:$F,3,FALSE),\"\")","v":""},{"$f":"IF($C34>0,VLOOKUP($C34,[1]Μητρώο!$A:$F,5,FALSE),\"\")","v":""},{"$f":"IF(COUNTIF([1]Rankings!$B:$B,RIGHT($I34,2)&\"-\"&$C34)>0,IF($C34>0,VLOOKUP(RIGHT($I34,2)&\"-\"&$C34,[1]Rankings!$B:$H,7,FALSE),\"\"),0)","v":0},{"$f":"IF($C34>0,VLOOKUP($C34,[1]Μητρώο!$A:$F,4,FALSE),\"\")","v":""}]
[28,28,null,{"$f":"IF($C35>0,VLOOKUP($C35,[1]Μητρώο!$A:$F,3,FALSE),\"\")","v":""},{"$f":"IF($C35>0,VLOOKUP($C35,[1]Μητρώο!$A:$F,5,FALSE),\"\")","v":""},{"$f":"IF(COUNTIF([1]Rankings!$B:$B,RIGHT($I35,2)&\"-\"&$C35)>0,IF($C35>0,VLOOKUP(RIGHT($I35,2)&\"-\"&$C35,[1]Rankings!$B:$H,7,FALSE),\"\"),0)","v":0},{"$f":"IF($C35>0,VLOOKUP($C35,[1]Μητρώο!$A:$F,4,FALSE),\"\")","v":""}]
[29,29,null,{"$f":"IF($C36>0,VLOOKUP($C36,[1]Μητρώο!$A:$F,3,FALSE),\"\")","v":""},{"$f":"IF($C36>0,VLOOKUP($C36,[1]Μητρώο!$A:$F,5,FALSE),\"\")","v":""},{"$f":"IF(COUNTIF([1]Rankings!$B:$B,RIGHT($I36,2)&\"-\"&$C36)>0,IF($C36>0,VLOOKUP(RIGHT($I36,2)&\"-\"&$C36,[1]Rankings!$B:$H,7,FALSE),\"\"),0)","v":0},{"$f":"IF($C36>0,VLOOKUP($C36,[1]Μητρώο!$A:$F,4,FALSE),\"\")","v":""}]
[30,30,null,{"$f":"IF($C37>0,VLOOKUP($C37,[1]Μητρώο!$A:$F,3,FALSE),\"\")","v":""},{"$f":"IF($C37>0,VLOOKUP($C37,[1]Μητρώο!$A:$F,5,FALSE),\"\")","v":""},{"$f":"IF(COUNTIF([1]Rankings!$B:$B,RIGHT($I37,2)&\"-\"&$C37)>0,IF($C37>0,VLOOKUP(RIGHT($I37,2)&\"-\"&$C37,[1]Rankings!$B:$H,7,FALSE),\"\"),0)","v":0},{"$f":"IF($C37>0,VLOOKUP($C37,[1]Μητρώο!$A:$F,4,FALSE),\"\")","v":""}]
[31,31,null,{"$f":"IF($C38>0,VLOOKUP($C38,[1]Μητρώο!$A:$F,3,FALSE),\"\")","v":""},{"$f":"IF($C38>0,VLOOKUP($C38,[1]Μητρώο!$A:$F,5,FALSE),\"\")","v":""},{"$f":"IF(COUNTIF([1]Rankings!$B:$B,RIGHT($I38,2)&\"-\"&$C38)>0,IF($C38>0,VLOOKUP(RIGHT($I38,2)&\"-\"&$C38,[1]Rankings!$B:$H,7,FALSE),\"\"),0)","v":0},{"$f":"IF($C38>0,VLOOKUP($C38,[1]Μητρώο!$A:$F,4,FALSE),\"\")","v":""}]
[32,32,null,{"$f":"IF($C39>0,VLOOKUP($C39,[1]Μητρώο!$A:$F,3,FALSE),\"\")","v":""},{"$f":"IF($C39>0,VLOOKUP($C39,[1]Μητρώο!$A:$F,5,FALSE),\"\")","v":""},{"$f":"IF(COUNTIF([1]Rankings!$B:$B,RIGHT($I39,2)&\"-\"&$C39)>0,IF($C39>0,VLOOKUP(RIGHT($I39,2)&\"-\"&$C39,[1]Rankings!$B:$H,7,FALSE),\"\"),0)","v":0},{"$f":"IF($C39>0,VLOOKUP($C39,[1]Μητρώο!$A:$F,4,FALSE),\"\")","v":""}]
[33,33,null,{"$f":"IF($C40>0,VLOOKUP($C40,[1]Μητρώο!$A:$F,3,FALSE),\"\")","v":""},{"$f":"IF($C40>0,VLOOKUP($C40,[1]Μητρώο!$A:$F,5,FALSE),\"\")","v":""},{"$f":"IF(COUNTIF([1]Rankings!$B:$B,RIGHT($I40,2)&\"-\"&$C40)>0,IF($C40>0,VLOOKUP(RIGHT($I40,2)&\"-\"&$C40,[1]Rankings!$B:$H,7,FALSE),\"\"),0)","v":0},{"$f":"IF($C40>0,VLOOKUP($C40,[1]Μητρώο!$A:$F,4,FALSE),\"\")","v":""}]
[34,34,null,{"$f":"IF($C41>0,VLOOKUP($C41,[1]Μητρώο!$A:$F,3,FALSE),\"\")","v":""},{"$f":"IF($C41>0,VLOOKUP($C41,[1]Μητρώο!$A:$F,5,FALSE),\"\")","v":""},{"$f":"IF(COUNTIF([1]Rankings!$B:$B,RIGHT($I41,2)&\"-\"&$C41)>0,IF($C41>0,VLOOKUP(RIGHT($I41,2)&\"-\"&$C41,[1]Rankings!$B:$H,7,FALSE),\"\"),0)","v":0},{"$f":"IF($C41>0,VLOOKUP($C41,[1]Μητρώο!$A:$F,4,FALSE),\"\")","v":""}]
[35,35,null,{"$f":"IF($C42>0,VLOOKUP($C42,[1]Μητρώο!$A:$F,3,FALSE),\"\")","v":""},{"$f":"IF($C42>0,VLOOKUP($C42,[1]Μητρώο!$A:$F,5,FALSE),\"\")","v":""},{"$f":"IF(COUNTIF([1]Rankings!$B:$B,RIGHT($I42,2)&\"-\"&$C42)>0,IF($C42>0,VLOOKUP(RIGHT($I42,2)&\"-\"&$C42,[1]Rankings!$B:$H,7,FALSE),\"\"),0)","v":0},{"$f":"IF($C42>0,VLOOKUP($C42,[1]Μητρώο!$A:$F,4,FALSE),\"\")","v":""}]
[36,36,null,{"$f":"IF($C43>0,VLOOKUP($C43,[1]Μητρώο!$A:$F,3,FALSE),\"\")","v":""},{"$f":"IF($C43>0,VLOOKUP($C43,[1]Μητρώο!$A:$F,5,FALSE),\"\")","v":""},{"$f":"IF(COUNTIF([1]Rankings!$B:$B,RIGHT($I43,2)&\"-\"&$C43)>0,IF($C43>0,VLOOKUP(RIGHT($I43,2)&\"-\"&$C43,[1]Rankings!$B:$H,7,FALSE),\"\"),0)","v":0},{"$f":"IF($C43>0,VLOOKUP($C43,[1]Μητρώο!$A:$F,4,FALSE),\"\")","v":""}]
[37,37,null,{"$f":"IF($C44>0,VLOOKUP($C44,[1]Μητρώο!$A:$F,3,FALSE),\"\")","v":""},{"$f":"IF($C44>0,VLOOKUP($C44,[1]Μητρώο!$A:$F,5,FALSE),\"\")","v":""},{"$f":"IF(COUNTIF([1]Rankings!$B:$B,RIGHT($I44,2)&\"-\"&$C44)>0,IF($C44>0,VLOOKUP(RIGHT($I44,2)&\"-\"&$C44,[1]Rankings!$B:$H,7,FALSE),\"\"),0)","v":0},{"$f":"IF($C44>0,VLOOKUP($C44,[1]Μητρώο!$A:$F,4,FALSE),\"\")","v":""}]
[38,38,null,{"$f":"IF($C45>0,VLOOKUP($C45,[1]Μητρώο!$A:$F,3,FALSE),\"\")","v":""},{"$f":"IF($C45>0,VLOOKUP($C45,[1]Μητρώο!$A:$F,5,FALSE),\"\")","v":""},{"$f":"IF(COUNTIF([1]Rankings!$B:$B,RIGHT($I45,2)&\"-\"&$C45)>0,IF($C45>0,VLOOKUP(RIGHT($I45,2)&\"-\"&$C45,[1]Rankings!$B:$H,7,FALSE),\"\"),0)","v":0},{"$f":"IF($C45>0,VLOOKUP($C45,[1]Μητρώο!$A:$F,4,FALSE),\"\")","v":""}]
[39,39,null,{"$f":"IF($C46>0,VLOOKUP($C46,[1]Μητρώο!$A:$F,3,FALSE),\"\")","v":""},{"$f":"IF($C46>0,VLOOKUP($C46,[1]Μητρώο!$A:$F,5,FALSE),\"\")","v":""},{"$f":"IF(COUNTIF([1]Rankings!$B:$B,RIGHT($I46,2)&\"-\"&$C46)>0,IF($C46>0,VLOOKUP(RIGHT($I46,2)&\"-\"&$C46,[1]Rankings!$B:$H,7,FALSE),\"\"),0)","v":0},{"$f":"IF($C46>0,VLOOKUP($C46,[1]Μητρώο!$A:$F,4,FALSE),\"\")","v":""}]
[40,40,null,{"$f":"IF($C47>0,VLOOKUP($C47,[1]Μητρώο!$A:$F,3,FALSE),\"\")","v":""},{"$f":"IF($C47>0,VLOOKUP($C47,[1]Μητρώο!$A:$F,5,FALSE),\"\")","v":""},{"$f":"IF(COUNTIF([1]Rankings!$B:$B,RIGHT($I47,2)&\"-\"&$C47)>0,IF($C47>0,VLOOKUP(RIGHT($I47,2)&\"-\"&$C47,[1]Rankings!$B:$H,7,FALSE),\"\"),0)","v":0},{"$f":"IF($C47>0,VLOOKUP($C47,[1]Μητρώο!$A:$F,4,FALSE),\"\")","v":""}]
[41,41,null,{"$f":"IF($C48>0,VLOOKUP($C48,[1]Μητρώο!$A:$F,3,FALSE),\"\")","v":""},{"$f":"IF($C48>0,VLOOKUP($C48,[1]Μητρώο!$A:$F,5,FALSE),\"\")","v":""},{"$f":"IF(COUNTIF([1]Rankings!$B:$B,RIGHT($I48,2)&\"-\"&$C48)>0,IF($C48>0,VLOOKUP(RIGHT($I48,2)&\"-\"&$C48,[1]Rankings!$B:$H,7,FALSE),\"\"),0)","v":0},{"$f":"IF($C48>0,VLOOKUP($C48,[1]Μητρώο!$A:$F,4,FALSE),\"\")","v":""}]
[42,42,null,{"$f":"IF($C49>0,VLOOKUP($C49,[1]Μητρώο!$A:$F,3,FALSE),\"\")","v":""},{"$f":"IF($C49>0,VLOOKUP($C49,[1]Μητρώο!$A:$F,5,FALSE),\"\")","v":""},{"$f":"IF(COUNTIF([1]Rankings!$B:$B,RIGHT($I49,2)&\"-\"&$C49)>0,IF($C49>0,VLOOKUP(RIGHT($I49,2)&\"-\"&$C49,[1]Rankings!$B:$H,7,FALSE),\"\"),0)","v":0},{"$f":"IF($C49>0,VLOOKUP($C49,[1]Μητρώο!$A:$F,4,FALSE),\"\")","v":""}]
[43,43,null,{"$f":"IF($C50>0,VLOOKUP($C50,[1]Μητρώο!$A:$F,3,FALSE),\"\")","v":""},{"$f":"IF($C50>0,VLOOKUP($C50,[1]Μητρώο!$A:$F,5,FALSE),\"\")","v":""},{"$f":"IF(COUNTIF([1]Rankings!$B:$B,RIGHT($I50,2)&\"-\"&$C50)>0,IF($C50>0,VLOOKUP(RIGHT($I50,2)&\"-\"&$C50,[1]Rankings!$B:$H,7,FALSE),\"\"),0)","v":0},{"$f":"IF($C50>0,VLOOKUP($C50,[1]Μητρώο!$A:$F,4,FALSE),\"\")","v":""}]
[44,44,null,{"$f":"IF($C51>0,VLOOKUP($C51,[1]Μητρώο!$A:$F,3,FALSE),\"\")","v":""},{"$f":"IF($C51>0,VLOOKUP($C51,[1]Μητρώο!$A:$F,5,FALSE),\"\")","v":""},{"$f":"IF(COUNTIF([1]Rankings!$B:$B,RIGHT($I51,2)&\"-\"&$C51)>0,IF($C51>0,VLOOKUP(RIGHT($I51,2)&\"-\"&$C51,[1]Rankings!$B:$H,7,FALSE),\"\"),0)","v":0},{"$f":"IF($C51>0,VLOOKUP($C51,[1]Μητρώο!$A:$F,4,FALSE),\"\")","v":""}]
[45,45,null,{"$f":"IF($C52>0,VLOOKUP($C52,[1]Μητρώο!$A:$F,3,FALSE),\"\")","v":""},{"$f":"IF($C52>0,VLOOKUP($C52,[1]Μητρώο!$A:$F,5,FALSE),\"\")","v":""},{"$f":"IF(COUNTIF([1]Rankings!$B:$B,RIGHT($I52,2)&\"-\"&$C52)>0,IF($C52>0,VLOOKUP(RIGHT($I52,2)&\"-\"&$C52,[1]Rankings!$B:$H,7,FALSE),\"\"),0)","v":0},{"$f":"IF($C52>0,VLOOKUP($C52,[1]Μητρώο!$A:$F,4,FALSE),\"\")","v":""}]
[46,46,null,{"$f":"IF($C53>0,VLOOKUP($C53,[1]Μητρώο!$A:$F,3,FALSE),\"\")","v":""},{"$f":"IF($C53>0,VLOOKUP($C53,[1]Μητρώο!$A:$F,5,FALSE),\"\")","v":""},{"$f":"IF(COUNTIF([1]Rankings!$B:$B,RIGHT($I53,2)&\"-\"&$C53)>0,IF($C53>0,VLOOKUP(RIGHT($I53,2)&\"-\"&$C53,[1]Rankings!$B:$H,7,FALSE),\"\"),0)","v":0},{"$f":"IF($C53>0,VLOOKUP($C53,[1]Μητρώο!$A:$F,4,FALSE),\"\")","v":""}]
[47,47,null,{"$f":"IF($C54>0,VLOOKUP($C54,[1]Μητρώο!$A:$F,3,FALSE),\"\")","v":""},{"$f":"IF($C54>0,VLOOKUP($C54,[1]Μητρώο!$A:$F,5,FALSE),\"\")","v":""},{"$f":"IF(COUNTIF([1]Rankings!$B:$B,RIGHT($I54,2)&\"-\"&$C54)>0,IF($C54>0,VLOOKUP(RIGHT($I54,2)&\"-\"&$C54,[1]Rankings!$B:$H,7,FALSE),\"\"),0)","v":0},{"$f":"IF($C54>0,VLOOKUP($C54,[1]Μητρώο!$A:$F,4,FALSE),\"\")","v":""}]
[48,48,null,{"$f":"IF($C55>0,VLOOKUP($C55,[1]Μητρώο!$A:$F,3,FALSE),\"\")","v":""},{"$f":"IF($C55>0,VLOOKUP($C55,[1]Μητρώο!$A:$F,5,FALSE),\"\")","v":""},{"$f":"IF(COUNTIF([1]Rankings!$B:$B,RIGHT($I55,2)&\"-\"&$C55)>0,IF($C55>0,VLOOKUP(RIGHT($I55,2)&\"-\"&$C55,[1]Rankings!$B:$H,7,FALSE),\"\"),0)","v":0},{"$f":"IF($C55>0,VLOOKUP($C55,[1]Μητρώο!$A:$F,4,FALSE),\"\")","v":""}]
[49,49,null,{"$f":"IF($C56>0,VLOOKUP($C56,[1]Μητρώο!$A:$F,3,FALSE),\"\")","v":""},{"$f":"IF($C56>0,VLOOKUP($C56,[1]Μητρώο!$A:$F,5,FALSE),\"\")","v":""},{"$f":"IF(COUNTIF([1]Rankings!$B:$B,RIGHT($I56,2)&\"-\"&$C56)>0,IF($C56>0,VLOOKUP(RIGHT($I56,2)&\"-\"&$C56,[1]Rankings!$B:$H,7,FALSE),\"\"),0)","v":0},{"$f":"IF($C56>0,VLOOKUP($C56,[1]Μητρώο!$A:$F,4,FALSE),\"\")","v":""}]
[50,50,null,{"$f":"IF($C57>0,VLOOKUP($C57,[1]Μητρώο!$A:$F,3,FALSE),\"\")","v":""},{"$f":"IF($C57>0,VLOOKUP($C57,[1]Μητρώο!$A:$F,5,FALSE),\"\")","v":""},{"$f":"IF(COUNTIF([1]Rankings!$B:$B,RIGHT($I57,2)&\"-\"&$C57)>0,IF($C57>0,VLOOKUP(RIGHT($I57,2)&\"-\"&$C57,[1]Rankings!$B:$H,7,FALSE),\"\"),0)","v":0},{"$f":"IF($C57>0,VLOOKUP($C57,[1]Μητρώο!$A:$F,4,FALSE),\"\")","v":""}]
[51,51,null,{"$f":"IF($C58>0,VLOOKUP($C58,[1]Μητρώο!$A:$F,3,FALSE),\"\")","v":""},{"$f":"IF($C58>0,VLOOKUP($C58,[1]Μητρώο!$A:$F,5,FALSE),\"\")","v":""},{"$f":"IF(COUNTIF([1]Rankings!$B:$B,RIGHT($I58,2)&\"-\"&$C58)>0,IF($C58>0,VLOOKUP(RIGHT($I58,2)&\"-\"&$C58,[1]Rankings!$B:$H,7,FALSE),\"\"),0)","v":0},{"$f":"IF($C58>0,VLOOKUP($C58,[1]Μητρώο!$A:$F,4,FALSE),\"\")","v":""}]
[52,52,null,{"$f":"IF($C59>0,VLOOKUP($C59,[1]Μητρώο!$A:$F,3,FALSE),\"\")","v":""},{"$f":"IF($C59>0,VLOOKUP($C59,[1]Μητρώο!$A:$F,5,FALSE),\"\")","v":""},{"$f":"IF(COUNTIF([1]Rankings!$B:$B,RIGHT($I59,2)&\"-\"&$C59)>0,IF($C59>0,VLOOKUP(RIGHT($I59,2)&\"-\"&$C59,[1]Rankings!$B:$H,7,FALSE),\"\"),0)","v":0},{"$f":"IF($C59>0,VLOOKUP($C59,[1]Μητρώο!$A:$F,4,FALSE),\"\")","v":""}]
[53,53,null,{"$f":"IF($C60>0,VLOOKUP($C60,[1]Μητρώο!$A:$F,3,FALSE),\"\")","v":""},{"$f":"IF($C60>0,VLOOKUP($C60,[1]Μητρώο!$A:$F,5,FALSE),\"\")","v":""},{"$f":"IF(COUNTIF([1]Rankings!$B:$B,RIGHT($I60,2)&\"-\"&$C60)>0,IF($C60>0,VLOOKUP(RIGHT($I60,2)&\"-\"&$C60,[1]Rankings!$B:$H,7,FALSE),\"\"),0)","v":0},{"$f":"IF($C60>0,VLOOKUP($C60,[1]Μητρώο!$A:$F,4,FALSE),\"\")","v":""}]
{"$rows_left_out":547}